Sat Mar 22 23:24:13 UTC 2025  I: starting to build muon-meson/unstable/i386 on jenkins on '2025-03-22 23:23'
Sat Mar 22 23:24:13 UTC 2025  I: The jenkins build log is/was available at https://jenkins.debian.net/userContent/reproducible/debian/build_service/i386_7/61686/console.log
Sat Mar 22 23:24:13 UTC 2025  I: Downloading source for unstable/muon-meson=0.4.0-1
--2025-03-22 23:24:13--  http://deb.debian.org/debian/pool/main/m/muon-meson/muon-meson_0.4.0-1.dsc
Connecting to 46.16.76.132:3128... connected.
Proxy request sent, awaiting response... 200 OK
Length: 1635 (1.6K) [text/prs.lines.tag]
Saving to: ‘muon-meson_0.4.0-1.dsc’

     0K .                                                     100%  241M=0s

2025-03-22 23:24:13 (241 MB/s) - ‘muon-meson_0.4.0-1.dsc’ saved [1635/1635]

Sat Mar 22 23:24:13 UTC 2025  I: muon-meson_0.4.0-1.dsc
-----BEGIN PGP SIGNED MESSAGE-----
Hash: SHA512

Format: 3.0 (quilt)
Source: muon-meson
Binary: muon-meson
Architecture: any
Version: 0.4.0-1
Maintainer: Andrea Pappacoda <tachi@debian.org>
Homepage: https://muon.build
Standards-Version: 4.7.0
Vcs-Browser: https://salsa.debian.org/debian/muon-meson
Vcs-Git: https://salsa.debian.org/debian/muon-meson.git
Testsuite: autopkgtest
Testsuite-Triggers: @builddeps@
Build-Depends: debhelper-compat (= 13), dpkg-build-api (= 1)
Build-Depends-Arch: git <!nocheck>, libarchive-dev, libcurl4-openssl-dev | libcurl-dev, libpkgconf-dev, ninja-build, pkg-config, python3-yaml:native <!nodoc>, python3:native <!nocheck> <!nodoc>, scdoc <!nodoc>
Package-List:
 muon-meson deb devel optional arch=any
Checksums-Sha1:
 7ea6d02b7f61032493256a7f61f63b85225e8cc2 3435753 muon-meson_0.4.0.orig.tar.gz
 15043fdd1bc6cb60c188807133c1ba6ff3afa9cd 13712 muon-meson_0.4.0-1.debian.tar.xz
Checksums-Sha256:
 9121f2521fb5037a87a922573b7fd886f0c4e7eb17696dd80901d810b9b56609 3435753 muon-meson_0.4.0.orig.tar.gz
 2e8230d942163862cce4c6237c62ec5d81bc46cb00be034d3d86543363f293f6 13712 muon-meson_0.4.0-1.debian.tar.xz
Files:
 058215462aface63252f9a89ae65bac3 3435753 muon-meson_0.4.0.orig.tar.gz
 3c01b5af787a170af43af07902ea2b0e 13712 muon-meson_0.4.0-1.debian.tar.xz
Dgit: eb4023e8c867b0a3bca0078ac7f1822091a76aaf debian archive/debian/0.4.0-1 https://git.dgit.debian.org/muon-meson


-----BEGIN PGP SIGNATURE-----

iHUEARYKAB0WIQS6VuNIvZRFHt7JcAdKkgiiRVB3pwUCZ94IrAAKCRBKkgiiRVB3
p8zuAP9cPaqR9P5hcUvTsMqMy3ryC28Vgn5BdvEBa3oRAdHSbgEAphk9d4QN0ufR
V7h4q+xUcY8U/PLFZAohllFzmTB35QU=
=EPy1
-----END PGP SIGNATURE-----
Sat Mar 22 23:24:13 UTC 2025  I: Checking whether the package is not for us
Sat Mar 22 23:24:13 UTC 2025  I: Starting 1st build on remote node ionos12-i386.debian.net.
Sat Mar 22 23:24:13 UTC 2025  I: Preparing to do remote build '1' on ionos12-i386.debian.net.
Sat Mar 22 23:26:18 UTC 2025  I: Deleting $TMPDIR on ionos12-i386.debian.net.
I: pbuilder: network access will be disabled during build
I: Current time: Sat Mar 22 11:24:15 -12 2025
I: pbuilder-time-stamp: 1742685855
I: Building the build Environment
I: extracting base tarball [/var/cache/pbuilder/unstable-reproducible-base.tgz]
I: copying local configuration
W: --override-config is not set; not updating apt.conf Read the manpage for details.
I: mounting /proc filesystem
I: mounting /sys filesystem
I: creating /{dev,run}/shm
I: mounting /dev/pts filesystem
I: redirecting /dev/ptmx to /dev/pts/ptmx
I: policy-rc.d already exists
I: using eatmydata during job
I: Copying source file
I: copying [muon-meson_0.4.0-1.dsc]
I: copying [./muon-meson_0.4.0.orig.tar.gz]
I: copying [./muon-meson_0.4.0-1.debian.tar.xz]
I: Extracting source
dpkg-source: warning: cannot verify inline signature for ./muon-meson_0.4.0-1.dsc: unsupported subcommand
dpkg-source: info: extracting muon-meson in muon-meson-0.4.0
dpkg-source: info: unpacking muon-meson_0.4.0.orig.tar.gz
dpkg-source: info: unpacking muon-meson_0.4.0-1.debian.tar.xz
dpkg-source: info: using patch list from debian/patches/series
dpkg-source: info: applying 0001-Increase-test-timeout.patch
dpkg-source: info: applying 0002-Never-use-git.patch
dpkg-source: info: applying 0003-Make-meson_reference.3-generation-reproducible.patch
dpkg-source: info: applying 0004-Fix-has_function-test-on-hurd.patch
dpkg-source: info: applying 0005-fix-bestline.patch
dpkg-source: info: applying 0006-subprojects-remove-meson-tests-and-meson-docs-wraps.patch
dpkg-source: info: applying 0007-meson.build-build-manpage-without-building-the-websi.patch
I: Not using root during the build.
I: Installing the build-deps
I: user script /srv/workspace/pbuilder/39193/tmp/hooks/D02_print_environment starting
I: set
  BUILDDIR='/build/reproducible-path'
  BUILDUSERGECOS='first user,first room,first work-phone,first home-phone,first other'
  BUILDUSERNAME='pbuilder1'
  BUILD_ARCH='i386'
  DEBIAN_FRONTEND='noninteractive'
  DEB_BUILD_OPTIONS='buildinfo=+all reproducible=+all parallel=11 '
  DISTRIBUTION='unstable'
  HOME='/root'
  HOST_ARCH='i386'
  IFS=' 	
  '
  INVOCATION_ID='0ee206a548354157a00e5588bc1a7d59'
  LANG='C'
  LANGUAGE='en_US:en'
  LC_ALL='C'
  LD_LIBRARY_PATH='/usr/lib/libeatmydata'
  LD_PRELOAD='libeatmydata.so'
  MAIL='/var/mail/root'
  OPTIND='1'
  PATH='/usr/sbin:/usr/bin:/sbin:/bin:/usr/games'
  PBCURRENTCOMMANDLINEOPERATION='build'
  PBUILDER_OPERATION='build'
  PBUILDER_PKGDATADIR='/usr/share/pbuilder'
  PBUILDER_PKGLIBDIR='/usr/lib/pbuilder'
  PBUILDER_SYSCONFDIR='/etc'
  PPID='39193'
  PS1='# '
  PS2='> '
  PS4='+ '
  PWD='/'
  SHELL='/bin/bash'
  SHLVL='2'
  SUDO_COMMAND='/usr/bin/timeout -k 18.1h 18h /usr/bin/ionice -c 3 /usr/bin/nice /usr/sbin/pbuilder --build --configfile /srv/reproducible-results/rbuild-debian/r-b-build.xtcSzgZK/pbuilderrc_5rqH --distribution unstable --hookdir /etc/pbuilder/first-build-hooks --debbuildopts -b --basetgz /var/cache/pbuilder/unstable-reproducible-base.tgz --buildresult /srv/reproducible-results/rbuild-debian/r-b-build.xtcSzgZK/b1 --logfile b1/build.log muon-meson_0.4.0-1.dsc'
  SUDO_GID='112'
  SUDO_UID='107'
  SUDO_USER='jenkins'
  TERM='unknown'
  TZ='/usr/share/zoneinfo/Etc/GMT+12'
  USER='root'
  _='/usr/bin/systemd-run'
  http_proxy='http://46.16.76.132:3128'
I: uname -a
  Linux ionos12-i386 6.1.0-32-amd64 #1 SMP PREEMPT_DYNAMIC Debian 6.1.129-1 (2025-03-06) x86_64 GNU/Linux
I: ls -l /bin
  lrwxrwxrwx 1 root root 7 Mar  4 11:20 /bin -> usr/bin
I: user script /srv/workspace/pbuilder/39193/tmp/hooks/D02_print_environment finished
 -> Attempting to satisfy build-dependencies
 -> Creating pbuilder-satisfydepends-dummy package
Package: pbuilder-satisfydepends-dummy
Version: 0.invalid.0
Architecture: i386
Maintainer: Debian Pbuilder Team <pbuilder-maint@lists.alioth.debian.org>
Description: Dummy package to satisfy dependencies with aptitude - created by pbuilder
 This package was created automatically by pbuilder to satisfy the
 build-dependencies of the package being currently built.
Depends: debhelper-compat (= 13), dpkg-build-api (= 1), git, libarchive-dev, libcurl4-openssl-dev | libcurl-dev, libpkgconf-dev, ninja-build, pkg-config, python3-yaml:native, python3:native, scdoc
dpkg-deb: building package 'pbuilder-satisfydepends-dummy' in '/tmp/satisfydepends-aptitude/pbuilder-satisfydepends-dummy.deb'.
Selecting previously unselected package pbuilder-satisfydepends-dummy.
(Reading database ... 19793 files and directories currently installed.)
Preparing to unpack .../pbuilder-satisfydepends-dummy.deb ...
Unpacking pbuilder-satisfydepends-dummy (0.invalid.0) ...
dpkg: pbuilder-satisfydepends-dummy: dependency problems, but configuring anyway as you requested:
 pbuilder-satisfydepends-dummy depends on debhelper-compat (= 13); however:
  Package debhelper-compat is not installed.
 pbuilder-satisfydepends-dummy depends on git; however:
  Package git is not installed.
 pbuilder-satisfydepends-dummy depends on libarchive-dev; however:
  Package libarchive-dev is not installed.
 pbuilder-satisfydepends-dummy depends on libcurl4-openssl-dev | libcurl-dev; however:
  Package libcurl4-openssl-dev is not installed.
  Package libcurl-dev is not installed.
 pbuilder-satisfydepends-dummy depends on libpkgconf-dev; however:
  Package libpkgconf-dev is not installed.
 pbuilder-satisfydepends-dummy depends on ninja-build; however:
  Package ninja-build is not installed.
 pbuilder-satisfydepends-dummy depends on pkg-config; however:
  Package pkg-config is not installed.
 pbuilder-satisfydepends-dummy depends on python3-yaml:native.
 pbuilder-satisfydepends-dummy depends on python3:native.
 pbuilder-satisfydepends-dummy depends on scdoc; however:
  Package scdoc is not installed.

Setting up pbuilder-satisfydepends-dummy (0.invalid.0) ...
Reading package lists...
Building dependency tree...
Reading state information...
Initializing package states...
Writing extended state information...
Building tag database...
pbuilder-satisfydepends-dummy is already installed at the requested version (0.invalid.0)
pbuilder-satisfydepends-dummy is already installed at the requested version (0.invalid.0)
The following NEW packages will be installed:
  autoconf{a} automake{a} autopoint{a} autotools-dev{a} bsdextrautils{a} comerr-dev{a} debhelper{a} dh-autoreconf{a} dh-strip-nondeterminism{a} dwz{a} file{a} gettext{a} gettext-base{a} git{a} git-man{a} groff-base{a} icu-devtools{a} intltool-debian{a} krb5-multidev{a} libacl1-dev{a} libarchive-dev{a} libarchive-zip-perl{a} libarchive13t64{a} libattr1-dev{a} libbrotli-dev{a} libbrotli1{a} libbz2-dev{a} libcom-err2{a} libcurl3t64-gnutls{a} libcurl4-openssl-dev{a} libcurl4t64{a} libdebhelper-perl{a} libelf1t64{a} liberror-perl{a} libevent-2.1-7t64{a} libexpat1{a} libext2fs-dev{a} libext2fs2t64{a} libffi8{a} libfile-stripnondeterminism-perl{a} libgmp-dev{a} libgmpxx4ldbl{a} libgnutls-dane0t64{a} libgnutls-openssl27t64{a} libgnutls28-dev{a} libgnutls30t64{a} libgssapi-krb5-2{a} libgssrpc4t64{a} libicu-dev{a} libicu76{a} libidn2-0{a} libidn2-dev{a} libk5crypto3{a} libkadm5clnt-mit12{a} libkadm5srv-mit12{a} libkdb5-10t64{a} libkeyutils1{a} libkrb5-3{a} libkrb5-dev{a} libkrb5support0{a} libldap-dev{a} libldap2{a} liblz4-dev{a} liblzma-dev{a} libmagic-mgc{a} libmagic1t64{a} libnghttp2-14{a} libnghttp2-dev{a} libnghttp3-9{a} libnghttp3-dev{a} libngtcp2-16{a} libngtcp2-crypto-gnutls8{a} libp11-kit-dev{a} libp11-kit0{a} libpipeline1{a} libpkgconf-dev{a} libpkgconf3{a} libpsl-dev{a} libpsl5t64{a} libpython3-stdlib{a} libpython3.13-minimal{a} libpython3.13-stdlib{a} libreadline8t64{a} librtmp-dev{a} librtmp1{a} libsasl2-2{a} libsasl2-modules-db{a} libssh2-1-dev{a} libssh2-1t64{a} libssl-dev{a} libtasn1-6{a} libtasn1-6-dev{a} libtool{a} libuchardet0{a} libunbound8{a} libunistring5{a} libxml2{a} libxml2-dev{a} libxxhash-dev{a} libyaml-0-2{a} libzstd-dev{a} m4{a} man-db{a} media-types{a} netbase{a} nettle-dev{a} ninja-build{a} pkgconf{a} pkgconf-bin{a} po-debconf{a} python3{a} python3-minimal{a} python3-yaml{a} python3.13{a} python3.13-minimal{a} readline-common{a} scdoc{a} sensible-utils{a} tzdata{a} zlib1g-dev{a} 
The following packages are RECOMMENDED but will NOT be installed:
  bzip2-doc ca-certificates curl krb5-locales less libarchive-cpio-perl libldap-common libltdl-dev libmail-sendmail-perl libsasl2-modules libtasn1-doc lynx openssh-client publicsuffix wget 
0 packages upgraded, 120 newly installed, 0 to remove and 0 not upgraded.
Need to get 71.7 MB of archives. After unpacking 280 MB will be used.
Writing extended state information...
Get: 1 http://deb.debian.org/debian unstable/main i386 libpython3.13-minimal i386 3.13.2-2 [859 kB]
Get: 2 http://deb.debian.org/debian unstable/main i386 libexpat1 i386 2.7.0-1 [109 kB]
Get: 3 http://deb.debian.org/debian unstable/main i386 python3.13-minimal i386 3.13.2-2 [2262 kB]
Get: 4 http://deb.debian.org/debian unstable/main i386 python3-minimal i386 3.13.2-2 [27.1 kB]
Get: 5 http://deb.debian.org/debian unstable/main i386 media-types all 13.0.0 [29.3 kB]
Get: 6 http://deb.debian.org/debian unstable/main i386 netbase all 6.5 [12.4 kB]
Get: 7 http://deb.debian.org/debian unstable/main i386 tzdata all 2025a-2 [259 kB]
Get: 8 http://deb.debian.org/debian unstable/main i386 libffi8 i386 3.4.7-1 [21.4 kB]
Get: 9 http://deb.debian.org/debian unstable/main i386 readline-common all 8.2-6 [69.4 kB]
Get: 10 http://deb.debian.org/debian unstable/main i386 libreadline8t64 i386 8.2-6 [173 kB]
Get: 11 http://deb.debian.org/debian unstable/main i386 libpython3.13-stdlib i386 3.13.2-2 [1960 kB]
Get: 12 http://deb.debian.org/debian unstable/main i386 python3.13 i386 3.13.2-2 [746 kB]
Get: 13 http://deb.debian.org/debian unstable/main i386 libpython3-stdlib i386 3.13.2-2 [10.1 kB]
Get: 14 http://deb.debian.org/debian unstable/main i386 python3 i386 3.13.2-2 [28.1 kB]
Get: 15 http://deb.debian.org/debian unstable/main i386 sensible-utils all 0.0.24 [24.8 kB]
Get: 16 http://deb.debian.org/debian unstable/main i386 libmagic-mgc i386 1:5.46-3 [337 kB]
Get: 17 http://deb.debian.org/debian unstable/main i386 libmagic1t64 i386 1:5.46-3 [117 kB]
Get: 18 http://deb.debian.org/debian unstable/main i386 file i386 1:5.46-3 [43.4 kB]
Get: 19 http://deb.debian.org/debian unstable/main i386 gettext-base i386 0.23.1-1 [245 kB]
Get: 20 http://deb.debian.org/debian unstable/main i386 libuchardet0 i386 0.0.8-1+b2 [69.2 kB]
Get: 21 http://deb.debian.org/debian unstable/main i386 groff-base i386 1.23.0-7 [1199 kB]
Get: 22 http://deb.debian.org/debian unstable/main i386 bsdextrautils i386 2.40.4-5 [96.5 kB]
Get: 23 http://deb.debian.org/debian unstable/main i386 libpipeline1 i386 1.5.8-1 [41.2 kB]
Get: 24 http://deb.debian.org/debian unstable/main i386 man-db i386 2.13.0-1 [1428 kB]
Get: 25 http://deb.debian.org/debian unstable/main i386 m4 i386 1.4.19-7 [301 kB]
Get: 26 http://deb.debian.org/debian unstable/main i386 autoconf all 2.72-3 [493 kB]
Get: 27 http://deb.debian.org/debian unstable/main i386 autotools-dev all 20220109.1 [51.6 kB]
Get: 28 http://deb.debian.org/debian unstable/main i386 automake all 1:1.17-4 [862 kB]
Get: 29 http://deb.debian.org/debian unstable/main i386 autopoint all 0.23.1-1 [770 kB]
Get: 30 http://deb.debian.org/debian unstable/main i386 libcom-err2 i386 1.47.2-1+b1 [24.6 kB]
Get: 31 http://deb.debian.org/debian unstable/main i386 comerr-dev i386 2.1-1.47.2-1+b1 [56.4 kB]
Get: 32 http://deb.debian.org/debian unstable/main i386 libdebhelper-perl all 13.24.1 [90.9 kB]
Get: 33 http://deb.debian.org/debian unstable/main i386 libtool all 2.5.4-4 [539 kB]
Get: 34 http://deb.debian.org/debian unstable/main i386 dh-autoreconf all 20 [17.1 kB]
Get: 35 http://deb.debian.org/debian unstable/main i386 libarchive-zip-perl all 1.68-1 [104 kB]
Get: 36 http://deb.debian.org/debian unstable/main i386 libfile-stripnondeterminism-perl all 1.14.1-2 [19.7 kB]
Get: 37 http://deb.debian.org/debian unstable/main i386 dh-strip-nondeterminism all 1.14.1-2 [8620 B]
Get: 38 http://deb.debian.org/debian unstable/main i386 libelf1t64 i386 0.192-4 [195 kB]
Get: 39 http://deb.debian.org/debian unstable/main i386 dwz i386 0.15-1+b1 [116 kB]
Get: 40 http://deb.debian.org/debian unstable/main i386 libunistring5 i386 1.3-1 [458 kB]
Get: 41 http://deb.debian.org/debian unstable/main i386 libicu76 i386 76.1-3 [9893 kB]
Get: 42 http://deb.debian.org/debian unstable/main i386 libxml2 i386 2.12.7+dfsg+really2.9.14-0.3+b1 [734 kB]
Get: 43 http://deb.debian.org/debian unstable/main i386 gettext i386 0.23.1-1 [1714 kB]
Get: 44 http://deb.debian.org/debian unstable/main i386 intltool-debian all 0.35.0+20060710.6 [22.9 kB]
Get: 45 http://deb.debian.org/debian unstable/main i386 po-debconf all 1.0.21+nmu1 [248 kB]
Get: 46 http://deb.debian.org/debian unstable/main i386 debhelper all 13.24.1 [920 kB]
Get: 47 http://deb.debian.org/debian unstable/main i386 libbrotli1 i386 1.1.0-2+b7 [299 kB]
Get: 48 http://deb.debian.org/debian unstable/main i386 libidn2-0 i386 2.3.8-2 [110 kB]
Get: 49 http://deb.debian.org/debian unstable/main i386 libp11-kit0 i386 0.25.5-3 [423 kB]
Get: 50 http://deb.debian.org/debian unstable/main i386 libtasn1-6 i386 4.20.0-2 [51.6 kB]
Get: 51 http://deb.debian.org/debian unstable/main i386 libgnutls30t64 i386 3.8.9-2 [1462 kB]
Get: 52 http://deb.debian.org/debian unstable/main i386 libkrb5support0 i386 1.21.3-5 [35.3 kB]
Get: 53 http://deb.debian.org/debian unstable/main i386 libk5crypto3 i386 1.21.3-5 [84.3 kB]
Get: 54 http://deb.debian.org/debian unstable/main i386 libkeyutils1 i386 1.6.3-4 [9600 B]
Get: 55 http://deb.debian.org/debian unstable/main i386 libkrb5-3 i386 1.21.3-5 [355 kB]
Get: 56 http://deb.debian.org/debian unstable/main i386 libgssapi-krb5-2 i386 1.21.3-5 [149 kB]
Get: 57 http://deb.debian.org/debian unstable/main i386 libsasl2-modules-db i386 2.1.28+dfsg1-9 [20.8 kB]
Get: 58 http://deb.debian.org/debian unstable/main i386 libsasl2-2 i386 2.1.28+dfsg1-9 [61.2 kB]
Get: 59 http://deb.debian.org/debian unstable/main i386 libldap2 i386 2.6.9+dfsg-2 [206 kB]
Get: 60 http://deb.debian.org/debian unstable/main i386 libnghttp2-14 i386 1.64.0-1 [82.4 kB]
Get: 61 http://deb.debian.org/debian unstable/main i386 libnghttp3-9 i386 1.8.0-1 [78.7 kB]
Get: 62 http://deb.debian.org/debian unstable/main i386 libngtcp2-16 i386 1.11.0-1 [163 kB]
Get: 63 http://deb.debian.org/debian unstable/main i386 libngtcp2-crypto-gnutls8 i386 1.11.0-1 [29.9 kB]
Get: 64 http://deb.debian.org/debian unstable/main i386 libpsl5t64 i386 0.21.2-1.1+b1 [57.7 kB]
Get: 65 http://deb.debian.org/debian unstable/main i386 librtmp1 i386 2.4+20151223.gitfa8646d.1-2+b5 [62.4 kB]
Get: 66 http://deb.debian.org/debian unstable/main i386 libssh2-1t64 i386 1.11.1-1 [256 kB]
Get: 67 http://deb.debian.org/debian unstable/main i386 libcurl3t64-gnutls i386 8.13.0~rc2-2 [419 kB]
Get: 68 http://deb.debian.org/debian unstable/main i386 liberror-perl all 0.17030-1 [26.9 kB]
Get: 69 http://deb.debian.org/debian unstable/main i386 git-man all 1:2.49.0-1 [2236 kB]
Get: 70 http://deb.debian.org/debian unstable/main i386 git i386 1:2.49.0-1 [9570 kB]
Get: 71 http://deb.debian.org/debian unstable/main i386 icu-devtools i386 76.1-3 [222 kB]
Get: 72 http://deb.debian.org/debian unstable/main i386 libgssrpc4t64 i386 1.21.3-5 [63.6 kB]
Get: 73 http://deb.debian.org/debian unstable/main i386 libkadm5clnt-mit12 i386 1.21.3-5 [44.2 kB]
Get: 74 http://deb.debian.org/debian unstable/main i386 libkdb5-10t64 i386 1.21.3-5 [45.6 kB]
Get: 75 http://deb.debian.org/debian unstable/main i386 libkadm5srv-mit12 i386 1.21.3-5 [57.9 kB]
Get: 76 http://deb.debian.org/debian unstable/main i386 krb5-multidev i386 1.21.3-5 [126 kB]
Get: 77 http://deb.debian.org/debian unstable/main i386 libattr1-dev i386 1:2.5.2-3 [36.7 kB]
Get: 78 http://deb.debian.org/debian unstable/main i386 libacl1-dev i386 2.3.2-2+b1 [96.0 kB]
Get: 79 http://deb.debian.org/debian unstable/main i386 libarchive13t64 i386 3.7.4-1.1 [390 kB]
Get: 80 http://deb.debian.org/debian unstable/main i386 libbz2-dev i386 1.0.8-6 [32.1 kB]
Get: 81 http://deb.debian.org/debian unstable/main i386 libext2fs2t64 i386 1.47.2-1+b1 [239 kB]
Get: 82 http://deb.debian.org/debian unstable/main i386 libext2fs-dev i386 1.47.2-1+b1 [328 kB]
Get: 83 http://deb.debian.org/debian unstable/main i386 libxxhash-dev i386 0.8.3-2 [88.0 kB]
Get: 84 http://deb.debian.org/debian unstable/main i386 liblz4-dev i386 1.10.0-4 [89.3 kB]
Get: 85 http://deb.debian.org/debian unstable/main i386 liblzma-dev i386 5.6.4-1 [335 kB]
Get: 86 http://deb.debian.org/debian unstable/main i386 libicu-dev i386 76.1-3 [11.0 MB]
Get: 87 http://deb.debian.org/debian unstable/main i386 libxml2-dev i386 2.12.7+dfsg+really2.9.14-0.3+b1 [858 kB]
Get: 88 http://deb.debian.org/debian unstable/main i386 libzstd-dev i386 1.5.7+dfsg-1 [377 kB]
Get: 89 http://deb.debian.org/debian unstable/main i386 libgmpxx4ldbl i386 2:6.3.0+dfsg-3 [329 kB]
Get: 90 http://deb.debian.org/debian unstable/main i386 libgmp-dev i386 2:6.3.0+dfsg-3 [661 kB]
Get: 91 http://deb.debian.org/debian unstable/main i386 nettle-dev i386 3.10.1-1 [1335 kB]
Get: 92 http://deb.debian.org/debian unstable/main i386 zlib1g-dev i386 1:1.3.dfsg+really1.3.1-1+b1 [916 kB]
Get: 93 http://deb.debian.org/debian unstable/main i386 libarchive-dev i386 3.7.4-1.1 [612 kB]
Get: 94 http://deb.debian.org/debian unstable/main i386 libbrotli-dev i386 1.1.0-2+b7 [313 kB]
Get: 95 http://deb.debian.org/debian unstable/main i386 libcurl4t64 i386 8.13.0~rc2-2 [426 kB]
Get: 96 http://deb.debian.org/debian unstable/main i386 libidn2-dev i386 2.3.8-2 [104 kB]
Get: 97 http://deb.debian.org/debian unstable/main i386 libkrb5-dev i386 1.21.3-5 [16.1 kB]
Get: 98 http://deb.debian.org/debian unstable/main i386 libldap-dev i386 2.6.9+dfsg-2 [332 kB]
Get: 99 http://deb.debian.org/debian unstable/main i386 libpkgconf3 i386 1.8.1-4 [38.4 kB]
Get: 100 http://deb.debian.org/debian unstable/main i386 pkgconf-bin i386 1.8.1-4 [30.6 kB]
Get: 101 http://deb.debian.org/debian unstable/main i386 pkgconf i386 1.8.1-4 [26.2 kB]
Get: 102 http://deb.debian.org/debian unstable/main i386 libnghttp2-dev i386 1.64.0-1 [123 kB]
Get: 103 http://deb.debian.org/debian unstable/main i386 libnghttp3-dev i386 1.8.0-1 [104 kB]
Get: 104 http://deb.debian.org/debian unstable/main i386 libpsl-dev i386 0.21.2-1.1+b1 [78.4 kB]
Get: 105 http://deb.debian.org/debian unstable/main i386 libevent-2.1-7t64 i386 2.1.12-stable-10+b1 [195 kB]
Get: 106 http://deb.debian.org/debian unstable/main i386 libunbound8 i386 1.22.0-1+b1 [633 kB]
Get: 107 http://deb.debian.org/debian unstable/main i386 libgnutls-dane0t64 i386 3.8.9-2 [453 kB]
Get: 108 http://deb.debian.org/debian unstable/main i386 libgnutls-openssl27t64 i386 3.8.9-2 [453 kB]
Get: 109 http://deb.debian.org/debian unstable/main i386 libp11-kit-dev i386 0.25.5-3 [208 kB]
Get: 110 http://deb.debian.org/debian unstable/main i386 libtasn1-6-dev i386 4.20.0-2 [103 kB]
Get: 111 http://deb.debian.org/debian unstable/main i386 libgnutls28-dev i386 3.8.9-2 [1464 kB]
Get: 112 http://deb.debian.org/debian unstable/main i386 librtmp-dev i386 2.4+20151223.gitfa8646d.1-2+b5 [72.3 kB]
Get: 113 http://deb.debian.org/debian unstable/main i386 libssl-dev i386 3.4.1-1 [2837 kB]
Get: 114 http://deb.debian.org/debian unstable/main i386 libssh2-1-dev i386 1.11.1-1 [407 kB]
Get: 115 http://deb.debian.org/debian unstable/main i386 libcurl4-openssl-dev i386 8.13.0~rc2-2 [561 kB]
Get: 116 http://deb.debian.org/debian unstable/main i386 libpkgconf-dev i386 1.8.1-4 [58.0 kB]
Get: 117 http://deb.debian.org/debian unstable/main i386 libyaml-0-2 i386 0.2.5-2 [55.8 kB]
Get: 118 http://deb.debian.org/debian unstable/main i386 ninja-build i386 1.12.1-1 [153 kB]
Get: 119 http://deb.debian.org/debian unstable/main i386 python3-yaml i386 6.0.2-1+b2 [135 kB]
Get: 120 http://deb.debian.org/debian unstable/main i386 scdoc i386 1.11.3-1 [15.0 kB]
Fetched 71.7 MB in 1s (86.1 MB/s)
Preconfiguring packages ...
Selecting previously unselected package libpython3.13-minimal:i386.
(Reading database ... 
(Reading database ... 5%
(Reading database ... 10%
(Reading database ... 15%
(Reading database ... 20%
(Reading database ... 25%
(Reading database ... 30%
(Reading database ... 35%
(Reading database ... 40%
(Reading database ... 45%
(Reading database ... 50%
(Reading database ... 55%
(Reading database ... 60%
(Reading database ... 65%
(Reading database ... 70%
(Reading database ... 75%
(Reading database ... 80%
(Reading database ... 85%
(Reading database ... 90%
(Reading database ... 95%
(Reading database ... 100%
(Reading database ... 19793 files and directories currently installed.)
Preparing to unpack .../libpython3.13-minimal_3.13.2-2_i386.deb ...
Unpacking libpython3.13-minimal:i386 (3.13.2-2) ...
Selecting previously unselected package libexpat1:i386.
Preparing to unpack .../libexpat1_2.7.0-1_i386.deb ...
Unpacking libexpat1:i386 (2.7.0-1) ...
Selecting previously unselected package python3.13-minimal.
Preparing to unpack .../python3.13-minimal_3.13.2-2_i386.deb ...
Unpacking python3.13-minimal (3.13.2-2) ...
Setting up libpython3.13-minimal:i386 (3.13.2-2) ...
Setting up libexpat1:i386 (2.7.0-1) ...
Setting up python3.13-minimal (3.13.2-2) ...
Selecting previously unselected package python3-minimal.
(Reading database ... 
(Reading database ... 5%
(Reading database ... 10%
(Reading database ... 15%
(Reading database ... 20%
(Reading database ... 25%
(Reading database ... 30%
(Reading database ... 35%
(Reading database ... 40%
(Reading database ... 45%
(Reading database ... 50%
(Reading database ... 55%
(Reading database ... 60%
(Reading database ... 65%
(Reading database ... 70%
(Reading database ... 75%
(Reading database ... 80%
(Reading database ... 85%
(Reading database ... 90%
(Reading database ... 95%
(Reading database ... 100%
(Reading database ... 20127 files and directories currently installed.)
Preparing to unpack .../0-python3-minimal_3.13.2-2_i386.deb ...
Unpacking python3-minimal (3.13.2-2) ...
Selecting previously unselected package media-types.
Preparing to unpack .../1-media-types_13.0.0_all.deb ...
Unpacking media-types (13.0.0) ...
Selecting previously unselected package netbase.
Preparing to unpack .../2-netbase_6.5_all.deb ...
Unpacking netbase (6.5) ...
Selecting previously unselected package tzdata.
Preparing to unpack .../3-tzdata_2025a-2_all.deb ...
Unpacking tzdata (2025a-2) ...
Selecting previously unselected package libffi8:i386.
Preparing to unpack .../4-libffi8_3.4.7-1_i386.deb ...
Unpacking libffi8:i386 (3.4.7-1) ...
Selecting previously unselected package readline-common.
Preparing to unpack .../5-readline-common_8.2-6_all.deb ...
Unpacking readline-common (8.2-6) ...
Selecting previously unselected package libreadline8t64:i386.
Preparing to unpack .../6-libreadline8t64_8.2-6_i386.deb ...
Adding 'diversion of /lib/i386-linux-gnu/libhistory.so.8 to /lib/i386-linux-gnu/libhistory.so.8.usr-is-merged by libreadline8t64'
Adding 'diversion of /lib/i386-linux-gnu/libhistory.so.8.2 to /lib/i386-linux-gnu/libhistory.so.8.2.usr-is-merged by libreadline8t64'
Adding 'diversion of /lib/i386-linux-gnu/libreadline.so.8 to /lib/i386-linux-gnu/libreadline.so.8.usr-is-merged by libreadline8t64'
Adding 'diversion of /lib/i386-linux-gnu/libreadline.so.8.2 to /lib/i386-linux-gnu/libreadline.so.8.2.usr-is-merged by libreadline8t64'
Unpacking libreadline8t64:i386 (8.2-6) ...
Selecting previously unselected package libpython3.13-stdlib:i386.
Preparing to unpack .../7-libpython3.13-stdlib_3.13.2-2_i386.deb ...
Unpacking libpython3.13-stdlib:i386 (3.13.2-2) ...
Selecting previously unselected package python3.13.
Preparing to unpack .../8-python3.13_3.13.2-2_i386.deb ...
Unpacking python3.13 (3.13.2-2) ...
Selecting previously unselected package libpython3-stdlib:i386.
Preparing to unpack .../9-libpython3-stdlib_3.13.2-2_i386.deb ...
Unpacking libpython3-stdlib:i386 (3.13.2-2) ...
Setting up python3-minimal (3.13.2-2) ...
Selecting previously unselected package python3.
(Reading database ... 
(Reading database ... 5%
(Reading database ... 10%
(Reading database ... 15%
(Reading database ... 20%
(Reading database ... 25%
(Reading database ... 30%
(Reading database ... 35%
(Reading database ... 40%
(Reading database ... 45%
(Reading database ... 50%
(Reading database ... 55%
(Reading database ... 60%
(Reading database ... 65%
(Reading database ... 70%
(Reading database ... 75%
(Reading database ... 80%
(Reading database ... 85%
(Reading database ... 90%
(Reading database ... 95%
(Reading database ... 100%
(Reading database ... 21137 files and directories currently installed.)
Preparing to unpack .../000-python3_3.13.2-2_i386.deb ...
Unpacking python3 (3.13.2-2) ...
Selecting previously unselected package sensible-utils.
Preparing to unpack .../001-sensible-utils_0.0.24_all.deb ...
Unpacking sensible-utils (0.0.24) ...
Selecting previously unselected package libmagic-mgc.
Preparing to unpack .../002-libmagic-mgc_1%3a5.46-3_i386.deb ...
Unpacking libmagic-mgc (1:5.46-3) ...
Selecting previously unselected package libmagic1t64:i386.
Preparing to unpack .../003-libmagic1t64_1%3a5.46-3_i386.deb ...
Unpacking libmagic1t64:i386 (1:5.46-3) ...
Selecting previously unselected package file.
Preparing to unpack .../004-file_1%3a5.46-3_i386.deb ...
Unpacking file (1:5.46-3) ...
Selecting previously unselected package gettext-base.
Preparing to unpack .../005-gettext-base_0.23.1-1_i386.deb ...
Unpacking gettext-base (0.23.1-1) ...
Selecting previously unselected package libuchardet0:i386.
Preparing to unpack .../006-libuchardet0_0.0.8-1+b2_i386.deb ...
Unpacking libuchardet0:i386 (0.0.8-1+b2) ...
Selecting previously unselected package groff-base.
Preparing to unpack .../007-groff-base_1.23.0-7_i386.deb ...
Unpacking groff-base (1.23.0-7) ...
Selecting previously unselected package bsdextrautils.
Preparing to unpack .../008-bsdextrautils_2.40.4-5_i386.deb ...
Unpacking bsdextrautils (2.40.4-5) ...
Selecting previously unselected package libpipeline1:i386.
Preparing to unpack .../009-libpipeline1_1.5.8-1_i386.deb ...
Unpacking libpipeline1:i386 (1.5.8-1) ...
Selecting previously unselected package man-db.
Preparing to unpack .../010-man-db_2.13.0-1_i386.deb ...
Unpacking man-db (2.13.0-1) ...
Selecting previously unselected package m4.
Preparing to unpack .../011-m4_1.4.19-7_i386.deb ...
Unpacking m4 (1.4.19-7) ...
Selecting previously unselected package autoconf.
Preparing to unpack .../012-autoconf_2.72-3_all.deb ...
Unpacking autoconf (2.72-3) ...
Selecting previously unselected package autotools-dev.
Preparing to unpack .../013-autotools-dev_20220109.1_all.deb ...
Unpacking autotools-dev (20220109.1) ...
Selecting previously unselected package automake.
Preparing to unpack .../014-automake_1%3a1.17-4_all.deb ...
Unpacking automake (1:1.17-4) ...
Selecting previously unselected package autopoint.
Preparing to unpack .../015-autopoint_0.23.1-1_all.deb ...
Unpacking autopoint (0.23.1-1) ...
Selecting previously unselected package libcom-err2:i386.
Preparing to unpack .../016-libcom-err2_1.47.2-1+b1_i386.deb ...
Unpacking libcom-err2:i386 (1.47.2-1+b1) ...
Selecting previously unselected package comerr-dev:i386.
Preparing to unpack .../017-comerr-dev_2.1-1.47.2-1+b1_i386.deb ...
Unpacking comerr-dev:i386 (2.1-1.47.2-1+b1) ...
Selecting previously unselected package libdebhelper-perl.
Preparing to unpack .../018-libdebhelper-perl_13.24.1_all.deb ...
Unpacking libdebhelper-perl (13.24.1) ...
Selecting previously unselected package libtool.
Preparing to unpack .../019-libtool_2.5.4-4_all.deb ...
Unpacking libtool (2.5.4-4) ...
Selecting previously unselected package dh-autoreconf.
Preparing to unpack .../020-dh-autoreconf_20_all.deb ...
Unpacking dh-autoreconf (20) ...
Selecting previously unselected package libarchive-zip-perl.
Preparing to unpack .../021-libarchive-zip-perl_1.68-1_all.deb ...
Unpacking libarchive-zip-perl (1.68-1) ...
Selecting previously unselected package libfile-stripnondeterminism-perl.
Preparing to unpack .../022-libfile-stripnondeterminism-perl_1.14.1-2_all.deb ...
Unpacking libfile-stripnondeterminism-perl (1.14.1-2) ...
Selecting previously unselected package dh-strip-nondeterminism.
Preparing to unpack .../023-dh-strip-nondeterminism_1.14.1-2_all.deb ...
Unpacking dh-strip-nondeterminism (1.14.1-2) ...
Selecting previously unselected package libelf1t64:i386.
Preparing to unpack .../024-libelf1t64_0.192-4_i386.deb ...
Unpacking libelf1t64:i386 (0.192-4) ...
Selecting previously unselected package dwz.
Preparing to unpack .../025-dwz_0.15-1+b1_i386.deb ...
Unpacking dwz (0.15-1+b1) ...
Selecting previously unselected package libunistring5:i386.
Preparing to unpack .../026-libunistring5_1.3-1_i386.deb ...
Unpacking libunistring5:i386 (1.3-1) ...
Selecting previously unselected package libicu76:i386.
Preparing to unpack .../027-libicu76_76.1-3_i386.deb ...
Unpacking libicu76:i386 (76.1-3) ...
Selecting previously unselected package libxml2:i386.
Preparing to unpack .../028-libxml2_2.12.7+dfsg+really2.9.14-0.3+b1_i386.deb ...
Unpacking libxml2:i386 (2.12.7+dfsg+really2.9.14-0.3+b1) ...
Selecting previously unselected package gettext.
Preparing to unpack .../029-gettext_0.23.1-1_i386.deb ...
Unpacking gettext (0.23.1-1) ...
Selecting previously unselected package intltool-debian.
Preparing to unpack .../030-intltool-debian_0.35.0+20060710.6_all.deb ...
Unpacking intltool-debian (0.35.0+20060710.6) ...
Selecting previously unselected package po-debconf.
Preparing to unpack .../031-po-debconf_1.0.21+nmu1_all.deb ...
Unpacking po-debconf (1.0.21+nmu1) ...
Selecting previously unselected package debhelper.
Preparing to unpack .../032-debhelper_13.24.1_all.deb ...
Unpacking debhelper (13.24.1) ...
Selecting previously unselected package libbrotli1:i386.
Preparing to unpack .../033-libbrotli1_1.1.0-2+b7_i386.deb ...
Unpacking libbrotli1:i386 (1.1.0-2+b7) ...
Selecting previously unselected package libidn2-0:i386.
Preparing to unpack .../034-libidn2-0_2.3.8-2_i386.deb ...
Unpacking libidn2-0:i386 (2.3.8-2) ...
Selecting previously unselected package libp11-kit0:i386.
Preparing to unpack .../035-libp11-kit0_0.25.5-3_i386.deb ...
Unpacking libp11-kit0:i386 (0.25.5-3) ...
Selecting previously unselected package libtasn1-6:i386.
Preparing to unpack .../036-libtasn1-6_4.20.0-2_i386.deb ...
Unpacking libtasn1-6:i386 (4.20.0-2) ...
Selecting previously unselected package libgnutls30t64:i386.
Preparing to unpack .../037-libgnutls30t64_3.8.9-2_i386.deb ...
Unpacking libgnutls30t64:i386 (3.8.9-2) ...
Selecting previously unselected package libkrb5support0:i386.
Preparing to unpack .../038-libkrb5support0_1.21.3-5_i386.deb ...
Unpacking libkrb5support0:i386 (1.21.3-5) ...
Selecting previously unselected package libk5crypto3:i386.
Preparing to unpack .../039-libk5crypto3_1.21.3-5_i386.deb ...
Unpacking libk5crypto3:i386 (1.21.3-5) ...
Selecting previously unselected package libkeyutils1:i386.
Preparing to unpack .../040-libkeyutils1_1.6.3-4_i386.deb ...
Unpacking libkeyutils1:i386 (1.6.3-4) ...
Selecting previously unselected package libkrb5-3:i386.
Preparing to unpack .../041-libkrb5-3_1.21.3-5_i386.deb ...
Unpacking libkrb5-3:i386 (1.21.3-5) ...
Selecting previously unselected package libgssapi-krb5-2:i386.
Preparing to unpack .../042-libgssapi-krb5-2_1.21.3-5_i386.deb ...
Unpacking libgssapi-krb5-2:i386 (1.21.3-5) ...
Selecting previously unselected package libsasl2-modules-db:i386.
Preparing to unpack .../043-libsasl2-modules-db_2.1.28+dfsg1-9_i386.deb ...
Unpacking libsasl2-modules-db:i386 (2.1.28+dfsg1-9) ...
Selecting previously unselected package libsasl2-2:i386.
Preparing to unpack .../044-libsasl2-2_2.1.28+dfsg1-9_i386.deb ...
Unpacking libsasl2-2:i386 (2.1.28+dfsg1-9) ...
Selecting previously unselected package libldap2:i386.
Preparing to unpack .../045-libldap2_2.6.9+dfsg-2_i386.deb ...
Unpacking libldap2:i386 (2.6.9+dfsg-2) ...
Selecting previously unselected package libnghttp2-14:i386.
Preparing to unpack .../046-libnghttp2-14_1.64.0-1_i386.deb ...
Unpacking libnghttp2-14:i386 (1.64.0-1) ...
Selecting previously unselected package libnghttp3-9:i386.
Preparing to unpack .../047-libnghttp3-9_1.8.0-1_i386.deb ...
Unpacking libnghttp3-9:i386 (1.8.0-1) ...
Selecting previously unselected package libngtcp2-16:i386.
Preparing to unpack .../048-libngtcp2-16_1.11.0-1_i386.deb ...
Unpacking libngtcp2-16:i386 (1.11.0-1) ...
Selecting previously unselected package libngtcp2-crypto-gnutls8:i386.
Preparing to unpack .../049-libngtcp2-crypto-gnutls8_1.11.0-1_i386.deb ...
Unpacking libngtcp2-crypto-gnutls8:i386 (1.11.0-1) ...
Selecting previously unselected package libpsl5t64:i386.
Preparing to unpack .../050-libpsl5t64_0.21.2-1.1+b1_i386.deb ...
Unpacking libpsl5t64:i386 (0.21.2-1.1+b1) ...
Selecting previously unselected package librtmp1:i386.
Preparing to unpack .../051-librtmp1_2.4+20151223.gitfa8646d.1-2+b5_i386.deb ...
Unpacking librtmp1:i386 (2.4+20151223.gitfa8646d.1-2+b5) ...
Selecting previously unselected package libssh2-1t64:i386.
Preparing to unpack .../052-libssh2-1t64_1.11.1-1_i386.deb ...
Unpacking libssh2-1t64:i386 (1.11.1-1) ...
Selecting previously unselected package libcurl3t64-gnutls:i386.
Preparing to unpack .../053-libcurl3t64-gnutls_8.13.0~rc2-2_i386.deb ...
Unpacking libcurl3t64-gnutls:i386 (8.13.0~rc2-2) ...
Selecting previously unselected package liberror-perl.
Preparing to unpack .../054-liberror-perl_0.17030-1_all.deb ...
Unpacking liberror-perl (0.17030-1) ...
Selecting previously unselected package git-man.
Preparing to unpack .../055-git-man_1%3a2.49.0-1_all.deb ...
Unpacking git-man (1:2.49.0-1) ...
Selecting previously unselected package git.
Preparing to unpack .../056-git_1%3a2.49.0-1_i386.deb ...
Unpacking git (1:2.49.0-1) ...
Selecting previously unselected package icu-devtools.
Preparing to unpack .../057-icu-devtools_76.1-3_i386.deb ...
Unpacking icu-devtools (76.1-3) ...
Selecting previously unselected package libgssrpc4t64:i386.
Preparing to unpack .../058-libgssrpc4t64_1.21.3-5_i386.deb ...
Unpacking libgssrpc4t64:i386 (1.21.3-5) ...
Selecting previously unselected package libkadm5clnt-mit12:i386.
Preparing to unpack .../059-libkadm5clnt-mit12_1.21.3-5_i386.deb ...
Unpacking libkadm5clnt-mit12:i386 (1.21.3-5) ...
Selecting previously unselected package libkdb5-10t64:i386.
Preparing to unpack .../060-libkdb5-10t64_1.21.3-5_i386.deb ...
Unpacking libkdb5-10t64:i386 (1.21.3-5) ...
Selecting previously unselected package libkadm5srv-mit12:i386.
Preparing to unpack .../061-libkadm5srv-mit12_1.21.3-5_i386.deb ...
Unpacking libkadm5srv-mit12:i386 (1.21.3-5) ...
Selecting previously unselected package krb5-multidev:i386.
Preparing to unpack .../062-krb5-multidev_1.21.3-5_i386.deb ...
Unpacking krb5-multidev:i386 (1.21.3-5) ...
Selecting previously unselected package libattr1-dev:i386.
Preparing to unpack .../063-libattr1-dev_1%3a2.5.2-3_i386.deb ...
Unpacking libattr1-dev:i386 (1:2.5.2-3) ...
Selecting previously unselected package libacl1-dev:i386.
Preparing to unpack .../064-libacl1-dev_2.3.2-2+b1_i386.deb ...
Unpacking libacl1-dev:i386 (2.3.2-2+b1) ...
Selecting previously unselected package libarchive13t64:i386.
Preparing to unpack .../065-libarchive13t64_3.7.4-1.1_i386.deb ...
Unpacking libarchive13t64:i386 (3.7.4-1.1) ...
Selecting previously unselected package libbz2-dev:i386.
Preparing to unpack .../066-libbz2-dev_1.0.8-6_i386.deb ...
Unpacking libbz2-dev:i386 (1.0.8-6) ...
Selecting previously unselected package libext2fs2t64:i386.
Preparing to unpack .../067-libext2fs2t64_1.47.2-1+b1_i386.deb ...
Adding 'diversion of /lib/i386-linux-gnu/libe2p.so.2 to /lib/i386-linux-gnu/libe2p.so.2.usr-is-merged by libext2fs2t64'
Adding 'diversion of /lib/i386-linux-gnu/libe2p.so.2.3 to /lib/i386-linux-gnu/libe2p.so.2.3.usr-is-merged by libext2fs2t64'
Adding 'diversion of /lib/i386-linux-gnu/libext2fs.so.2 to /lib/i386-linux-gnu/libext2fs.so.2.usr-is-merged by libext2fs2t64'
Adding 'diversion of /lib/i386-linux-gnu/libext2fs.so.2.4 to /lib/i386-linux-gnu/libext2fs.so.2.4.usr-is-merged by libext2fs2t64'
Unpacking libext2fs2t64:i386 (1.47.2-1+b1) ...
Selecting previously unselected package libext2fs-dev.
Preparing to unpack .../068-libext2fs-dev_1.47.2-1+b1_i386.deb ...
Unpacking libext2fs-dev (1.47.2-1+b1) ...
Selecting previously unselected package libxxhash-dev:i386.
Preparing to unpack .../069-libxxhash-dev_0.8.3-2_i386.deb ...
Unpacking libxxhash-dev:i386 (0.8.3-2) ...
Selecting previously unselected package liblz4-dev:i386.
Preparing to unpack .../070-liblz4-dev_1.10.0-4_i386.deb ...
Unpacking liblz4-dev:i386 (1.10.0-4) ...
Selecting previously unselected package liblzma-dev:i386.
Preparing to unpack .../071-liblzma-dev_5.6.4-1_i386.deb ...
Unpacking liblzma-dev:i386 (5.6.4-1) ...
Selecting previously unselected package libicu-dev:i386.
Preparing to unpack .../072-libicu-dev_76.1-3_i386.deb ...
Unpacking libicu-dev:i386 (76.1-3) ...
Selecting previously unselected package libxml2-dev:i386.
Preparing to unpack .../073-libxml2-dev_2.12.7+dfsg+really2.9.14-0.3+b1_i386.deb ...
Unpacking libxml2-dev:i386 (2.12.7+dfsg+really2.9.14-0.3+b1) ...
Selecting previously unselected package libzstd-dev:i386.
Preparing to unpack .../074-libzstd-dev_1.5.7+dfsg-1_i386.deb ...
Unpacking libzstd-dev:i386 (1.5.7+dfsg-1) ...
Selecting previously unselected package libgmpxx4ldbl:i386.
Preparing to unpack .../075-libgmpxx4ldbl_2%3a6.3.0+dfsg-3_i386.deb ...
Unpacking libgmpxx4ldbl:i386 (2:6.3.0+dfsg-3) ...
Selecting previously unselected package libgmp-dev:i386.
Preparing to unpack .../076-libgmp-dev_2%3a6.3.0+dfsg-3_i386.deb ...
Unpacking libgmp-dev:i386 (2:6.3.0+dfsg-3) ...
Selecting previously unselected package nettle-dev:i386.
Preparing to unpack .../077-nettle-dev_3.10.1-1_i386.deb ...
Unpacking nettle-dev:i386 (3.10.1-1) ...
Selecting previously unselected package zlib1g-dev:i386.
Preparing to unpack .../078-zlib1g-dev_1%3a1.3.dfsg+really1.3.1-1+b1_i386.deb ...
Unpacking zlib1g-dev:i386 (1:1.3.dfsg+really1.3.1-1+b1) ...
Selecting previously unselected package libarchive-dev:i386.
Preparing to unpack .../079-libarchive-dev_3.7.4-1.1_i386.deb ...
Unpacking libarchive-dev:i386 (3.7.4-1.1) ...
Selecting previously unselected package libbrotli-dev:i386.
Preparing to unpack .../080-libbrotli-dev_1.1.0-2+b7_i386.deb ...
Unpacking libbrotli-dev:i386 (1.1.0-2+b7) ...
Selecting previously unselected package libcurl4t64:i386.
Preparing to unpack .../081-libcurl4t64_8.13.0~rc2-2_i386.deb ...
Unpacking libcurl4t64:i386 (8.13.0~rc2-2) ...
Selecting previously unselected package libidn2-dev:i386.
Preparing to unpack .../082-libidn2-dev_2.3.8-2_i386.deb ...
Unpacking libidn2-dev:i386 (2.3.8-2) ...
Selecting previously unselected package libkrb5-dev:i386.
Preparing to unpack .../083-libkrb5-dev_1.21.3-5_i386.deb ...
Unpacking libkrb5-dev:i386 (1.21.3-5) ...
Selecting previously unselected package libldap-dev:i386.
Preparing to unpack .../084-libldap-dev_2.6.9+dfsg-2_i386.deb ...
Unpacking libldap-dev:i386 (2.6.9+dfsg-2) ...
Selecting previously unselected package libpkgconf3:i386.
Preparing to unpack .../085-libpkgconf3_1.8.1-4_i386.deb ...
Unpacking libpkgconf3:i386 (1.8.1-4) ...
Selecting previously unselected package pkgconf-bin.
Preparing to unpack .../086-pkgconf-bin_1.8.1-4_i386.deb ...
Unpacking pkgconf-bin (1.8.1-4) ...
Selecting previously unselected package pkgconf:i386.
Preparing to unpack .../087-pkgconf_1.8.1-4_i386.deb ...
Unpacking pkgconf:i386 (1.8.1-4) ...
Selecting previously unselected package libnghttp2-dev:i386.
Preparing to unpack .../088-libnghttp2-dev_1.64.0-1_i386.deb ...
Unpacking libnghttp2-dev:i386 (1.64.0-1) ...
Selecting previously unselected package libnghttp3-dev:i386.
Preparing to unpack .../089-libnghttp3-dev_1.8.0-1_i386.deb ...
Unpacking libnghttp3-dev:i386 (1.8.0-1) ...
Selecting previously unselected package libpsl-dev:i386.
Preparing to unpack .../090-libpsl-dev_0.21.2-1.1+b1_i386.deb ...
Unpacking libpsl-dev:i386 (0.21.2-1.1+b1) ...
Selecting previously unselected package libevent-2.1-7t64:i386.
Preparing to unpack .../091-libevent-2.1-7t64_2.1.12-stable-10+b1_i386.deb ...
Unpacking libevent-2.1-7t64:i386 (2.1.12-stable-10+b1) ...
Selecting previously unselected package libunbound8:i386.
Preparing to unpack .../092-libunbound8_1.22.0-1+b1_i386.deb ...
Unpacking libunbound8:i386 (1.22.0-1+b1) ...
Selecting previously unselected package libgnutls-dane0t64:i386.
Preparing to unpack .../093-libgnutls-dane0t64_3.8.9-2_i386.deb ...
Unpacking libgnutls-dane0t64:i386 (3.8.9-2) ...
Selecting previously unselected package libgnutls-openssl27t64:i386.
Preparing to unpack .../094-libgnutls-openssl27t64_3.8.9-2_i386.deb ...
Unpacking libgnutls-openssl27t64:i386 (3.8.9-2) ...
Selecting previously unselected package libp11-kit-dev:i386.
Preparing to unpack .../095-libp11-kit-dev_0.25.5-3_i386.deb ...
Unpacking libp11-kit-dev:i386 (0.25.5-3) ...
Selecting previously unselected package libtasn1-6-dev:i386.
Preparing to unpack .../096-libtasn1-6-dev_4.20.0-2_i386.deb ...
Unpacking libtasn1-6-dev:i386 (4.20.0-2) ...
Selecting previously unselected package libgnutls28-dev:i386.
Preparing to unpack .../097-libgnutls28-dev_3.8.9-2_i386.deb ...
Unpacking libgnutls28-dev:i386 (3.8.9-2) ...
Selecting previously unselected package librtmp-dev:i386.
Preparing to unpack .../098-librtmp-dev_2.4+20151223.gitfa8646d.1-2+b5_i386.deb ...
Unpacking librtmp-dev:i386 (2.4+20151223.gitfa8646d.1-2+b5) ...
Selecting previously unselected package libssl-dev:i386.
Preparing to unpack .../099-libssl-dev_3.4.1-1_i386.deb ...
Unpacking libssl-dev:i386 (3.4.1-1) ...
Selecting previously unselected package libssh2-1-dev:i386.
Preparing to unpack .../100-libssh2-1-dev_1.11.1-1_i386.deb ...
Unpacking libssh2-1-dev:i386 (1.11.1-1) ...
Selecting previously unselected package libcurl4-openssl-dev:i386.
Preparing to unpack .../101-libcurl4-openssl-dev_8.13.0~rc2-2_i386.deb ...
Unpacking libcurl4-openssl-dev:i386 (8.13.0~rc2-2) ...
Selecting previously unselected package libpkgconf-dev:i386.
Preparing to unpack .../102-libpkgconf-dev_1.8.1-4_i386.deb ...
Unpacking libpkgconf-dev:i386 (1.8.1-4) ...
Selecting previously unselected package libyaml-0-2:i386.
Preparing to unpack .../103-libyaml-0-2_0.2.5-2_i386.deb ...
Unpacking libyaml-0-2:i386 (0.2.5-2) ...
Selecting previously unselected package ninja-build.
Preparing to unpack .../104-ninja-build_1.12.1-1_i386.deb ...
Unpacking ninja-build (1.12.1-1) ...
Selecting previously unselected package python3-yaml.
Preparing to unpack .../105-python3-yaml_6.0.2-1+b2_i386.deb ...
Unpacking python3-yaml (6.0.2-1+b2) ...
Selecting previously unselected package scdoc.
Preparing to unpack .../106-scdoc_1.11.3-1_i386.deb ...
Unpacking scdoc (1.11.3-1) ...
Setting up media-types (13.0.0) ...
Setting up libpipeline1:i386 (1.5.8-1) ...
Setting up libkeyutils1:i386 (1.6.3-4) ...
Setting up libzstd-dev:i386 (1.5.7+dfsg-1) ...
Setting up bsdextrautils (2.40.4-5) ...
Setting up libattr1-dev:i386 (1:2.5.2-3) ...
Setting up libmagic-mgc (1:5.46-3) ...
Setting up libarchive-zip-perl (1.68-1) ...
Setting up libyaml-0-2:i386 (0.2.5-2) ...
Setting up libdebhelper-perl (13.24.1) ...
Setting up libbrotli1:i386 (1.1.0-2+b7) ...
Setting up libmagic1t64:i386 (1:5.46-3) ...
Setting up libnghttp2-14:i386 (1.64.0-1) ...
Setting up gettext-base (0.23.1-1) ...
Setting up m4 (1.4.19-7) ...
Setting up libevent-2.1-7t64:i386 (2.1.12-stable-10+b1) ...
Setting up libcom-err2:i386 (1.47.2-1+b1) ...
Setting up file (1:5.46-3) ...
Setting up ninja-build (1.12.1-1) ...
Setting up libelf1t64:i386 (0.192-4) ...
Setting up libkrb5support0:i386 (1.21.3-5) ...
Setting up libsasl2-modules-db:i386 (2.1.28+dfsg1-9) ...
Setting up tzdata (2025a-2) ...

Current default time zone: 'Etc/UTC'
Local time is now:      Sat Mar 22 23:24:47 UTC 2025.
Universal Time is now:  Sat Mar 22 23:24:47 UTC 2025.
Run 'dpkg-reconfigure tzdata' if you wish to change it.

Setting up liberror-perl (0.17030-1) ...
Setting up autotools-dev (20220109.1) ...
Setting up libunbound8:i386 (1.22.0-1+b1) ...
Setting up libpkgconf3:i386 (1.8.1-4) ...
Setting up libgmpxx4ldbl:i386 (2:6.3.0+dfsg-3) ...
Setting up comerr-dev:i386 (2.1-1.47.2-1+b1) ...
Setting up libunistring5:i386 (1.3-1) ...
Setting up libssl-dev:i386 (3.4.1-1) ...
Setting up autopoint (0.23.1-1) ...
Setting up pkgconf-bin (1.8.1-4) ...
Setting up libk5crypto3:i386 (1.21.3-5) ...
Setting up scdoc (1.11.3-1) ...
Setting up libsasl2-2:i386 (2.1.28+dfsg1-9) ...
Setting up autoconf (2.72-3) ...
Setting up libnghttp3-9:i386 (1.8.0-1) ...
Setting up libxxhash-dev:i386 (0.8.3-2) ...
Setting up libnghttp3-dev:i386 (1.8.0-1) ...
Setting up liblzma-dev:i386 (5.6.4-1) ...
Setting up zlib1g-dev:i386 (1:1.3.dfsg+really1.3.1-1+b1) ...
Setting up libffi8:i386 (3.4.7-1) ...
Setting up dwz (0.15-1+b1) ...
Setting up sensible-utils (0.0.24) ...
Setting up libuchardet0:i386 (0.0.8-1+b2) ...
Setting up libtasn1-6:i386 (4.20.0-2) ...
Setting up libext2fs2t64:i386 (1.47.2-1+b1) ...
Setting up git-man (1:2.49.0-1) ...
Setting up netbase (6.5) ...
Setting up libngtcp2-16:i386 (1.11.0-1) ...
Setting up libkrb5-3:i386 (1.21.3-5) ...
Setting up libicu76:i386 (76.1-3) ...
Setting up libssh2-1t64:i386 (1.11.1-1) ...
Setting up libext2fs-dev (1.47.2-1+b1) ...
Setting up libtasn1-6-dev:i386 (4.20.0-2) ...
Setting up readline-common (8.2-6) ...
Setting up libxml2:i386 (2.12.7+dfsg+really2.9.14-0.3+b1) ...
Setting up libldap2:i386 (2.6.9+dfsg-2) ...
Setting up libbrotli-dev:i386 (1.1.0-2+b7) ...
Setting up libacl1-dev:i386 (2.3.2-2+b1) ...
Setting up libbz2-dev:i386 (1.0.8-6) ...
Setting up automake (1:1.17-4) ...
update-alternatives: using /usr/bin/automake-1.17 to provide /usr/bin/automake (automake) in auto mode
Setting up libfile-stripnondeterminism-perl (1.14.1-2) ...
Setting up gettext (0.23.1-1) ...
Setting up libgmp-dev:i386 (2:6.3.0+dfsg-3) ...
Setting up nettle-dev:i386 (3.10.1-1) ...
Setting up libtool (2.5.4-4) ...
Setting up libpkgconf-dev:i386 (1.8.1-4) ...
Setting up libidn2-0:i386 (2.3.8-2) ...
Setting up pkgconf:i386 (1.8.1-4) ...
Setting up intltool-debian (0.35.0+20060710.6) ...
Setting up dh-autoreconf (20) ...
Setting up libldap-dev:i386 (2.6.9+dfsg-2) ...
Setting up libp11-kit0:i386 (0.25.5-3) ...
Setting up libgssapi-krb5-2:i386 (1.21.3-5) ...
Setting up icu-devtools (76.1-3) ...
Setting up liblz4-dev:i386 (1.10.0-4) ...
Setting up libssh2-1-dev:i386 (1.11.1-1) ...
Setting up libidn2-dev:i386 (2.3.8-2) ...
Setting up libreadline8t64:i386 (8.2-6) ...
Setting up dh-strip-nondeterminism (1.14.1-2) ...
Setting up groff-base (1.23.0-7) ...
Setting up libarchive13t64:i386 (3.7.4-1.1) ...
Setting up libpython3.13-stdlib:i386 (3.13.2-2) ...
Setting up libicu-dev:i386 (76.1-3) ...
Setting up libp11-kit-dev:i386 (0.25.5-3) ...
Setting up libpython3-stdlib:i386 (3.13.2-2) ...
Setting up libgnutls30t64:i386 (3.8.9-2) ...
Setting up libgnutls-openssl27t64:i386 (3.8.9-2) ...
Setting up libnghttp2-dev:i386 (1.64.0-1) ...
Setting up python3.13 (3.13.2-2) ...
Setting up po-debconf (1.0.21+nmu1) ...
Setting up libpsl5t64:i386 (0.21.2-1.1+b1) ...
Setting up python3 (3.13.2-2) ...
Setting up man-db (2.13.0-1) ...
Not building database; man-db/auto-update is not 'true'.
Setting up libpsl-dev:i386 (0.21.2-1.1+b1) ...
Setting up libxml2-dev:i386 (2.12.7+dfsg+really2.9.14-0.3+b1) ...
Setting up libgnutls-dane0t64:i386 (3.8.9-2) ...
Setting up librtmp1:i386 (2.4+20151223.gitfa8646d.1-2+b5) ...
Setting up libgssrpc4t64:i386 (1.21.3-5) ...
Setting up libarchive-dev:i386 (3.7.4-1.1) ...
Setting up libngtcp2-crypto-gnutls8:i386 (1.11.0-1) ...
Setting up libkadm5clnt-mit12:i386 (1.21.3-5) ...
Setting up libgnutls28-dev:i386 (3.8.9-2) ...
Setting up libcurl4t64:i386 (8.13.0~rc2-2) ...
Setting up libkdb5-10t64:i386 (1.21.3-5) ...
Setting up libcurl3t64-gnutls:i386 (8.13.0~rc2-2) ...
Setting up python3-yaml (6.0.2-1+b2) ...
Setting up debhelper (13.24.1) ...
Setting up librtmp-dev:i386 (2.4+20151223.gitfa8646d.1-2+b5) ...
Setting up git (1:2.49.0-1) ...
Setting up libkadm5srv-mit12:i386 (1.21.3-5) ...
Setting up krb5-multidev:i386 (1.21.3-5) ...
Setting up libkrb5-dev:i386 (1.21.3-5) ...
Setting up libcurl4-openssl-dev:i386 (8.13.0~rc2-2) ...
Processing triggers for libc-bin (2.41-6) ...
Reading package lists...
Building dependency tree...
Reading state information...
Reading extended state information...
Initializing package states...
Writing extended state information...
Building tag database...
 -> Finished parsing the build-deps
I: Building the package
I: Running cd /build/reproducible-path/muon-meson-0.4.0/ && env PATH="/usr/sbin:/usr/bin:/sbin:/bin:/usr/games" HOME="/nonexistent/first-build" dpkg-buildpackage -us -uc -b && env PATH="/usr/sbin:/usr/bin:/sbin:/bin:/usr/games" HOME="/nonexistent/first-build" dpkg-genchanges -S  > ../muon-meson_0.4.0-1_source.changes
dpkg-buildpackage: info: source package muon-meson
dpkg-buildpackage: info: source version 0.4.0-1
dpkg-buildpackage: info: source distribution unstable
dpkg-buildpackage: info: source changed by Andrea Pappacoda <tachi@debian.org>
 dpkg-source --before-build .
dpkg-buildpackage: info: host architecture i386
 debian/rules clean
dh clean --buildsystem=none --builddir=build
   dh_auto_clean -O--buildsystem=none -O--builddir=build
   dh_autoreconf_clean -O--buildsystem=none -O--builddir=build
   dh_clean -O--buildsystem=none -O--builddir=build
 debian/rules binary
dh binary --buildsystem=none --builddir=build
   dh_update_autotools_config -O--buildsystem=none -O--builddir=build
   dh_autoreconf -O--buildsystem=none -O--builddir=build
   dh_auto_configure -O--buildsystem=none -O--builddir=build
   debian/rules override_dh_auto_build
make[1]: Entering directory '/build/reproducible-path/muon-meson-0.4.0'
CC="i686-linux-gnu-gcc" CFLAGS="-Wdate-time -D_FORTIFY_SOURCE=2 -g -O2 -Werror=implicit-function-declaration -Werror=array-bounds -Werror=clobbered -Werror=volatile-register-var -ffile-prefix-map=/build/reproducible-path/muon-meson-0.4.0=. -fstack-protector-strong -Wformat -Werror=format-security" LDFLAGS="-Wl,-z,relro -Wl,-z,now" ./bootstrap.sh build
+ dir=build
+ mkdir -p build
+ pkgconf_cmd=
+ [  = no-pkgconf ]
+ command -v pkgconf
+ pkgconf_cmd=pkgconf
+ [ -n pkgconf ]
+ pkgconf libpkgconf
+ pkgconf --cflags libpkgconf
+ pkgconf_cflags=-I/usr/include/pkgconf  -DBOOTSTRAP_HAVE_LIBPKGCONF
+ pkgconf --keep-system-libs --libs libpkgconf
+ pkgconf_libs=-L/usr/lib/i386-linux-gnu -lpkgconf 
+ i686-linux-gnu-gcc -Wdate-time -D_FORTIFY_SOURCE=2 -g -O2 -Werror=implicit-function-declaration -Werror=array-bounds -Werror=clobbered -Werror=volatile-register-var -ffile-prefix-map=/build/reproducible-path/muon-meson-0.4.0=. -fstack-protector-strong -Wformat -Werror=format-security -Wl,-z,relro -Wl,-z,now -Iinclude -I/usr/include/pkgconf -DBOOTSTRAP_HAVE_LIBPKGCONF src/amalgam.c -L/usr/lib/i386-linux-gnu -lpkgconf -o build/muon-bootstrap
In file included from src/amalgam.c:37:
src/external/readline_builtin.c: In function 'muon_readline':
src/external/readline_builtin.c:23:9: warning: ignoring return value of 'fgets' declared with attribute 'warn_unused_result' [-Wunused-result]
   23 |         fgets(buf, 2048, stdin);
      |         ^~~~~~~~~~~~~~~~~~~~~~~
In file included from src/amalgam.c:28:
src/compilers.c: In function 'compiler_cl_args_output':
src/compilers.c:1364:47: warning: '%s' directive output may be truncated writing between 4 and 2147483645 bytes into a region of size 252 [-Wformat-truncation=]
 1364 |                 snprintf(buf, BUF_SIZE_S, "/Fe%s", s1);
      |                                               ^~
In file included from /usr/include/stdio.h:970,
                 from include/lang/object.h:12,
                 from include/lang/string.h:13,
                 from include/lang/workspace.h:12,
                 from include/args.h:9,
                 from src/args.c:11,
                 from src/amalgam.c:12:
In function 'snprintf',
    inlined from 'compiler_cl_args_output' at src/compilers.c:1364:3:
/usr/include/i386-linux-gnu/bits/stdio2.h:68:10: note: '__builtin___snprintf_chk' output between 8 and 2147483649 bytes into a destination of size 255
   68 |   return __builtin___snprintf_chk (__s, __n, __USE_FORTIFY_LEVEL - 1,
      |          ^~~~~~~~~~~~~~~~~~~~~~~~~~~~~~~~~~~~~~~~~~~~~~~~~~~~~~~~~~~~
   69 |                                    __glibc_objsize (__s), __fmt,
      |                                    ~~~~~~~~~~~~~~~~~~~~~~~~~~~~~
   70 |                                    __va_arg_pack ());
      |                                    ~~~~~~~~~~~~~~~~~
build/muon-bootstrap setup -Dprefix=/usr -Dsamurai=disabled -Dreadline=bestline build
detected host compiler for c: gcc '14.2.0' (['i686-linux-gnu-gcc']), linker: ld (['i686-linux-gnu-ld']), static_linker: ar (['i686-linux-gnu-ar'])
detected build compiler for c: gcc '14.2.0' (['i686-linux-gnu-gcc']), linker: ld (['i686-linux-gnu-ld']), static_linker: ar (['i686-linux-gnu-ar'])
configuring 'muon', version: 0.4.0
configuring '/build/reproducible-path/muon-meson-0.4.0/build/version.sh'
c compiler: supports argument '-Wendif-labels': YES
c compiler: supports argument '-Wimplicit-fallthrough=2': YES
c compiler: supports argument '-Winit-self': YES
c compiler: supports argument '-Wlogical-op': YES
c compiler: supports argument '-Wmissing-include-dirs': YES
c compiler: supports argument '-Wno-missing-braces': YES
c compiler: supports argument '-Wno-missing-field-initializers': YES
c compiler: supports argument '-Wno-unused-parameter': YES
c compiler: supports argument '-Wold-style-definition': YES
c compiler: supports argument '-Woverflow': YES
c compiler: supports argument '-Wstrict-aliasing=2': YES
c compiler: supports argument '-Wstrict-prototypes': YES
c compiler: supports argument '-Wundef': YES
c compiler: supports argument '-Wvla': YES
c compiler: supports argument '-fstrict-aliasing': YES
c compiler: supports argument '-std=c99': YES
configuring '/build/reproducible-path/muon-meson-0.4.0/build/src/version.c'
found dependency libcurl version 8.13.0-rc2 for the host machine
found dependency libarchive version 3.7.4 for the host machine
found dependency libpkgconf version 1.8.1 for the host machine
[tinyjson] entering subproject 'tinyjson'
[tinyjson] configuring 'tiny-json', version: undefined
found dependency 'tinyjson' (declared dependency) version undefined static for the host machine
[bestline] entering subproject 'bestline'
[bestline] configuring 'bestline', version: undefined
found dependency 'bestline' (declared dependency) version undefined static for the host machine
warn dependency ['tracy'] not found
[meson-docs] entering subproject 'meson-docs'
[meson-docs] configuring 'meson', version: undefined

summary:
- muon 0.4.0
      libcurl: true
      libarchive: true
      libpkgconf: true
      bestline: true
      docs: true
setup complete
ninja -C build --verbose
ninja: Entering directory `build'
[1/133] /build/reproducible-path/muon-meson-0.4.0/build/muon-bootstrap internal exe -c doc/muon.1 -f ../doc/muon.1.scd -e /build/reproducible-path/muon-meson-0.4.0/build/.muon/custom_tgt_env/muon_1_scd1_dat -- /usr/bin/scdoc
[2/133] /build/reproducible-path/muon-meson-0.4.0/build/muon-bootstrap internal exe -c doc/meson.build.5 -f ../doc/meson.build.5.scd -e /build/reproducible-path/muon-meson-0.4.0/build/.muon/custom_tgt_env/meson_build_5_scd2_dat -- /usr/bin/scdoc
[3/133] i686-linux-gnu-gcc -g -O0 -Wpedantic -Wextra -Wall -fdiagnostics-color=always -g -O2 -Werror=implicit-function-declaration -Werror=array-bounds -Werror=clobbered -Werror=volatile-register-var -ffile-prefix-map=/build/reproducible-path/muon-meson-0.4.0=. -fstack-protector-strong -Wformat -Werror=format-security -DBOOTSTRAP_NO_SAMU -Wdate-time -D_FORTIFY_SOURCE=2 -I tools -I ../tools -I ../include -DMUON_PLATFORM_posix -DMUON_ENDIAN=0 -MD -MQ tools/embedder.p/embedder.c.o -MF tools/embedder.p/embedder.c.o.d -o tools/embedder.p/embedder.c.o -c ../tools/embedder.c
[4/133] i686-linux-gnu-gcc  -o tools/embedder tools/embedder.p/embedder.c.o -Wl,--as-needed -Wl,--no-undefined -g -O2 -Werror=implicit-function-declaration -Werror=array-bounds -Werror=clobbered -Werror=volatile-register-var -ffile-prefix-map=/build/reproducible-path/muon-meson-0.4.0=. -fstack-protector-strong -Wformat -Werror=format-security -DBOOTSTRAP_NO_SAMU -Wl,-z,relro -Wl,-z,now
[5/133] /build/reproducible-path/muon-meson-0.4.0/build/muon-bootstrap internal exe -c src/script/embedded_files.h -e /build/reproducible-path/muon-meson-0.4.0/build/.muon/custom_tgt_env/embedded_files0_dat -- tools/embedder ../src/script/commands/copyfile.meson commands/copyfile.meson ../src/script/commands/coverage.meson commands/coverage.meson ../src/script/commands/delete_suffix.meson commands/delete_suffix.meson ../src/script/commands/i18n/gettext.meson commands/i18n/gettext.meson ../src/script/commands/i18n/itstool.meson commands/i18n/itstool.meson ../src/script/commands/i18n/msgfmthelper.meson commands/i18n/msgfmthelper.meson ../src/script/commands/vcs_tagger.meson commands/vcs_tagger.meson ../src/script/html/docs.html html/docs.html ../src/script/html/test_out.html html/test_out.html ../src/script/lib/cmake_prelude.meson lib/cmake_prelude.meson ../src/script/modules/_test.meson modules/_test.meson ../src/script/modules/gnome.meson modules/gnome.meson ../src/script/modules/i18n.meson modules/i18n.meson ../src/script/options/global.meson options/global.meson ../src/script/options/per_project.meson options/per_project.meson ../src/script/python/python_info.py python/python_info.py ../src/script/runtime/dependencies.meson runtime/dependencies.meson
[6/133] i686-linux-gnu-gcc -g -O0 -Wpedantic -Wextra -Wall -fdiagnostics-color=always -g -O2 -Werror=implicit-function-declaration -Werror=array-bounds -Werror=clobbered -Werror=volatile-register-var -ffile-prefix-map=/build/reproducible-path/muon-meson-0.4.0=. -fstack-protector-strong -Wformat -Werror=format-security -DBOOTSTRAP_NO_SAMU -Wdate-time -D_FORTIFY_SOURCE=2 -fPIC -I subprojects/tinyjson -I ../subprojects/tinyjson -MD -MQ subprojects/tinyjson/libtiny-json.a.p/tiny-json.c.o -MF subprojects/tinyjson/libtiny-json.a.p/tiny-json.c.o.d -o subprojects/tinyjson/libtiny-json.a.p/tiny-json.c.o -c ../subprojects/tinyjson/tiny-json.c
[7/133] /build/reproducible-path/muon-meson-0.4.0/build/muon-bootstrap internal exe -R subprojects/tinyjson/libtiny-json.a -- i686-linux-gnu-ar csrD subprojects/tinyjson/libtiny-json.a subprojects/tinyjson/libtiny-json.a.p/tiny-json.c.o
[8/133] /build/reproducible-path/muon-meson-0.4.0/build/muon-bootstrap internal exe -e /build/reproducible-path/muon-meson-0.4.0/build/.muon/custom_tgt_env/meson_docs_h5_dat -- ../subprojects/meson-docs/docs/genrefman.py -q -l fastyaml -g c -o subprojects/meson-docs/meson_docs.h --no-modules
| WARNING: YAML reference manual loaded using the best-effort fastyaml loader.  Results are not guaranteed to be stable or correct.
[9/133] i686-linux-gnu-gcc -g -O0 -Wpedantic -Wextra -Wall -fdiagnostics-color=always -g -O2 -Werror=implicit-function-declaration -Werror=array-bounds -Werror=clobbered -Werror=volatile-register-var -ffile-prefix-map=/build/reproducible-path/muon-meson-0.4.0=. -fstack-protector-strong -Wformat -Werror=format-security -DBOOTSTRAP_NO_SAMU -Wdate-time -D_FORTIFY_SOURCE=2 -Wendif-labels -Wimplicit-fallthrough=2 -Winit-self -Wlogical-op -Wmissing-include-dirs -Wno-missing-braces -Wno-missing-field-initializers -Wno-unused-parameter -Wold-style-definition -Woverflow -Wstrict-aliasing=2 -Wstrict-prototypes -Wundef -Wvla -fstrict-aliasing -std=c99 -DMUON_BOOTSTRAPPED -I . -I .. -I ../include -I /usr/include/i386-linux-gnu -I /usr/include/p11-kit-1 -I /usr/include/pkgconf -I subprojects/tinyjson -I ../subprojects/tinyjson -I subprojects/bestline -I ../subprojects/bestline -I src/script -I subprojects/meson-docs -DMUON_PLATFORM_posix -DMUON_ENDIAN=0 -DHAVE_MESON_DOCS_H -MD -MQ muon.p/src/backend/output.c.o -MF muon.p/src/backend/output.c.o.d -o muon.p/src/backend/output.c.o -c ../src/backend/output.c
[10/133] i686-linux-gnu-gcc -g -O0 -Wpedantic -Wextra -Wall -fdiagnostics-color=always -g -O2 -Werror=implicit-function-declaration -Werror=array-bounds -Werror=clobbered -Werror=volatile-register-var -ffile-prefix-map=/build/reproducible-path/muon-meson-0.4.0=. -fstack-protector-strong -Wformat -Werror=format-security -DBOOTSTRAP_NO_SAMU -Wdate-time -D_FORTIFY_SOURCE=2 -Wendif-labels -Wimplicit-fallthrough=2 -Winit-self -Wlogical-op -Wmissing-include-dirs -Wno-missing-braces -Wno-missing-field-initializers -Wno-unused-parameter -Wold-style-definition -Woverflow -Wstrict-aliasing=2 -Wstrict-prototypes -Wundef -Wvla -fstrict-aliasing -std=c99 -DMUON_BOOTSTRAPPED -I . -I .. -I ../include -I /usr/include/i386-linux-gnu -I /usr/include/p11-kit-1 -I /usr/include/pkgconf -I subprojects/tinyjson -I ../subprojects/tinyjson -I subprojects/bestline -I ../subprojects/bestline -I src/script -I subprojects/meson-docs -DMUON_PLATFORM_posix -DMUON_ENDIAN=0 -DHAVE_MESON_DOCS_H -MD -MQ muon.p/src/backend/ninja/alias_target.c.o -MF muon.p/src/backend/ninja/alias_target.c.o.d -o muon.p/src/backend/ninja/alias_target.c.o -c ../src/backend/ninja/alias_target.c
[11/133] i686-linux-gnu-gcc -g -O0 -Wpedantic -Wextra -Wall -fdiagnostics-color=always -g -O2 -Werror=implicit-function-declaration -Werror=array-bounds -Werror=clobbered -Werror=volatile-register-var -ffile-prefix-map=/build/reproducible-path/muon-meson-0.4.0=. -fstack-protector-strong -Wformat -Werror=format-security -DBOOTSTRAP_NO_SAMU -Wdate-time -D_FORTIFY_SOURCE=2 -Wendif-labels -Wimplicit-fallthrough=2 -Winit-self -Wlogical-op -Wmissing-include-dirs -Wno-missing-braces -Wno-missing-field-initializers -Wno-unused-parameter -Wold-style-definition -Woverflow -Wstrict-aliasing=2 -Wstrict-prototypes -Wundef -Wvla -fstrict-aliasing -std=c99 -DMUON_BOOTSTRAPPED -I . -I .. -I ../include -I /usr/include/i386-linux-gnu -I /usr/include/p11-kit-1 -I /usr/include/pkgconf -I subprojects/tinyjson -I ../subprojects/tinyjson -I subprojects/bestline -I ../subprojects/bestline -I src/script -I subprojects/meson-docs -DMUON_PLATFORM_posix -DMUON_ENDIAN=0 -DHAVE_MESON_DOCS_H -MD -MQ muon.p/src/backend/ninja/coverage.c.o -MF muon.p/src/backend/ninja/coverage.c.o.d -o muon.p/src/backend/ninja/coverage.c.o -c ../src/backend/ninja/coverage.c
[12/133] i686-linux-gnu-gcc -g -O0 -Wpedantic -Wextra -Wall -fdiagnostics-color=always -g -O2 -Werror=implicit-function-declaration -Werror=array-bounds -Werror=clobbered -Werror=volatile-register-var -ffile-prefix-map=/build/reproducible-path/muon-meson-0.4.0=. -fstack-protector-strong -Wformat -Werror=format-security -DBOOTSTRAP_NO_SAMU -Wdate-time -D_FORTIFY_SOURCE=2 -Wendif-labels -Wimplicit-fallthrough=2 -Winit-self -Wlogical-op -Wmissing-include-dirs -Wno-missing-braces -Wno-missing-field-initializers -Wno-unused-parameter -Wold-style-definition -Woverflow -Wstrict-aliasing=2 -Wstrict-prototypes -Wundef -Wvla -fstrict-aliasing -std=c99 -DMUON_BOOTSTRAPPED -I . -I .. -I ../include -I /usr/include/i386-linux-gnu -I /usr/include/p11-kit-1 -I /usr/include/pkgconf -I subprojects/tinyjson -I ../subprojects/tinyjson -I subprojects/bestline -I ../subprojects/bestline -I src/script -I subprojects/meson-docs -DMUON_PLATFORM_posix -DMUON_ENDIAN=0 -DHAVE_MESON_DOCS_H -MD -MQ muon.p/src/backend/ninja/custom_target.c.o -MF muon.p/src/backend/ninja/custom_target.c.o.d -o muon.p/src/backend/ninja/custom_target.c.o -c ../src/backend/ninja/custom_target.c
[13/133] i686-linux-gnu-gcc -g -O0 -Wpedantic -Wextra -Wall -fdiagnostics-color=always -g -O2 -Werror=implicit-function-declaration -Werror=array-bounds -Werror=clobbered -Werror=volatile-register-var -ffile-prefix-map=/build/reproducible-path/muon-meson-0.4.0=. -fstack-protector-strong -Wformat -Werror=format-security -DBOOTSTRAP_NO_SAMU -Wdate-time -D_FORTIFY_SOURCE=2 -Wendif-labels -Wimplicit-fallthrough=2 -Winit-self -Wlogical-op -Wmissing-include-dirs -Wno-missing-braces -Wno-missing-field-initializers -Wno-unused-parameter -Wold-style-definition -Woverflow -Wstrict-aliasing=2 -Wstrict-prototypes -Wundef -Wvla -fstrict-aliasing -std=c99 -DMUON_BOOTSTRAPPED -I . -I .. -I ../include -I /usr/include/i386-linux-gnu -I /usr/include/p11-kit-1 -I /usr/include/pkgconf -I subprojects/tinyjson -I ../subprojects/tinyjson -I subprojects/bestline -I ../subprojects/bestline -I src/script -I subprojects/meson-docs -DMUON_PLATFORM_posix -DMUON_ENDIAN=0 -DHAVE_MESON_DOCS_H -MD -MQ muon.p/src/datastructures/arr.c.o -MF muon.p/src/datastructures/arr.c.o.d -o muon.p/src/datastructures/arr.c.o -c ../src/datastructures/arr.c
[14/133] i686-linux-gnu-gcc -g -O0 -Wpedantic -Wextra -Wall -fdiagnostics-color=always -g -O2 -Werror=implicit-function-declaration -Werror=array-bounds -Werror=clobbered -Werror=volatile-register-var -ffile-prefix-map=/build/reproducible-path/muon-meson-0.4.0=. -fstack-protector-strong -Wformat -Werror=format-security -DBOOTSTRAP_NO_SAMU -Wdate-time -D_FORTIFY_SOURCE=2 -Wendif-labels -Wimplicit-fallthrough=2 -Winit-self -Wlogical-op -Wmissing-include-dirs -Wno-missing-braces -Wno-missing-field-initializers -Wno-unused-parameter -Wold-style-definition -Woverflow -Wstrict-aliasing=2 -Wstrict-prototypes -Wundef -Wvla -fstrict-aliasing -std=c99 -DMUON_BOOTSTRAPPED -I . -I .. -I ../include -I /usr/include/i386-linux-gnu -I /usr/include/p11-kit-1 -I /usr/include/pkgconf -I subprojects/tinyjson -I ../subprojects/tinyjson -I subprojects/bestline -I ../subprojects/bestline -I src/script -I subprojects/meson-docs -DMUON_PLATFORM_posix -DMUON_ENDIAN=0 -DHAVE_MESON_DOCS_H -MD -MQ muon.p/src/datastructures/bucket_arr.c.o -MF muon.p/src/datastructures/bucket_arr.c.o.d -o muon.p/src/datastructures/bucket_arr.c.o -c ../src/datastructures/bucket_arr.c
[15/133] i686-linux-gnu-gcc -g -O0 -Wpedantic -Wextra -Wall -fdiagnostics-color=always -g -O2 -Werror=implicit-function-declaration -Werror=array-bounds -Werror=clobbered -Werror=volatile-register-var -ffile-prefix-map=/build/reproducible-path/muon-meson-0.4.0=. -fstack-protector-strong -Wformat -Werror=format-security -DBOOTSTRAP_NO_SAMU -Wdate-time -D_FORTIFY_SOURCE=2 -Wendif-labels -Wimplicit-fallthrough=2 -Winit-self -Wlogical-op -Wmissing-include-dirs -Wno-missing-braces -Wno-missing-field-initializers -Wno-unused-parameter -Wold-style-definition -Woverflow -Wstrict-aliasing=2 -Wstrict-prototypes -Wundef -Wvla -fstrict-aliasing -std=c99 -DMUON_BOOTSTRAPPED -I . -I .. -I ../include -I /usr/include/i386-linux-gnu -I /usr/include/p11-kit-1 -I /usr/include/pkgconf -I subprojects/tinyjson -I ../subprojects/tinyjson -I subprojects/bestline -I ../subprojects/bestline -I src/script -I subprojects/meson-docs -DMUON_PLATFORM_posix -DMUON_ENDIAN=0 -DHAVE_MESON_DOCS_H -MD -MQ muon.p/src/backend/ninja.c.o -MF muon.p/src/backend/ninja.c.o.d -o muon.p/src/backend/ninja.c.o -c ../src/backend/ninja.c
[16/133] i686-linux-gnu-gcc -g -O0 -Wpedantic -Wextra -Wall -fdiagnostics-color=always -g -O2 -Werror=implicit-function-declaration -Werror=array-bounds -Werror=clobbered -Werror=volatile-register-var -ffile-prefix-map=/build/reproducible-path/muon-meson-0.4.0=. -fstack-protector-strong -Wformat -Werror=format-security -DBOOTSTRAP_NO_SAMU -Wdate-time -D_FORTIFY_SOURCE=2 -Wendif-labels -Wimplicit-fallthrough=2 -Winit-self -Wlogical-op -Wmissing-include-dirs -Wno-missing-braces -Wno-missing-field-initializers -Wno-unused-parameter -Wold-style-definition -Woverflow -Wstrict-aliasing=2 -Wstrict-prototypes -Wundef -Wvla -fstrict-aliasing -std=c99 -DMUON_BOOTSTRAPPED -I . -I .. -I ../include -I /usr/include/i386-linux-gnu -I /usr/include/p11-kit-1 -I /usr/include/pkgconf -I subprojects/tinyjson -I ../subprojects/tinyjson -I subprojects/bestline -I ../subprojects/bestline -I src/script -I subprojects/meson-docs -DMUON_PLATFORM_posix -DMUON_ENDIAN=0 -DHAVE_MESON_DOCS_H -MD -MQ muon.p/src/datastructures/stack.c.o -MF muon.p/src/datastructures/stack.c.o.d -o muon.p/src/datastructures/stack.c.o -c ../src/datastructures/stack.c
[17/133] i686-linux-gnu-gcc -g -O0 -Wpedantic -Wextra -Wall -fdiagnostics-color=always -g -O2 -Werror=implicit-function-declaration -Werror=array-bounds -Werror=clobbered -Werror=volatile-register-var -ffile-prefix-map=/build/reproducible-path/muon-meson-0.4.0=. -fstack-protector-strong -Wformat -Werror=format-security -DBOOTSTRAP_NO_SAMU -Wdate-time -D_FORTIFY_SOURCE=2 -Wendif-labels -Wimplicit-fallthrough=2 -Winit-self -Wlogical-op -Wmissing-include-dirs -Wno-missing-braces -Wno-missing-field-initializers -Wno-unused-parameter -Wold-style-definition -Woverflow -Wstrict-aliasing=2 -Wstrict-prototypes -Wundef -Wvla -fstrict-aliasing -std=c99 -DMUON_BOOTSTRAPPED -I . -I .. -I ../include -I /usr/include/i386-linux-gnu -I /usr/include/p11-kit-1 -I /usr/include/pkgconf -I subprojects/tinyjson -I ../subprojects/tinyjson -I subprojects/bestline -I ../subprojects/bestline -I src/script -I subprojects/meson-docs -DMUON_PLATFORM_posix -DMUON_ENDIAN=0 -DHAVE_MESON_DOCS_H -MD -MQ muon.p/src/backend/backend.c.o -MF muon.p/src/backend/backend.c.o.d -o muon.p/src/backend/backend.c.o -c ../src/backend/backend.c
[18/133] i686-linux-gnu-gcc -g -O0 -Wpedantic -Wextra -Wall -fdiagnostics-color=always -g -O2 -Werror=implicit-function-declaration -Werror=array-bounds -Werror=clobbered -Werror=volatile-register-var -ffile-prefix-map=/build/reproducible-path/muon-meson-0.4.0=. -fstack-protector-strong -Wformat -Werror=format-security -DBOOTSTRAP_NO_SAMU -Wdate-time -D_FORTIFY_SOURCE=2 -Wendif-labels -Wimplicit-fallthrough=2 -Winit-self -Wlogical-op -Wmissing-include-dirs -Wno-missing-braces -Wno-missing-field-initializers -Wno-unused-parameter -Wold-style-definition -Woverflow -Wstrict-aliasing=2 -Wstrict-prototypes -Wundef -Wvla -fstrict-aliasing -std=c99 -DMUON_BOOTSTRAPPED -I . -I .. -I ../include -I /usr/include/i386-linux-gnu -I /usr/include/p11-kit-1 -I /usr/include/pkgconf -I subprojects/tinyjson -I ../subprojects/tinyjson -I subprojects/bestline -I ../subprojects/bestline -I src/script -I subprojects/meson-docs -DMUON_PLATFORM_posix -DMUON_ENDIAN=0 -DHAVE_MESON_DOCS_H -MD -MQ muon.p/src/formats/lines.c.o -MF muon.p/src/formats/lines.c.o.d -o muon.p/src/formats/lines.c.o -c ../src/formats/lines.c
[19/133] i686-linux-gnu-gcc -g -O0 -Wpedantic -Wextra -Wall -fdiagnostics-color=always -g -O2 -Werror=implicit-function-declaration -Werror=array-bounds -Werror=clobbered -Werror=volatile-register-var -ffile-prefix-map=/build/reproducible-path/muon-meson-0.4.0=. -fstack-protector-strong -Wformat -Werror=format-security -DBOOTSTRAP_NO_SAMU -Wdate-time -D_FORTIFY_SOURCE=2 -Wendif-labels -Wimplicit-fallthrough=2 -Winit-self -Wlogical-op -Wmissing-include-dirs -Wno-missing-braces -Wno-missing-field-initializers -Wno-unused-parameter -Wold-style-definition -Woverflow -Wstrict-aliasing=2 -Wstrict-prototypes -Wundef -Wvla -fstrict-aliasing -std=c99 -DMUON_BOOTSTRAPPED -I . -I .. -I ../include -I /usr/include/i386-linux-gnu -I /usr/include/p11-kit-1 -I /usr/include/pkgconf -I subprojects/tinyjson -I ../subprojects/tinyjson -I subprojects/bestline -I ../subprojects/bestline -I src/script -I subprojects/meson-docs -DMUON_PLATFORM_posix -DMUON_ENDIAN=0 -DHAVE_MESON_DOCS_H -MD -MQ muon.p/src/backend/ninja/build_target.c.o -MF muon.p/src/backend/ninja/build_target.c.o.d -o muon.p/src/backend/ninja/build_target.c.o -c ../src/backend/ninja/build_target.c
[20/133] i686-linux-gnu-gcc -g -O0 -Wpedantic -Wextra -Wall -fdiagnostics-color=always -g -O2 -Werror=implicit-function-declaration -Werror=array-bounds -Werror=clobbered -Werror=volatile-register-var -ffile-prefix-map=/build/reproducible-path/muon-meson-0.4.0=. -fstack-protector-strong -Wformat -Werror=format-security -DBOOTSTRAP_NO_SAMU -Wdate-time -D_FORTIFY_SOURCE=2 -Wendif-labels -Wimplicit-fallthrough=2 -Winit-self -Wlogical-op -Wmissing-include-dirs -Wno-missing-braces -Wno-missing-field-initializers -Wno-unused-parameter -Wold-style-definition -Woverflow -Wstrict-aliasing=2 -Wstrict-prototypes -Wundef -Wvla -fstrict-aliasing -std=c99 -DMUON_BOOTSTRAPPED -I . -I .. -I ../include -I /usr/include/i386-linux-gnu -I /usr/include/p11-kit-1 -I /usr/include/pkgconf -I subprojects/tinyjson -I ../subprojects/tinyjson -I subprojects/bestline -I ../subprojects/bestline -I src/script -I subprojects/meson-docs -DMUON_PLATFORM_posix -DMUON_ENDIAN=0 -DHAVE_MESON_DOCS_H -MD -MQ muon.p/src/formats/ini.c.o -MF muon.p/src/formats/ini.c.o.d -o muon.p/src/formats/ini.c.o -c ../src/formats/ini.c
[21/133] i686-linux-gnu-gcc -g -O0 -Wpedantic -Wextra -Wall -fdiagnostics-color=always -g -O2 -Werror=implicit-function-declaration -Werror=array-bounds -Werror=clobbered -Werror=volatile-register-var -ffile-prefix-map=/build/reproducible-path/muon-meson-0.4.0=. -fstack-protector-strong -Wformat -Werror=format-security -DBOOTSTRAP_NO_SAMU -Wdate-time -D_FORTIFY_SOURCE=2 -Wendif-labels -Wimplicit-fallthrough=2 -Winit-self -Wlogical-op -Wmissing-include-dirs -Wno-missing-braces -Wno-missing-field-initializers -Wno-unused-parameter -Wold-style-definition -Woverflow -Wstrict-aliasing=2 -Wstrict-prototypes -Wundef -Wvla -fstrict-aliasing -std=c99 -DMUON_BOOTSTRAPPED -I . -I .. -I ../include -I /usr/include/i386-linux-gnu -I /usr/include/p11-kit-1 -I /usr/include/pkgconf -I subprojects/tinyjson -I ../subprojects/tinyjson -I subprojects/bestline -I ../subprojects/bestline -I src/script -I subprojects/meson-docs -DMUON_PLATFORM_posix -DMUON_ENDIAN=0 -DHAVE_MESON_DOCS_H -MD -MQ muon.p/src/formats/tap.c.o -MF muon.p/src/formats/tap.c.o.d -o muon.p/src/formats/tap.c.o -c ../src/formats/tap.c
[22/133] i686-linux-gnu-gcc -g -O0 -Wpedantic -Wextra -Wall -fdiagnostics-color=always -g -O2 -Werror=implicit-function-declaration -Werror=array-bounds -Werror=clobbered -Werror=volatile-register-var -ffile-prefix-map=/build/reproducible-path/muon-meson-0.4.0=. -fstack-protector-strong -Wformat -Werror=format-security -DBOOTSTRAP_NO_SAMU -Wdate-time -D_FORTIFY_SOURCE=2 -Wendif-labels -Wimplicit-fallthrough=2 -Winit-self -Wlogical-op -Wmissing-include-dirs -Wno-missing-braces -Wno-missing-field-initializers -Wno-unused-parameter -Wold-style-definition -Woverflow -Wstrict-aliasing=2 -Wstrict-prototypes -Wundef -Wvla -fstrict-aliasing -std=c99 -DMUON_BOOTSTRAPPED -I . -I .. -I ../include -I /usr/include/i386-linux-gnu -I /usr/include/p11-kit-1 -I /usr/include/pkgconf -I subprojects/tinyjson -I ../subprojects/tinyjson -I subprojects/bestline -I ../subprojects/bestline -I src/script -I subprojects/meson-docs -DMUON_PLATFORM_posix -DMUON_ENDIAN=0 -DHAVE_MESON_DOCS_H -MD -MQ muon.p/src/functions/boolean.c.o -MF muon.p/src/functions/boolean.c.o.d -o muon.p/src/functions/boolean.c.o -c ../src/functions/boolean.c
[23/133] i686-linux-gnu-gcc -g -O0 -Wpedantic -Wextra -Wall -fdiagnostics-color=always -g -O2 -Werror=implicit-function-declaration -Werror=array-bounds -Werror=clobbered -Werror=volatile-register-var -ffile-prefix-map=/build/reproducible-path/muon-meson-0.4.0=. -fstack-protector-strong -Wformat -Werror=format-security -DBOOTSTRAP_NO_SAMU -Wdate-time -D_FORTIFY_SOURCE=2 -Wendif-labels -Wimplicit-fallthrough=2 -Winit-self -Wlogical-op -Wmissing-include-dirs -Wno-missing-braces -Wno-missing-field-initializers -Wno-unused-parameter -Wold-style-definition -Woverflow -Wstrict-aliasing=2 -Wstrict-prototypes -Wundef -Wvla -fstrict-aliasing -std=c99 -DMUON_BOOTSTRAPPED -I . -I .. -I ../include -I /usr/include/i386-linux-gnu -I /usr/include/p11-kit-1 -I /usr/include/pkgconf -I subprojects/tinyjson -I ../subprojects/tinyjson -I subprojects/bestline -I ../subprojects/bestline -I src/script -I subprojects/meson-docs -DMUON_PLATFORM_posix -DMUON_ENDIAN=0 -DHAVE_MESON_DOCS_H -MD -MQ muon.p/src/datastructures/hash.c.o -MF muon.p/src/datastructures/hash.c.o.d -o muon.p/src/datastructures/hash.c.o -c ../src/datastructures/hash.c
[24/133] i686-linux-gnu-gcc -g -O0 -Wpedantic -Wextra -Wall -fdiagnostics-color=always -g -O2 -Werror=implicit-function-declaration -Werror=array-bounds -Werror=clobbered -Werror=volatile-register-var -ffile-prefix-map=/build/reproducible-path/muon-meson-0.4.0=. -fstack-protector-strong -Wformat -Werror=format-security -DBOOTSTRAP_NO_SAMU -Wdate-time -D_FORTIFY_SOURCE=2 -Wendif-labels -Wimplicit-fallthrough=2 -Winit-self -Wlogical-op -Wmissing-include-dirs -Wno-missing-braces -Wno-missing-field-initializers -Wno-unused-parameter -Wold-style-definition -Woverflow -Wstrict-aliasing=2 -Wstrict-prototypes -Wundef -Wvla -fstrict-aliasing -std=c99 -DMUON_BOOTSTRAPPED -I . -I .. -I ../include -I /usr/include/i386-linux-gnu -I /usr/include/p11-kit-1 -I /usr/include/pkgconf -I subprojects/tinyjson -I ../subprojects/tinyjson -I subprojects/bestline -I ../subprojects/bestline -I src/script -I subprojects/meson-docs -DMUON_PLATFORM_posix -DMUON_ENDIAN=0 -DHAVE_MESON_DOCS_H -MD -MQ muon.p/src/functions/both_libs.c.o -MF muon.p/src/functions/both_libs.c.o.d -o muon.p/src/functions/both_libs.c.o -c ../src/functions/both_libs.c
[25/133] i686-linux-gnu-gcc -g -O0 -Wpedantic -Wextra -Wall -fdiagnostics-color=always -g -O2 -Werror=implicit-function-declaration -Werror=array-bounds -Werror=clobbered -Werror=volatile-register-var -ffile-prefix-map=/build/reproducible-path/muon-meson-0.4.0=. -fstack-protector-strong -Wformat -Werror=format-security -DBOOTSTRAP_NO_SAMU -Wdate-time -D_FORTIFY_SOURCE=2 -Wendif-labels -Wimplicit-fallthrough=2 -Winit-self -Wlogical-op -Wmissing-include-dirs -Wno-missing-braces -Wno-missing-field-initializers -Wno-unused-parameter -Wold-style-definition -Woverflow -Wstrict-aliasing=2 -Wstrict-prototypes -Wundef -Wvla -fstrict-aliasing -std=c99 -DMUON_BOOTSTRAPPED -I . -I .. -I ../include -I /usr/include/i386-linux-gnu -I /usr/include/p11-kit-1 -I /usr/include/pkgconf -I subprojects/tinyjson -I ../subprojects/tinyjson -I subprojects/bestline -I ../subprojects/bestline -I src/script -I subprojects/meson-docs -DMUON_PLATFORM_posix -DMUON_ENDIAN=0 -DHAVE_MESON_DOCS_H -MD -MQ muon.p/src/formats/editorconfig.c.o -MF muon.p/src/formats/editorconfig.c.o.d -o muon.p/src/formats/editorconfig.c.o -c ../src/formats/editorconfig.c
[26/133] i686-linux-gnu-gcc -g -O0 -Wpedantic -Wextra -Wall -fdiagnostics-color=always -g -O2 -Werror=implicit-function-declaration -Werror=array-bounds -Werror=clobbered -Werror=volatile-register-var -ffile-prefix-map=/build/reproducible-path/muon-meson-0.4.0=. -fstack-protector-strong -Wformat -Werror=format-security -DBOOTSTRAP_NO_SAMU -Wdate-time -D_FORTIFY_SOURCE=2 -Wendif-labels -Wimplicit-fallthrough=2 -Winit-self -Wlogical-op -Wmissing-include-dirs -Wno-missing-braces -Wno-missing-field-initializers -Wno-unused-parameter -Wold-style-definition -Woverflow -Wstrict-aliasing=2 -Wstrict-prototypes -Wundef -Wvla -fstrict-aliasing -std=c99 -DMUON_BOOTSTRAPPED -I . -I .. -I ../include -I /usr/include/i386-linux-gnu -I /usr/include/p11-kit-1 -I /usr/include/pkgconf -I subprojects/tinyjson -I ../subprojects/tinyjson -I subprojects/bestline -I ../subprojects/bestline -I src/script -I subprojects/meson-docs -DMUON_PLATFORM_posix -DMUON_ENDIAN=0 -DHAVE_MESON_DOCS_H -MD -MQ muon.p/src/formats/xml.c.o -MF muon.p/src/formats/xml.c.o.d -o muon.p/src/formats/xml.c.o -c ../src/formats/xml.c
[27/133] i686-linux-gnu-gcc -g -O0 -Wpedantic -Wextra -Wall -fdiagnostics-color=always -g -O2 -Werror=implicit-function-declaration -Werror=array-bounds -Werror=clobbered -Werror=volatile-register-var -ffile-prefix-map=/build/reproducible-path/muon-meson-0.4.0=. -fstack-protector-strong -Wformat -Werror=format-security -DBOOTSTRAP_NO_SAMU -Wdate-time -D_FORTIFY_SOURCE=2 -Wendif-labels -Wimplicit-fallthrough=2 -Winit-self -Wlogical-op -Wmissing-include-dirs -Wno-missing-braces -Wno-missing-field-initializers -Wno-unused-parameter -Wold-style-definition -Woverflow -Wstrict-aliasing=2 -Wstrict-prototypes -Wundef -Wvla -fstrict-aliasing -std=c99 -DMUON_BOOTSTRAPPED -I . -I .. -I ../include -I /usr/include/i386-linux-gnu -I /usr/include/p11-kit-1 -I /usr/include/pkgconf -I subprojects/tinyjson -I ../subprojects/tinyjson -I subprojects/bestline -I ../subprojects/bestline -I src/script -I subprojects/meson-docs -DMUON_PLATFORM_posix -DMUON_ENDIAN=0 -DHAVE_MESON_DOCS_H -MD -MQ muon.p/src/backend/introspect.c.o -MF muon.p/src/backend/introspect.c.o.d -o muon.p/src/backend/introspect.c.o -c ../src/backend/introspect.c
[28/133] i686-linux-gnu-gcc -g -O0 -Wpedantic -Wextra -Wall -fdiagnostics-color=always -g -O2 -Werror=implicit-function-declaration -Werror=array-bounds -Werror=clobbered -Werror=volatile-register-var -ffile-prefix-map=/build/reproducible-path/muon-meson-0.4.0=. -fstack-protector-strong -Wformat -Werror=format-security -DBOOTSTRAP_NO_SAMU -Wdate-time -D_FORTIFY_SOURCE=2 -Wendif-labels -Wimplicit-fallthrough=2 -Winit-self -Wlogical-op -Wmissing-include-dirs -Wno-missing-braces -Wno-missing-field-initializers -Wno-unused-parameter -Wold-style-definition -Woverflow -Wstrict-aliasing=2 -Wstrict-prototypes -Wundef -Wvla -fstrict-aliasing -std=c99 -DMUON_BOOTSTRAPPED -I . -I .. -I ../include -I /usr/include/i386-linux-gnu -I /usr/include/p11-kit-1 -I /usr/include/pkgconf -I subprojects/tinyjson -I ../subprojects/tinyjson -I subprojects/bestline -I ../subprojects/bestline -I src/script -I subprojects/meson-docs -DMUON_PLATFORM_posix -DMUON_ENDIAN=0 -DHAVE_MESON_DOCS_H -MD -MQ muon.p/src/backend/ninja/rules.c.o -MF muon.p/src/backend/ninja/rules.c.o.d -o muon.p/src/backend/ninja/rules.c.o -c ../src/backend/ninja/rules.c
[29/133] i686-linux-gnu-gcc -g -O0 -Wpedantic -Wextra -Wall -fdiagnostics-color=always -g -O2 -Werror=implicit-function-declaration -Werror=array-bounds -Werror=clobbered -Werror=volatile-register-var -ffile-prefix-map=/build/reproducible-path/muon-meson-0.4.0=. -fstack-protector-strong -Wformat -Werror=format-security -DBOOTSTRAP_NO_SAMU -Wdate-time -D_FORTIFY_SOURCE=2 -Wendif-labels -Wimplicit-fallthrough=2 -Winit-self -Wlogical-op -Wmissing-include-dirs -Wno-missing-braces -Wno-missing-field-initializers -Wno-unused-parameter -Wold-style-definition -Woverflow -Wstrict-aliasing=2 -Wstrict-prototypes -Wundef -Wvla -fstrict-aliasing -std=c99 -DMUON_BOOTSTRAPPED -I . -I .. -I ../include -I /usr/include/i386-linux-gnu -I /usr/include/p11-kit-1 -I /usr/include/pkgconf -I subprojects/tinyjson -I ../subprojects/tinyjson -I subprojects/bestline -I ../subprojects/bestline -I src/script -I subprojects/meson-docs -DMUON_PLATFORM_posix -DMUON_ENDIAN=0 -DHAVE_MESON_DOCS_H -MD -MQ muon.p/src/functions/array.c.o -MF muon.p/src/functions/array.c.o.d -o muon.p/src/functions/array.c.o -c ../src/functions/array.c
[30/133] i686-linux-gnu-gcc -g -O0 -Wpedantic -Wextra -Wall -fdiagnostics-color=always -g -O2 -Werror=implicit-function-declaration -Werror=array-bounds -Werror=clobbered -Werror=volatile-register-var -ffile-prefix-map=/build/reproducible-path/muon-meson-0.4.0=. -fstack-protector-strong -Wformat -Werror=format-security -DBOOTSTRAP_NO_SAMU -Wdate-time -D_FORTIFY_SOURCE=2 -Wendif-labels -Wimplicit-fallthrough=2 -Winit-self -Wlogical-op -Wmissing-include-dirs -Wno-missing-braces -Wno-missing-field-initializers -Wno-unused-parameter -Wold-style-definition -Woverflow -Wstrict-aliasing=2 -Wstrict-prototypes -Wundef -Wvla -fstrict-aliasing -std=c99 -DMUON_BOOTSTRAPPED -I . -I .. -I ../include -I /usr/include/i386-linux-gnu -I /usr/include/p11-kit-1 -I /usr/include/pkgconf -I subprojects/tinyjson -I ../subprojects/tinyjson -I subprojects/bestline -I ../subprojects/bestline -I src/script -I subprojects/meson-docs -DMUON_PLATFORM_posix -DMUON_ENDIAN=0 -DHAVE_MESON_DOCS_H -MD -MQ muon.p/src/functions/custom_target.c.o -MF muon.p/src/functions/custom_target.c.o.d -o muon.p/src/functions/custom_target.c.o -c ../src/functions/custom_target.c
[31/133] i686-linux-gnu-gcc -g -O0 -Wpedantic -Wextra -Wall -fdiagnostics-color=always -g -O2 -Werror=implicit-function-declaration -Werror=array-bounds -Werror=clobbered -Werror=volatile-register-var -ffile-prefix-map=/build/reproducible-path/muon-meson-0.4.0=. -fstack-protector-strong -Wformat -Werror=format-security -DBOOTSTRAP_NO_SAMU -Wdate-time -D_FORTIFY_SOURCE=2 -Wendif-labels -Wimplicit-fallthrough=2 -Winit-self -Wlogical-op -Wmissing-include-dirs -Wno-missing-braces -Wno-missing-field-initializers -Wno-unused-parameter -Wold-style-definition -Woverflow -Wstrict-aliasing=2 -Wstrict-prototypes -Wundef -Wvla -fstrict-aliasing -std=c99 -DMUON_BOOTSTRAPPED -I . -I .. -I ../include -I /usr/include/i386-linux-gnu -I /usr/include/p11-kit-1 -I /usr/include/pkgconf -I subprojects/tinyjson -I ../subprojects/tinyjson -I subprojects/bestline -I ../subprojects/bestline -I src/script -I subprojects/meson-docs -DMUON_PLATFORM_posix -DMUON_ENDIAN=0 -DHAVE_MESON_DOCS_H -MD -MQ muon.p/src/functions/dict.c.o -MF muon.p/src/functions/dict.c.o.d -o muon.p/src/functions/dict.c.o -c ../src/functions/dict.c
[32/133] i686-linux-gnu-gcc -g -O0 -Wpedantic -Wextra -Wall -fdiagnostics-color=always -g -O2 -Werror=implicit-function-declaration -Werror=array-bounds -Werror=clobbered -Werror=volatile-register-var -ffile-prefix-map=/build/reproducible-path/muon-meson-0.4.0=. -fstack-protector-strong -Wformat -Werror=format-security -DBOOTSTRAP_NO_SAMU -Wdate-time -D_FORTIFY_SOURCE=2 -Wendif-labels -Wimplicit-fallthrough=2 -Winit-self -Wlogical-op -Wmissing-include-dirs -Wno-missing-braces -Wno-missing-field-initializers -Wno-unused-parameter -Wold-style-definition -Woverflow -Wstrict-aliasing=2 -Wstrict-prototypes -Wundef -Wvla -fstrict-aliasing -std=c99 -DMUON_BOOTSTRAPPED -I . -I .. -I ../include -I /usr/include/i386-linux-gnu -I /usr/include/p11-kit-1 -I /usr/include/pkgconf -I subprojects/tinyjson -I ../subprojects/tinyjson -I subprojects/bestline -I ../subprojects/bestline -I src/script -I subprojects/meson-docs -DMUON_PLATFORM_posix -DMUON_ENDIAN=0 -DHAVE_MESON_DOCS_H -MD -MQ muon.p/src/functions/configuration_data.c.o -MF muon.p/src/functions/configuration_data.c.o.d -o muon.p/src/functions/configuration_data.c.o -c ../src/functions/configuration_data.c
[33/133] i686-linux-gnu-gcc -g -O0 -Wpedantic -Wextra -Wall -fdiagnostics-color=always -g -O2 -Werror=implicit-function-declaration -Werror=array-bounds -Werror=clobbered -Werror=volatile-register-var -ffile-prefix-map=/build/reproducible-path/muon-meson-0.4.0=. -fstack-protector-strong -Wformat -Werror=format-security -DBOOTSTRAP_NO_SAMU -Wdate-time -D_FORTIFY_SOURCE=2 -Wendif-labels -Wimplicit-fallthrough=2 -Winit-self -Wlogical-op -Wmissing-include-dirs -Wno-missing-braces -Wno-missing-field-initializers -Wno-unused-parameter -Wold-style-definition -Woverflow -Wstrict-aliasing=2 -Wstrict-prototypes -Wundef -Wvla -fstrict-aliasing -std=c99 -DMUON_BOOTSTRAPPED -I . -I .. -I ../include -I /usr/include/i386-linux-gnu -I /usr/include/p11-kit-1 -I /usr/include/pkgconf -I subprojects/tinyjson -I ../subprojects/tinyjson -I subprojects/bestline -I ../subprojects/bestline -I src/script -I subprojects/meson-docs -DMUON_PLATFORM_posix -DMUON_ENDIAN=0 -DHAVE_MESON_DOCS_H -MD -MQ muon.p/src/functions/disabler.c.o -MF muon.p/src/functions/disabler.c.o.d -o muon.p/src/functions/disabler.c.o -c ../src/functions/disabler.c
[34/133] i686-linux-gnu-gcc -g -O0 -Wpedantic -Wextra -Wall -fdiagnostics-color=always -g -O2 -Werror=implicit-function-declaration -Werror=array-bounds -Werror=clobbered -Werror=volatile-register-var -ffile-prefix-map=/build/reproducible-path/muon-meson-0.4.0=. -fstack-protector-strong -Wformat -Werror=format-security -DBOOTSTRAP_NO_SAMU -Wdate-time -D_FORTIFY_SOURCE=2 -Wendif-labels -Wimplicit-fallthrough=2 -Winit-self -Wlogical-op -Wmissing-include-dirs -Wno-missing-braces -Wno-missing-field-initializers -Wno-unused-parameter -Wold-style-definition -Woverflow -Wstrict-aliasing=2 -Wstrict-prototypes -Wundef -Wvla -fstrict-aliasing -std=c99 -DMUON_BOOTSTRAPPED -I . -I .. -I ../include -I /usr/include/i386-linux-gnu -I /usr/include/p11-kit-1 -I /usr/include/pkgconf -I subprojects/tinyjson -I ../subprojects/tinyjson -I subprojects/bestline -I ../subprojects/bestline -I src/script -I subprojects/meson-docs -DMUON_PLATFORM_posix -DMUON_ENDIAN=0 -DHAVE_MESON_DOCS_H -MD -MQ muon.p/src/functions/build_target.c.o -MF muon.p/src/functions/build_target.c.o.d -o muon.p/src/functions/build_target.c.o -c ../src/functions/build_target.c
[35/133] i686-linux-gnu-gcc -g -O0 -Wpedantic -Wextra -Wall -fdiagnostics-color=always -g -O2 -Werror=implicit-function-declaration -Werror=array-bounds -Werror=clobbered -Werror=volatile-register-var -ffile-prefix-map=/build/reproducible-path/muon-meson-0.4.0=. -fstack-protector-strong -Wformat -Werror=format-security -DBOOTSTRAP_NO_SAMU -Wdate-time -D_FORTIFY_SOURCE=2 -Wendif-labels -Wimplicit-fallthrough=2 -Winit-self -Wlogical-op -Wmissing-include-dirs -Wno-missing-braces -Wno-missing-field-initializers -Wno-unused-parameter -Wold-style-definition -Woverflow -Wstrict-aliasing=2 -Wstrict-prototypes -Wundef -Wvla -fstrict-aliasing -std=c99 -DMUON_BOOTSTRAPPED -I . -I .. -I ../include -I /usr/include/i386-linux-gnu -I /usr/include/p11-kit-1 -I /usr/include/pkgconf -I subprojects/tinyjson -I ../subprojects/tinyjson -I subprojects/bestline -I ../subprojects/bestline -I src/script -I subprojects/meson-docs -DMUON_PLATFORM_posix -DMUON_ENDIAN=0 -DHAVE_MESON_DOCS_H -MD -MQ muon.p/src/functions/file.c.o -MF muon.p/src/functions/file.c.o.d -o muon.p/src/functions/file.c.o -c ../src/functions/file.c
[36/133] i686-linux-gnu-gcc -g -O0 -Wpedantic -Wextra -Wall -fdiagnostics-color=always -g -O2 -Werror=implicit-function-declaration -Werror=array-bounds -Werror=clobbered -Werror=volatile-register-var -ffile-prefix-map=/build/reproducible-path/muon-meson-0.4.0=. -fstack-protector-strong -Wformat -Werror=format-security -DBOOTSTRAP_NO_SAMU -Wdate-time -D_FORTIFY_SOURCE=2 -Wendif-labels -Wimplicit-fallthrough=2 -Winit-self -Wlogical-op -Wmissing-include-dirs -Wno-missing-braces -Wno-missing-field-initializers -Wno-unused-parameter -Wold-style-definition -Woverflow -Wstrict-aliasing=2 -Wstrict-prototypes -Wundef -Wvla -fstrict-aliasing -std=c99 -DMUON_BOOTSTRAPPED -I . -I .. -I ../include -I /usr/include/i386-linux-gnu -I /usr/include/p11-kit-1 -I /usr/include/pkgconf -I subprojects/tinyjson -I ../subprojects/tinyjson -I subprojects/bestline -I ../subprojects/bestline -I src/script -I subprojects/meson-docs -DMUON_PLATFORM_posix -DMUON_ENDIAN=0 -DHAVE_MESON_DOCS_H -MD -MQ muon.p/src/functions/external_program.c.o -MF muon.p/src/functions/external_program.c.o.d -o muon.p/src/functions/external_program.c.o -c ../src/functions/external_program.c
[37/133] i686-linux-gnu-gcc -g -O0 -Wpedantic -Wextra -Wall -fdiagnostics-color=always -g -O2 -Werror=implicit-function-declaration -Werror=array-bounds -Werror=clobbered -Werror=volatile-register-var -ffile-prefix-map=/build/reproducible-path/muon-meson-0.4.0=. -fstack-protector-strong -Wformat -Werror=format-security -DBOOTSTRAP_NO_SAMU -Wdate-time -D_FORTIFY_SOURCE=2 -Wendif-labels -Wimplicit-fallthrough=2 -Winit-self -Wlogical-op -Wmissing-include-dirs -Wno-missing-braces -Wno-missing-field-initializers -Wno-unused-parameter -Wold-style-definition -Woverflow -Wstrict-aliasing=2 -Wstrict-prototypes -Wundef -Wvla -fstrict-aliasing -std=c99 -DMUON_BOOTSTRAPPED -I . -I .. -I ../include -I /usr/include/i386-linux-gnu -I /usr/include/p11-kit-1 -I /usr/include/pkgconf -I subprojects/tinyjson -I ../subprojects/tinyjson -I subprojects/bestline -I ../subprojects/bestline -I src/script -I subprojects/meson-docs -DMUON_PLATFORM_posix -DMUON_ENDIAN=0 -DHAVE_MESON_DOCS_H -MD -MQ muon.p/src/functions/feature_opt.c.o -MF muon.p/src/functions/feature_opt.c.o.d -o muon.p/src/functions/feature_opt.c.o -c ../src/functions/feature_opt.c
[38/133] i686-linux-gnu-gcc -g -O0 -Wpedantic -Wextra -Wall -fdiagnostics-color=always -g -O2 -Werror=implicit-function-declaration -Werror=array-bounds -Werror=clobbered -Werror=volatile-register-var -ffile-prefix-map=/build/reproducible-path/muon-meson-0.4.0=. -fstack-protector-strong -Wformat -Werror=format-security -DBOOTSTRAP_NO_SAMU -Wdate-time -D_FORTIFY_SOURCE=2 -Wendif-labels -Wimplicit-fallthrough=2 -Winit-self -Wlogical-op -Wmissing-include-dirs -Wno-missing-braces -Wno-missing-field-initializers -Wno-unused-parameter -Wold-style-definition -Woverflow -Wstrict-aliasing=2 -Wstrict-prototypes -Wundef -Wvla -fstrict-aliasing -std=c99 -DMUON_BOOTSTRAPPED -I . -I .. -I ../include -I /usr/include/i386-linux-gnu -I /usr/include/p11-kit-1 -I /usr/include/pkgconf -I subprojects/tinyjson -I ../subprojects/tinyjson -I subprojects/bestline -I ../subprojects/bestline -I src/script -I subprojects/meson-docs -DMUON_PLATFORM_posix -DMUON_ENDIAN=0 -DHAVE_MESON_DOCS_H -MD -MQ muon.p/src/functions/dependency.c.o -MF muon.p/src/functions/dependency.c.o.d -o muon.p/src/functions/dependency.c.o -c ../src/functions/dependency.c
[39/133] i686-linux-gnu-gcc -g -O0 -Wpedantic -Wextra -Wall -fdiagnostics-color=always -g -O2 -Werror=implicit-function-declaration -Werror=array-bounds -Werror=clobbered -Werror=volatile-register-var -ffile-prefix-map=/build/reproducible-path/muon-meson-0.4.0=. -fstack-protector-strong -Wformat -Werror=format-security -DBOOTSTRAP_NO_SAMU -Wdate-time -D_FORTIFY_SOURCE=2 -Wendif-labels -Wimplicit-fallthrough=2 -Winit-self -Wlogical-op -Wmissing-include-dirs -Wno-missing-braces -Wno-missing-field-initializers -Wno-unused-parameter -Wold-style-definition -Woverflow -Wstrict-aliasing=2 -Wstrict-prototypes -Wundef -Wvla -fstrict-aliasing -std=c99 -DMUON_BOOTSTRAPPED -I . -I .. -I ../include -I /usr/include/i386-linux-gnu -I /usr/include/p11-kit-1 -I /usr/include/pkgconf -I subprojects/tinyjson -I ../subprojects/tinyjson -I subprojects/bestline -I ../subprojects/bestline -I src/script -I subprojects/meson-docs -DMUON_PLATFORM_posix -DMUON_ENDIAN=0 -DHAVE_MESON_DOCS_H -MD -MQ muon.p/src/functions/environment.c.o -MF muon.p/src/functions/environment.c.o.d -o muon.p/src/functions/environment.c.o -c ../src/functions/environment.c
[40/133] i686-linux-gnu-gcc -g -O0 -Wpedantic -Wextra -Wall -fdiagnostics-color=always -g -O2 -Werror=implicit-function-declaration -Werror=array-bounds -Werror=clobbered -Werror=volatile-register-var -ffile-prefix-map=/build/reproducible-path/muon-meson-0.4.0=. -fstack-protector-strong -Wformat -Werror=format-security -DBOOTSTRAP_NO_SAMU -Wdate-time -D_FORTIFY_SOURCE=2 -Wendif-labels -Wimplicit-fallthrough=2 -Winit-self -Wlogical-op -Wmissing-include-dirs -Wno-missing-braces -Wno-missing-field-initializers -Wno-unused-parameter -Wold-style-definition -Woverflow -Wstrict-aliasing=2 -Wstrict-prototypes -Wundef -Wvla -fstrict-aliasing -std=c99 -DMUON_BOOTSTRAPPED -I . -I .. -I ../include -I /usr/include/i386-linux-gnu -I /usr/include/p11-kit-1 -I /usr/include/pkgconf -I subprojects/tinyjson -I ../subprojects/tinyjson -I subprojects/bestline -I ../subprojects/bestline -I src/script -I subprojects/meson-docs -DMUON_PLATFORM_posix -DMUON_ENDIAN=0 -DHAVE_MESON_DOCS_H -MD -MQ muon.p/src/backend/common_args.c.o -MF muon.p/src/backend/common_args.c.o.d -o muon.p/src/backend/common_args.c.o -c ../src/backend/common_args.c
[41/133] i686-linux-gnu-gcc -g -O0 -Wpedantic -Wextra -Wall -fdiagnostics-color=always -g -O2 -Werror=implicit-function-declaration -Werror=array-bounds -Werror=clobbered -Werror=volatile-register-var -ffile-prefix-map=/build/reproducible-path/muon-meson-0.4.0=. -fstack-protector-strong -Wformat -Werror=format-security -DBOOTSTRAP_NO_SAMU -Wdate-time -D_FORTIFY_SOURCE=2 -Wendif-labels -Wimplicit-fallthrough=2 -Winit-self -Wlogical-op -Wmissing-include-dirs -Wno-missing-braces -Wno-missing-field-initializers -Wno-unused-parameter -Wold-style-definition -Woverflow -Wstrict-aliasing=2 -Wstrict-prototypes -Wundef -Wvla -fstrict-aliasing -std=c99 -DMUON_BOOTSTRAPPED -I . -I .. -I ../include -I /usr/include/i386-linux-gnu -I /usr/include/p11-kit-1 -I /usr/include/pkgconf -I subprojects/tinyjson -I ../subprojects/tinyjson -I subprojects/bestline -I ../subprojects/bestline -I src/script -I subprojects/meson-docs -DMUON_PLATFORM_posix -DMUON_ENDIAN=0 -DHAVE_MESON_DOCS_H -MD -MQ muon.p/src/functions/generator.c.o -MF muon.p/src/functions/generator.c.o.d -o muon.p/src/functions/generator.c.o -c ../src/functions/generator.c
[42/133] i686-linux-gnu-gcc -g -O0 -Wpedantic -Wextra -Wall -fdiagnostics-color=always -g -O2 -Werror=implicit-function-declaration -Werror=array-bounds -Werror=clobbered -Werror=volatile-register-var -ffile-prefix-map=/build/reproducible-path/muon-meson-0.4.0=. -fstack-protector-strong -Wformat -Werror=format-security -DBOOTSTRAP_NO_SAMU -Wdate-time -D_FORTIFY_SOURCE=2 -Wendif-labels -Wimplicit-fallthrough=2 -Winit-self -Wlogical-op -Wmissing-include-dirs -Wno-missing-braces -Wno-missing-field-initializers -Wno-unused-parameter -Wold-style-definition -Woverflow -Wstrict-aliasing=2 -Wstrict-prototypes -Wundef -Wvla -fstrict-aliasing -std=c99 -DMUON_BOOTSTRAPPED -I . -I .. -I ../include -I /usr/include/i386-linux-gnu -I /usr/include/p11-kit-1 -I /usr/include/pkgconf -I subprojects/tinyjson -I ../subprojects/tinyjson -I subprojects/bestline -I ../subprojects/bestline -I src/script -I subprojects/meson-docs -DMUON_PLATFORM_posix -DMUON_ENDIAN=0 -DHAVE_MESON_DOCS_H -MD -MQ muon.p/src/functions/kernel/options.c.o -MF muon.p/src/functions/kernel/options.c.o.d -o muon.p/src/functions/kernel/options.c.o -c ../src/functions/kernel/options.c
[43/133] i686-linux-gnu-gcc -g -O0 -Wpedantic -Wextra -Wall -fdiagnostics-color=always -g -O2 -Werror=implicit-function-declaration -Werror=array-bounds -Werror=clobbered -Werror=volatile-register-var -ffile-prefix-map=/build/reproducible-path/muon-meson-0.4.0=. -fstack-protector-strong -Wformat -Werror=format-security -DBOOTSTRAP_NO_SAMU -Wdate-time -D_FORTIFY_SOURCE=2 -Wendif-labels -Wimplicit-fallthrough=2 -Winit-self -Wlogical-op -Wmissing-include-dirs -Wno-missing-braces -Wno-missing-field-initializers -Wno-unused-parameter -Wold-style-definition -Woverflow -Wstrict-aliasing=2 -Wstrict-prototypes -Wundef -Wvla -fstrict-aliasing -std=c99 -DMUON_BOOTSTRAPPED -I . -I .. -I ../include -I /usr/include/i386-linux-gnu -I /usr/include/p11-kit-1 -I /usr/include/pkgconf -I subprojects/tinyjson -I ../subprojects/tinyjson -I subprojects/bestline -I ../subprojects/bestline -I src/script -I subprojects/meson-docs -DMUON_PLATFORM_posix -DMUON_ENDIAN=0 -DHAVE_MESON_DOCS_H -MD -MQ muon.p/src/functions/machine.c.o -MF muon.p/src/functions/machine.c.o.d -o muon.p/src/functions/machine.c.o -c ../src/functions/machine.c
[44/133] i686-linux-gnu-gcc -g -O0 -Wpedantic -Wextra -Wall -fdiagnostics-color=always -g -O2 -Werror=implicit-function-declaration -Werror=array-bounds -Werror=clobbered -Werror=volatile-register-var -ffile-prefix-map=/build/reproducible-path/muon-meson-0.4.0=. -fstack-protector-strong -Wformat -Werror=format-security -DBOOTSTRAP_NO_SAMU -Wdate-time -D_FORTIFY_SOURCE=2 -Wendif-labels -Wimplicit-fallthrough=2 -Winit-self -Wlogical-op -Wmissing-include-dirs -Wno-missing-braces -Wno-missing-field-initializers -Wno-unused-parameter -Wold-style-definition -Woverflow -Wstrict-aliasing=2 -Wstrict-prototypes -Wundef -Wvla -fstrict-aliasing -std=c99 -DMUON_BOOTSTRAPPED -I . -I .. -I ../include -I /usr/include/i386-linux-gnu -I /usr/include/p11-kit-1 -I /usr/include/pkgconf -I subprojects/tinyjson -I ../subprojects/tinyjson -I subprojects/bestline -I ../subprojects/bestline -I src/script -I subprojects/meson-docs -DMUON_PLATFORM_posix -DMUON_ENDIAN=0 -DHAVE_MESON_DOCS_H -MD -MQ muon.p/src/functions/kernel/install.c.o -MF muon.p/src/functions/kernel/install.c.o.d -o muon.p/src/functions/kernel/install.c.o -c ../src/functions/kernel/install.c
[45/133] i686-linux-gnu-gcc -g -O0 -Wpedantic -Wextra -Wall -fdiagnostics-color=always -g -O2 -Werror=implicit-function-declaration -Werror=array-bounds -Werror=clobbered -Werror=volatile-register-var -ffile-prefix-map=/build/reproducible-path/muon-meson-0.4.0=. -fstack-protector-strong -Wformat -Werror=format-security -DBOOTSTRAP_NO_SAMU -Wdate-time -D_FORTIFY_SOURCE=2 -Wendif-labels -Wimplicit-fallthrough=2 -Winit-self -Wlogical-op -Wmissing-include-dirs -Wno-missing-braces -Wno-missing-field-initializers -Wno-unused-parameter -Wold-style-definition -Woverflow -Wstrict-aliasing=2 -Wstrict-prototypes -Wundef -Wvla -fstrict-aliasing -std=c99 -DMUON_BOOTSTRAPPED -I . -I .. -I ../include -I /usr/include/i386-linux-gnu -I /usr/include/p11-kit-1 -I /usr/include/pkgconf -I subprojects/tinyjson -I ../subprojects/tinyjson -I subprojects/bestline -I ../subprojects/bestline -I src/script -I subprojects/meson-docs -DMUON_PLATFORM_posix -DMUON_ENDIAN=0 -DHAVE_MESON_DOCS_H -MD -MQ muon.p/src/backend/xcode.c.o -MF muon.p/src/backend/xcode.c.o.d -o muon.p/src/backend/xcode.c.o -c ../src/backend/xcode.c
[46/133] i686-linux-gnu-gcc -g -O0 -Wpedantic -Wextra -Wall -fdiagnostics-color=always -g -O2 -Werror=implicit-function-declaration -Werror=array-bounds -Werror=clobbered -Werror=volatile-register-var -ffile-prefix-map=/build/reproducible-path/muon-meson-0.4.0=. -fstack-protector-strong -Wformat -Werror=format-security -DBOOTSTRAP_NO_SAMU -Wdate-time -D_FORTIFY_SOURCE=2 -Wendif-labels -Wimplicit-fallthrough=2 -Winit-self -Wlogical-op -Wmissing-include-dirs -Wno-missing-braces -Wno-missing-field-initializers -Wno-unused-parameter -Wold-style-definition -Woverflow -Wstrict-aliasing=2 -Wstrict-prototypes -Wundef -Wvla -fstrict-aliasing -std=c99 -DMUON_BOOTSTRAPPED -I . -I .. -I ../include -I /usr/include/i386-linux-gnu -I /usr/include/p11-kit-1 -I /usr/include/pkgconf -I subprojects/tinyjson -I ../subprojects/tinyjson -I subprojects/bestline -I ../subprojects/bestline -I src/script -I subprojects/meson-docs -DMUON_PLATFORM_posix -DMUON_ENDIAN=0 -DHAVE_MESON_DOCS_H -MD -MQ muon.p/src/functions/kernel/subproject.c.o -MF muon.p/src/functions/kernel/subproject.c.o.d -o muon.p/src/functions/kernel/subproject.c.o -c ../src/functions/kernel/subproject.c
[47/133] i686-linux-gnu-gcc -g -O0 -Wpedantic -Wextra -Wall -fdiagnostics-color=always -g -O2 -Werror=implicit-function-declaration -Werror=array-bounds -Werror=clobbered -Werror=volatile-register-var -ffile-prefix-map=/build/reproducible-path/muon-meson-0.4.0=. -fstack-protector-strong -Wformat -Werror=format-security -DBOOTSTRAP_NO_SAMU -Wdate-time -D_FORTIFY_SOURCE=2 -Wendif-labels -Wimplicit-fallthrough=2 -Winit-self -Wlogical-op -Wmissing-include-dirs -Wno-missing-braces -Wno-missing-field-initializers -Wno-unused-parameter -Wold-style-definition -Woverflow -Wstrict-aliasing=2 -Wstrict-prototypes -Wundef -Wvla -fstrict-aliasing -std=c99 -DMUON_BOOTSTRAPPED -I . -I .. -I ../include -I /usr/include/i386-linux-gnu -I /usr/include/p11-kit-1 -I /usr/include/pkgconf -I subprojects/tinyjson -I ../subprojects/tinyjson -I subprojects/bestline -I ../subprojects/bestline -I src/script -I subprojects/meson-docs -DMUON_PLATFORM_posix -DMUON_ENDIAN=0 -DHAVE_MESON_DOCS_H -MD -MQ muon.p/src/functions/modules/keyval.c.o -MF muon.p/src/functions/modules/keyval.c.o.d -o muon.p/src/functions/modules/keyval.c.o -c ../src/functions/modules/keyval.c
[48/133] i686-linux-gnu-gcc -g -O0 -Wpedantic -Wextra -Wall -fdiagnostics-color=always -g -O2 -Werror=implicit-function-declaration -Werror=array-bounds -Werror=clobbered -Werror=volatile-register-var -ffile-prefix-map=/build/reproducible-path/muon-meson-0.4.0=. -fstack-protector-strong -Wformat -Werror=format-security -DBOOTSTRAP_NO_SAMU -Wdate-time -D_FORTIFY_SOURCE=2 -Wendif-labels -Wimplicit-fallthrough=2 -Winit-self -Wlogical-op -Wmissing-include-dirs -Wno-missing-braces -Wno-missing-field-initializers -Wno-unused-parameter -Wold-style-definition -Woverflow -Wstrict-aliasing=2 -Wstrict-prototypes -Wundef -Wvla -fstrict-aliasing -std=c99 -DMUON_BOOTSTRAPPED -I . -I .. -I ../include -I /usr/include/i386-linux-gnu -I /usr/include/p11-kit-1 -I /usr/include/pkgconf -I subprojects/tinyjson -I ../subprojects/tinyjson -I subprojects/bestline -I ../subprojects/bestline -I src/script -I subprojects/meson-docs -DMUON_PLATFORM_posix -DMUON_ENDIAN=0 -DHAVE_MESON_DOCS_H -MD -MQ muon.p/src/functions/modules.c.o -MF muon.p/src/functions/modules.c.o.d -o muon.p/src/functions/modules.c.o -c ../src/functions/modules.c
[49/133] i686-linux-gnu-gcc -g -O0 -Wpedantic -Wextra -Wall -fdiagnostics-color=always -g -O2 -Werror=implicit-function-declaration -Werror=array-bounds -Werror=clobbered -Werror=volatile-register-var -ffile-prefix-map=/build/reproducible-path/muon-meson-0.4.0=. -fstack-protector-strong -Wformat -Werror=format-security -DBOOTSTRAP_NO_SAMU -Wdate-time -D_FORTIFY_SOURCE=2 -Wendif-labels -Wimplicit-fallthrough=2 -Winit-self -Wlogical-op -Wmissing-include-dirs -Wno-missing-braces -Wno-missing-field-initializers -Wno-unused-parameter -Wold-style-definition -Woverflow -Wstrict-aliasing=2 -Wstrict-prototypes -Wundef -Wvla -fstrict-aliasing -std=c99 -DMUON_BOOTSTRAPPED -I . -I .. -I ../include -I /usr/include/i386-linux-gnu -I /usr/include/p11-kit-1 -I /usr/include/pkgconf -I subprojects/tinyjson -I ../subprojects/tinyjson -I subprojects/bestline -I ../subprojects/bestline -I src/script -I subprojects/meson-docs -DMUON_PLATFORM_posix -DMUON_ENDIAN=0 -DHAVE_MESON_DOCS_H -MD -MQ muon.p/src/functions/kernel/custom_target.c.o -MF muon.p/src/functions/kernel/custom_target.c.o.d -o muon.p/src/functions/kernel/custom_target.c.o -c ../src/functions/kernel/custom_target.c
[50/133] i686-linux-gnu-gcc -g -O0 -Wpedantic -Wextra -Wall -fdiagnostics-color=always -g -O2 -Werror=implicit-function-declaration -Werror=array-bounds -Werror=clobbered -Werror=volatile-register-var -ffile-prefix-map=/build/reproducible-path/muon-meson-0.4.0=. -fstack-protector-strong -Wformat -Werror=format-security -DBOOTSTRAP_NO_SAMU -Wdate-time -D_FORTIFY_SOURCE=2 -Wendif-labels -Wimplicit-fallthrough=2 -Winit-self -Wlogical-op -Wmissing-include-dirs -Wno-missing-braces -Wno-missing-field-initializers -Wno-unused-parameter -Wold-style-definition -Woverflow -Wstrict-aliasing=2 -Wstrict-prototypes -Wundef -Wvla -fstrict-aliasing -std=c99 -DMUON_BOOTSTRAPPED -I . -I .. -I ../include -I /usr/include/i386-linux-gnu -I /usr/include/p11-kit-1 -I /usr/include/pkgconf -I subprojects/tinyjson -I ../subprojects/tinyjson -I subprojects/bestline -I ../subprojects/bestline -I src/script -I subprojects/meson-docs -DMUON_PLATFORM_posix -DMUON_ENDIAN=0 -DHAVE_MESON_DOCS_H -MD -MQ muon.p/src/functions/modules/sourceset.c.o -MF muon.p/src/functions/modules/sourceset.c.o.d -o muon.p/src/functions/modules/sourceset.c.o -c ../src/functions/modules/sourceset.c
[51/133] i686-linux-gnu-gcc -g -O0 -Wpedantic -Wextra -Wall -fdiagnostics-color=always -g -O2 -Werror=implicit-function-declaration -Werror=array-bounds -Werror=clobbered -Werror=volatile-register-var -ffile-prefix-map=/build/reproducible-path/muon-meson-0.4.0=. -fstack-protector-strong -Wformat -Werror=format-security -DBOOTSTRAP_NO_SAMU -Wdate-time -D_FORTIFY_SOURCE=2 -Wendif-labels -Wimplicit-fallthrough=2 -Winit-self -Wlogical-op -Wmissing-include-dirs -Wno-missing-braces -Wno-missing-field-initializers -Wno-unused-parameter -Wold-style-definition -Woverflow -Wstrict-aliasing=2 -Wstrict-prototypes -Wundef -Wvla -fstrict-aliasing -std=c99 -DMUON_BOOTSTRAPPED -I . -I .. -I ../include -I /usr/include/i386-linux-gnu -I /usr/include/p11-kit-1 -I /usr/include/pkgconf -I subprojects/tinyjson -I ../subprojects/tinyjson -I subprojects/bestline -I ../subprojects/bestline -I src/script -I subprojects/meson-docs -DMUON_PLATFORM_posix -DMUON_ENDIAN=0 -DHAVE_MESON_DOCS_H -MD -MQ muon.p/src/functions/kernel/configure_file.c.o -MF muon.p/src/functions/kernel/configure_file.c.o.d -o muon.p/src/functions/kernel/configure_file.c.o -c ../src/functions/kernel/configure_file.c
[52/133] i686-linux-gnu-gcc -g -O0 -Wpedantic -Wextra -Wall -fdiagnostics-color=always -g -O2 -Werror=implicit-function-declaration -Werror=array-bounds -Werror=clobbered -Werror=volatile-register-var -ffile-prefix-map=/build/reproducible-path/muon-meson-0.4.0=. -fstack-protector-strong -Wformat -Werror=format-security -DBOOTSTRAP_NO_SAMU -Wdate-time -D_FORTIFY_SOURCE=2 -Wendif-labels -Wimplicit-fallthrough=2 -Winit-self -Wlogical-op -Wmissing-include-dirs -Wno-missing-braces -Wno-missing-field-initializers -Wno-unused-parameter -Wold-style-definition -Woverflow -Wstrict-aliasing=2 -Wstrict-prototypes -Wundef -Wvla -fstrict-aliasing -std=c99 -DMUON_BOOTSTRAPPED -I . -I .. -I ../include -I /usr/include/i386-linux-gnu -I /usr/include/p11-kit-1 -I /usr/include/pkgconf -I subprojects/tinyjson -I ../subprojects/tinyjson -I subprojects/bestline -I ../subprojects/bestline -I src/script -I subprojects/meson-docs -DMUON_PLATFORM_posix -DMUON_ENDIAN=0 -DHAVE_MESON_DOCS_H -MD -MQ muon.p/src/functions/modules/toolchain.c.o -MF muon.p/src/functions/modules/toolchain.c.o.d -o muon.p/src/functions/modules/toolchain.c.o -c ../src/functions/modules/toolchain.c
[53/133] i686-linux-gnu-gcc -g -O0 -Wpedantic -Wextra -Wall -fdiagnostics-color=always -g -O2 -Werror=implicit-function-declaration -Werror=array-bounds -Werror=clobbered -Werror=volatile-register-var -ffile-prefix-map=/build/reproducible-path/muon-meson-0.4.0=. -fstack-protector-strong -Wformat -Werror=format-security -DBOOTSTRAP_NO_SAMU -Wdate-time -D_FORTIFY_SOURCE=2 -Wendif-labels -Wimplicit-fallthrough=2 -Winit-self -Wlogical-op -Wmissing-include-dirs -Wno-missing-braces -Wno-missing-field-initializers -Wno-unused-parameter -Wold-style-definition -Woverflow -Wstrict-aliasing=2 -Wstrict-prototypes -Wundef -Wvla -fstrict-aliasing -std=c99 -DMUON_BOOTSTRAPPED -I . -I .. -I ../include -I /usr/include/i386-linux-gnu -I /usr/include/p11-kit-1 -I /usr/include/pkgconf -I subprojects/tinyjson -I ../subprojects/tinyjson -I subprojects/bestline -I ../subprojects/bestline -I src/script -I subprojects/meson-docs -DMUON_PLATFORM_posix -DMUON_ENDIAN=0 -DHAVE_MESON_DOCS_H -MD -MQ muon.p/src/functions/number.c.o -MF muon.p/src/functions/number.c.o.d -o muon.p/src/functions/number.c.o -c ../src/functions/number.c
[54/133] i686-linux-gnu-gcc -g -O0 -Wpedantic -Wextra -Wall -fdiagnostics-color=always -g -O2 -Werror=implicit-function-declaration -Werror=array-bounds -Werror=clobbered -Werror=volatile-register-var -ffile-prefix-map=/build/reproducible-path/muon-meson-0.4.0=. -fstack-protector-strong -Wformat -Werror=format-security -DBOOTSTRAP_NO_SAMU -Wdate-time -D_FORTIFY_SOURCE=2 -Wendif-labels -Wimplicit-fallthrough=2 -Winit-self -Wlogical-op -Wmissing-include-dirs -Wno-missing-braces -Wno-missing-field-initializers -Wno-unused-parameter -Wold-style-definition -Woverflow -Wstrict-aliasing=2 -Wstrict-prototypes -Wundef -Wvla -fstrict-aliasing -std=c99 -DMUON_BOOTSTRAPPED -I . -I .. -I ../include -I /usr/include/i386-linux-gnu -I /usr/include/p11-kit-1 -I /usr/include/pkgconf -I subprojects/tinyjson -I ../subprojects/tinyjson -I subprojects/bestline -I ../subprojects/bestline -I src/script -I subprojects/meson-docs -DMUON_PLATFORM_posix -DMUON_ENDIAN=0 -DHAVE_MESON_DOCS_H -MD -MQ muon.p/src/functions/meson.c.o -MF muon.p/src/functions/meson.c.o.d -o muon.p/src/functions/meson.c.o -c ../src/functions/meson.c
[55/133] i686-linux-gnu-gcc -g -O0 -Wpedantic -Wextra -Wall -fdiagnostics-color=always -g -O2 -Werror=implicit-function-declaration -Werror=array-bounds -Werror=clobbered -Werror=volatile-register-var -ffile-prefix-map=/build/reproducible-path/muon-meson-0.4.0=. -fstack-protector-strong -Wformat -Werror=format-security -DBOOTSTRAP_NO_SAMU -Wdate-time -D_FORTIFY_SOURCE=2 -Wendif-labels -Wimplicit-fallthrough=2 -Winit-self -Wlogical-op -Wmissing-include-dirs -Wno-missing-braces -Wno-missing-field-initializers -Wno-unused-parameter -Wold-style-definition -Woverflow -Wstrict-aliasing=2 -Wstrict-prototypes -Wundef -Wvla -fstrict-aliasing -std=c99 -DMUON_BOOTSTRAPPED -I . -I .. -I ../include -I /usr/include/i386-linux-gnu -I /usr/include/p11-kit-1 -I /usr/include/pkgconf -I subprojects/tinyjson -I ../subprojects/tinyjson -I subprojects/bestline -I ../subprojects/bestline -I src/script -I subprojects/meson-docs -DMUON_PLATFORM_posix -DMUON_ENDIAN=0 -DHAVE_MESON_DOCS_H -MD -MQ muon.p/src/functions/modules/subprojects.c.o -MF muon.p/src/functions/modules/subprojects.c.o.d -o muon.p/src/functions/modules/subprojects.c.o -c ../src/functions/modules/subprojects.c
[56/133] i686-linux-gnu-gcc -g -O0 -Wpedantic -Wextra -Wall -fdiagnostics-color=always -g -O2 -Werror=implicit-function-declaration -Werror=array-bounds -Werror=clobbered -Werror=volatile-register-var -ffile-prefix-map=/build/reproducible-path/muon-meson-0.4.0=. -fstack-protector-strong -Wformat -Werror=format-security -DBOOTSTRAP_NO_SAMU -Wdate-time -D_FORTIFY_SOURCE=2 -Wendif-labels -Wimplicit-fallthrough=2 -Winit-self -Wlogical-op -Wmissing-include-dirs -Wno-missing-braces -Wno-missing-field-initializers -Wno-unused-parameter -Wold-style-definition -Woverflow -Wstrict-aliasing=2 -Wstrict-prototypes -Wundef -Wvla -fstrict-aliasing -std=c99 -DMUON_BOOTSTRAPPED -I . -I .. -I ../include -I /usr/include/i386-linux-gnu -I /usr/include/p11-kit-1 -I /usr/include/pkgconf -I subprojects/tinyjson -I ../subprojects/tinyjson -I subprojects/bestline -I ../subprojects/bestline -I src/script -I subprojects/meson-docs -DMUON_PLATFORM_posix -DMUON_ENDIAN=0 -DHAVE_MESON_DOCS_H -MD -MQ muon.p/src/functions/modules/getopt.c.o -MF muon.p/src/functions/modules/getopt.c.o.d -o muon.p/src/functions/modules/getopt.c.o -c ../src/functions/modules/getopt.c
[57/133] i686-linux-gnu-gcc -g -O0 -Wpedantic -Wextra -Wall -fdiagnostics-color=always -g -O2 -Werror=implicit-function-declaration -Werror=array-bounds -Werror=clobbered -Werror=volatile-register-var -ffile-prefix-map=/build/reproducible-path/muon-meson-0.4.0=. -fstack-protector-strong -Wformat -Werror=format-security -DBOOTSTRAP_NO_SAMU -Wdate-time -D_FORTIFY_SOURCE=2 -Wendif-labels -Wimplicit-fallthrough=2 -Winit-self -Wlogical-op -Wmissing-include-dirs -Wno-missing-braces -Wno-missing-field-initializers -Wno-unused-parameter -Wold-style-definition -Woverflow -Wstrict-aliasing=2 -Wstrict-prototypes -Wundef -Wvla -fstrict-aliasing -std=c99 -DMUON_BOOTSTRAPPED -I . -I .. -I ../include -I /usr/include/i386-linux-gnu -I /usr/include/p11-kit-1 -I /usr/include/pkgconf -I subprojects/tinyjson -I ../subprojects/tinyjson -I subprojects/bestline -I ../subprojects/bestline -I src/script -I subprojects/meson-docs -DMUON_PLATFORM_posix -DMUON_ENDIAN=0 -DHAVE_MESON_DOCS_H -MD -MQ muon.p/src/functions/run_result.c.o -MF muon.p/src/functions/run_result.c.o.d -o muon.p/src/functions/run_result.c.o -c ../src/functions/run_result.c
[58/133] i686-linux-gnu-gcc -g -O0 -Wpedantic -Wextra -Wall -fdiagnostics-color=always -g -O2 -Werror=implicit-function-declaration -Werror=array-bounds -Werror=clobbered -Werror=volatile-register-var -ffile-prefix-map=/build/reproducible-path/muon-meson-0.4.0=. -fstack-protector-strong -Wformat -Werror=format-security -DBOOTSTRAP_NO_SAMU -Wdate-time -D_FORTIFY_SOURCE=2 -Wendif-labels -Wimplicit-fallthrough=2 -Winit-self -Wlogical-op -Wmissing-include-dirs -Wno-missing-braces -Wno-missing-field-initializers -Wno-unused-parameter -Wold-style-definition -Woverflow -Wstrict-aliasing=2 -Wstrict-prototypes -Wundef -Wvla -fstrict-aliasing -std=c99 -DMUON_BOOTSTRAPPED -I . -I .. -I ../include -I /usr/include/i386-linux-gnu -I /usr/include/p11-kit-1 -I /usr/include/pkgconf -I subprojects/tinyjson -I ../subprojects/tinyjson -I subprojects/bestline -I ../subprojects/bestline -I src/script -I subprojects/meson-docs -DMUON_PLATFORM_posix -DMUON_ENDIAN=0 -DHAVE_MESON_DOCS_H -MD -MQ muon.p/src/functions/source_configuration.c.o -MF muon.p/src/functions/source_configuration.c.o.d -o muon.p/src/functions/source_configuration.c.o -c ../src/functions/source_configuration.c
[59/133] i686-linux-gnu-gcc -g -O0 -Wpedantic -Wextra -Wall -fdiagnostics-color=always -g -O2 -Werror=implicit-function-declaration -Werror=array-bounds -Werror=clobbered -Werror=volatile-register-var -ffile-prefix-map=/build/reproducible-path/muon-meson-0.4.0=. -fstack-protector-strong -Wformat -Werror=format-security -DBOOTSTRAP_NO_SAMU -Wdate-time -D_FORTIFY_SOURCE=2 -Wendif-labels -Wimplicit-fallthrough=2 -Winit-self -Wlogical-op -Wmissing-include-dirs -Wno-missing-braces -Wno-missing-field-initializers -Wno-unused-parameter -Wold-style-definition -Woverflow -Wstrict-aliasing=2 -Wstrict-prototypes -Wundef -Wvla -fstrict-aliasing -std=c99 -DMUON_BOOTSTRAPPED -I . -I .. -I ../include -I /usr/include/i386-linux-gnu -I /usr/include/p11-kit-1 -I /usr/include/pkgconf -I subprojects/tinyjson -I ../subprojects/tinyjson -I subprojects/bestline -I ../subprojects/bestline -I src/script -I subprojects/meson-docs -DMUON_PLATFORM_posix -DMUON_ENDIAN=0 -DHAVE_MESON_DOCS_H -MD -MQ muon.p/src/functions/modules/python.c.o -MF muon.p/src/functions/modules/python.c.o.d -o muon.p/src/functions/modules/python.c.o -c ../src/functions/modules/python.c
[60/133] i686-linux-gnu-gcc -g -O0 -Wpedantic -Wextra -Wall -fdiagnostics-color=always -g -O2 -Werror=implicit-function-declaration -Werror=array-bounds -Werror=clobbered -Werror=volatile-register-var -ffile-prefix-map=/build/reproducible-path/muon-meson-0.4.0=. -fstack-protector-strong -Wformat -Werror=format-security -DBOOTSTRAP_NO_SAMU -Wdate-time -D_FORTIFY_SOURCE=2 -Wendif-labels -Wimplicit-fallthrough=2 -Winit-self -Wlogical-op -Wmissing-include-dirs -Wno-missing-braces -Wno-missing-field-initializers -Wno-unused-parameter -Wold-style-definition -Woverflow -Wstrict-aliasing=2 -Wstrict-prototypes -Wundef -Wvla -fstrict-aliasing -std=c99 -DMUON_BOOTSTRAPPED -I . -I .. -I ../include -I /usr/include/i386-linux-gnu -I /usr/include/p11-kit-1 -I /usr/include/pkgconf -I subprojects/tinyjson -I ../subprojects/tinyjson -I subprojects/bestline -I ../subprojects/bestline -I src/script -I subprojects/meson-docs -DMUON_PLATFORM_posix -DMUON_ENDIAN=0 -DHAVE_MESON_DOCS_H -MD -MQ muon.p/src/functions/subproject.c.o -MF muon.p/src/functions/subproject.c.o.d -o muon.p/src/functions/subproject.c.o -c ../src/functions/subproject.c
[61/133] /build/reproducible-path/muon-meson-0.4.0/build/muon-bootstrap internal exe -e /build/reproducible-path/muon-meson-0.4.0/build/.muon/custom_tgt_env/meson_reference_33_dat -- ../subprojects/meson-docs/docs/genrefman.py -q -l fastyaml -g man -o subprojects/meson-docs/meson-reference.3 --no-modules
| WARNING: YAML reference manual loaded using the best-effort fastyaml loader.  Results are not guaranteed to be stable or correct.
[62/133] i686-linux-gnu-gcc -g -O0 -Wpedantic -Wextra -Wall -fdiagnostics-color=always -g -O2 -Werror=implicit-function-declaration -Werror=array-bounds -Werror=clobbered -Werror=volatile-register-var -ffile-prefix-map=/build/reproducible-path/muon-meson-0.4.0=. -fstack-protector-strong -Wformat -Werror=format-security -DBOOTSTRAP_NO_SAMU -Wdate-time -D_FORTIFY_SOURCE=2 -Wendif-labels -Wimplicit-fallthrough=2 -Winit-self -Wlogical-op -Wmissing-include-dirs -Wno-missing-braces -Wno-missing-field-initializers -Wno-unused-parameter -Wold-style-definition -Woverflow -Wstrict-aliasing=2 -Wstrict-prototypes -Wundef -Wvla -fstrict-aliasing -std=c99 -DMUON_BOOTSTRAPPED -I . -I .. -I ../include -I /usr/include/i386-linux-gnu -I /usr/include/p11-kit-1 -I /usr/include/pkgconf -I subprojects/tinyjson -I ../subprojects/tinyjson -I subprojects/bestline -I ../subprojects/bestline -I src/script -I subprojects/meson-docs -DMUON_PLATFORM_posix -DMUON_ENDIAN=0 -DHAVE_MESON_DOCS_H -MD -MQ muon.p/src/functions/source_set.c.o -MF muon.p/src/functions/source_set.c.o.d -o muon.p/src/functions/source_set.c.o -c ../src/functions/source_set.c
[63/133] i686-linux-gnu-gcc -g -O0 -Wpedantic -Wextra -Wall -fdiagnostics-color=always -g -O2 -Werror=implicit-function-declaration -Werror=array-bounds -Werror=clobbered -Werror=volatile-register-var -ffile-prefix-map=/build/reproducible-path/muon-meson-0.4.0=. -fstack-protector-strong -Wformat -Werror=format-security -DBOOTSTRAP_NO_SAMU -Wdate-time -D_FORTIFY_SOURCE=2 -Wendif-labels -Wimplicit-fallthrough=2 -Winit-self -Wlogical-op -Wmissing-include-dirs -Wno-missing-braces -Wno-missing-field-initializers -Wno-unused-parameter -Wold-style-definition -Woverflow -Wstrict-aliasing=2 -Wstrict-prototypes -Wundef -Wvla -fstrict-aliasing -std=c99 -DMUON_BOOTSTRAPPED -I . -I .. -I ../include -I /usr/include/i386-linux-gnu -I /usr/include/p11-kit-1 -I /usr/include/pkgconf -I subprojects/tinyjson -I ../subprojects/tinyjson -I subprojects/bestline -I ../subprojects/bestline -I src/script -I subprojects/meson-docs -DMUON_PLATFORM_posix -DMUON_ENDIAN=0 -DHAVE_MESON_DOCS_H -MD -MQ muon.p/src/functions/modules/fs.c.o -MF muon.p/src/functions/modules/fs.c.o.d -o muon.p/src/functions/modules/fs.c.o -c ../src/functions/modules/fs.c
[64/133] i686-linux-gnu-gcc -g -O0 -Wpedantic -Wextra -Wall -fdiagnostics-color=always -g -O2 -Werror=implicit-function-declaration -Werror=array-bounds -Werror=clobbered -Werror=volatile-register-var -ffile-prefix-map=/build/reproducible-path/muon-meson-0.4.0=. -fstack-protector-strong -Wformat -Werror=format-security -DBOOTSTRAP_NO_SAMU -Wdate-time -D_FORTIFY_SOURCE=2 -Wendif-labels -Wimplicit-fallthrough=2 -Winit-self -Wlogical-op -Wmissing-include-dirs -Wno-missing-braces -Wno-missing-field-initializers -Wno-unused-parameter -Wold-style-definition -Woverflow -Wstrict-aliasing=2 -Wstrict-prototypes -Wundef -Wvla -fstrict-aliasing -std=c99 -DMUON_BOOTSTRAPPED -I . -I .. -I ../include -I /usr/include/i386-linux-gnu -I /usr/include/p11-kit-1 -I /usr/include/pkgconf -I subprojects/tinyjson -I ../subprojects/tinyjson -I subprojects/bestline -I ../subprojects/bestline -I src/script -I subprojects/meson-docs -DMUON_PLATFORM_posix -DMUON_ENDIAN=0 -DHAVE_MESON_DOCS_H -MD -MQ muon.p/src/functions/kernel/build_target.c.o -MF muon.p/src/functions/kernel/build_target.c.o.d -o muon.p/src/functions/kernel/build_target.c.o -c ../src/functions/kernel/build_target.c
[65/133] i686-linux-gnu-gcc -g -O0 -Wpedantic -Wextra -Wall -fdiagnostics-color=always -g -O2 -Werror=implicit-function-declaration -Werror=array-bounds -Werror=clobbered -Werror=volatile-register-var -ffile-prefix-map=/build/reproducible-path/muon-meson-0.4.0=. -fstack-protector-strong -Wformat -Werror=format-security -DBOOTSTRAP_NO_SAMU -Wdate-time -D_FORTIFY_SOURCE=2 -Wendif-labels -Wimplicit-fallthrough=2 -Winit-self -Wlogical-op -Wmissing-include-dirs -Wno-missing-braces -Wno-missing-field-initializers -Wno-unused-parameter -Wold-style-definition -Woverflow -Wstrict-aliasing=2 -Wstrict-prototypes -Wundef -Wvla -fstrict-aliasing -std=c99 -DMUON_BOOTSTRAPPED -I . -I .. -I ../include -I /usr/include/i386-linux-gnu -I /usr/include/p11-kit-1 -I /usr/include/pkgconf -I subprojects/tinyjson -I ../subprojects/tinyjson -I subprojects/bestline -I ../subprojects/bestline -I src/script -I subprojects/meson-docs -DMUON_PLATFORM_posix -DMUON_ENDIAN=0 -DHAVE_MESON_DOCS_H -MD -MQ muon.p/src/functions/string.c.o -MF muon.p/src/functions/string.c.o.d -o muon.p/src/functions/string.c.o -c ../src/functions/string.c
[66/133] i686-linux-gnu-gcc -g -O0 -Wpedantic -Wextra -Wall -fdiagnostics-color=always -g -O2 -Werror=implicit-function-declaration -Werror=array-bounds -Werror=clobbered -Werror=volatile-register-var -ffile-prefix-map=/build/reproducible-path/muon-meson-0.4.0=. -fstack-protector-strong -Wformat -Werror=format-security -DBOOTSTRAP_NO_SAMU -Wdate-time -D_FORTIFY_SOURCE=2 -Wendif-labels -Wimplicit-fallthrough=2 -Winit-self -Wlogical-op -Wmissing-include-dirs -Wno-missing-braces -Wno-missing-field-initializers -Wno-unused-parameter -Wold-style-definition -Woverflow -Wstrict-aliasing=2 -Wstrict-prototypes -Wundef -Wvla -fstrict-aliasing -std=c99 -DMUON_BOOTSTRAPPED -I . -I .. -I ../include -I /usr/include/i386-linux-gnu -I /usr/include/p11-kit-1 -I /usr/include/pkgconf -I subprojects/tinyjson -I ../subprojects/tinyjson -I subprojects/bestline -I ../subprojects/bestline -I src/script -I subprojects/meson-docs -DMUON_PLATFORM_posix -DMUON_ENDIAN=0 -DHAVE_MESON_DOCS_H -MD -MQ muon.p/src/lang/object_iterators.c.o -MF muon.p/src/lang/object_iterators.c.o.d -o muon.p/src/lang/object_iterators.c.o -c ../src/lang/object_iterators.c
[67/133] i686-linux-gnu-gcc -g -O0 -Wpedantic -Wextra -Wall -fdiagnostics-color=always -g -O2 -Werror=implicit-function-declaration -Werror=array-bounds -Werror=clobbered -Werror=volatile-register-var -ffile-prefix-map=/build/reproducible-path/muon-meson-0.4.0=. -fstack-protector-strong -Wformat -Werror=format-security -DBOOTSTRAP_NO_SAMU -Wdate-time -D_FORTIFY_SOURCE=2 -Wendif-labels -Wimplicit-fallthrough=2 -Winit-self -Wlogical-op -Wmissing-include-dirs -Wno-missing-braces -Wno-missing-field-initializers -Wno-unused-parameter -Wold-style-definition -Woverflow -Wstrict-aliasing=2 -Wstrict-prototypes -Wundef -Wvla -fstrict-aliasing -std=c99 -DMUON_BOOTSTRAPPED -I . -I .. -I ../include -I /usr/include/i386-linux-gnu -I /usr/include/p11-kit-1 -I /usr/include/pkgconf -I subprojects/tinyjson -I ../subprojects/tinyjson -I subprojects/bestline -I ../subprojects/bestline -I src/script -I subprojects/meson-docs -DMUON_PLATFORM_posix -DMUON_ENDIAN=0 -DHAVE_MESON_DOCS_H -MD -MQ muon.p/src/functions/modules/pkgconfig.c.o -MF muon.p/src/functions/modules/pkgconfig.c.o.d -o muon.p/src/functions/modules/pkgconfig.c.o -c ../src/functions/modules/pkgconfig.c
[68/133] i686-linux-gnu-gcc -g -O0 -Wpedantic -Wextra -Wall -fdiagnostics-color=always -g -O2 -Werror=implicit-function-declaration -Werror=array-bounds -Werror=clobbered -Werror=volatile-register-var -ffile-prefix-map=/build/reproducible-path/muon-meson-0.4.0=. -fstack-protector-strong -Wformat -Werror=format-security -DBOOTSTRAP_NO_SAMU -Wdate-time -D_FORTIFY_SOURCE=2 -Wendif-labels -Wimplicit-fallthrough=2 -Winit-self -Wlogical-op -Wmissing-include-dirs -Wno-missing-braces -Wno-missing-field-initializers -Wno-unused-parameter -Wold-style-definition -Woverflow -Wstrict-aliasing=2 -Wstrict-prototypes -Wundef -Wvla -fstrict-aliasing -std=c99 -DMUON_BOOTSTRAPPED -I . -I .. -I ../include -I /usr/include/i386-linux-gnu -I /usr/include/p11-kit-1 -I /usr/include/pkgconf -I subprojects/tinyjson -I ../subprojects/tinyjson -I subprojects/bestline -I ../subprojects/bestline -I src/script -I subprojects/meson-docs -DMUON_PLATFORM_posix -DMUON_ENDIAN=0 -DHAVE_MESON_DOCS_H -MD -MQ muon.p/src/lang/eval.c.o -MF muon.p/src/lang/eval.c.o.d -o muon.p/src/lang/eval.c.o -c ../src/lang/eval.c
[69/133] i686-linux-gnu-gcc -g -O0 -Wpedantic -Wextra -Wall -fdiagnostics-color=always -g -O2 -Werror=implicit-function-declaration -Werror=array-bounds -Werror=clobbered -Werror=volatile-register-var -ffile-prefix-map=/build/reproducible-path/muon-meson-0.4.0=. -fstack-protector-strong -Wformat -Werror=format-security -DBOOTSTRAP_NO_SAMU -Wdate-time -D_FORTIFY_SOURCE=2 -Wendif-labels -Wimplicit-fallthrough=2 -Winit-self -Wlogical-op -Wmissing-include-dirs -Wno-missing-braces -Wno-missing-field-initializers -Wno-unused-parameter -Wold-style-definition -Woverflow -Wstrict-aliasing=2 -Wstrict-prototypes -Wundef -Wvla -fstrict-aliasing -std=c99 -DMUON_BOOTSTRAPPED -I . -I .. -I ../include -I /usr/include/i386-linux-gnu -I /usr/include/p11-kit-1 -I /usr/include/pkgconf -I subprojects/tinyjson -I ../subprojects/tinyjson -I subprojects/bestline -I ../subprojects/bestline -I src/script -I subprojects/meson-docs -DMUON_PLATFORM_posix -DMUON_ENDIAN=0 -DHAVE_MESON_DOCS_H -MD -MQ muon.p/src/functions/kernel/dependency.c.o -MF muon.p/src/functions/kernel/dependency.c.o.d -o muon.p/src/functions/kernel/dependency.c.o -c ../src/functions/kernel/dependency.c
[70/133] i686-linux-gnu-gcc -g -O0 -Wpedantic -Wextra -Wall -fdiagnostics-color=always -g -O2 -Werror=implicit-function-declaration -Werror=array-bounds -Werror=clobbered -Werror=volatile-register-var -ffile-prefix-map=/build/reproducible-path/muon-meson-0.4.0=. -fstack-protector-strong -Wformat -Werror=format-security -DBOOTSTRAP_NO_SAMU -Wdate-time -D_FORTIFY_SOURCE=2 -Wendif-labels -Wimplicit-fallthrough=2 -Winit-self -Wlogical-op -Wmissing-include-dirs -Wno-missing-braces -Wno-missing-field-initializers -Wno-unused-parameter -Wold-style-definition -Woverflow -Wstrict-aliasing=2 -Wstrict-prototypes -Wundef -Wvla -fstrict-aliasing -std=c99 -DMUON_BOOTSTRAPPED -I . -I .. -I ../include -I /usr/include/i386-linux-gnu -I /usr/include/p11-kit-1 -I /usr/include/pkgconf -I subprojects/tinyjson -I ../subprojects/tinyjson -I subprojects/bestline -I ../subprojects/bestline -I src/script -I subprojects/meson-docs -DMUON_PLATFORM_posix -DMUON_ENDIAN=0 -DHAVE_MESON_DOCS_H -MD -MQ muon.p/src/functions/kernel.c.o -MF muon.p/src/functions/kernel.c.o.d -o muon.p/src/functions/kernel.c.o -c ../src/functions/kernel.c
[71/133] i686-linux-gnu-gcc -g -O0 -Wpedantic -Wextra -Wall -fdiagnostics-color=always -g -O2 -Werror=implicit-function-declaration -Werror=array-bounds -Werror=clobbered -Werror=volatile-register-var -ffile-prefix-map=/build/reproducible-path/muon-meson-0.4.0=. -fstack-protector-strong -Wformat -Werror=format-security -DBOOTSTRAP_NO_SAMU -Wdate-time -D_FORTIFY_SOURCE=2 -Wendif-labels -Wimplicit-fallthrough=2 -Winit-self -Wlogical-op -Wmissing-include-dirs -Wno-missing-braces -Wno-missing-field-initializers -Wno-unused-parameter -Wold-style-definition -Woverflow -Wstrict-aliasing=2 -Wstrict-prototypes -Wundef -Wvla -fstrict-aliasing -std=c99 -DMUON_BOOTSTRAPPED -I . -I .. -I ../include -I /usr/include/i386-linux-gnu -I /usr/include/p11-kit-1 -I /usr/include/pkgconf -I subprojects/tinyjson -I ../subprojects/tinyjson -I subprojects/bestline -I ../subprojects/bestline -I src/script -I subprojects/meson-docs -DMUON_PLATFORM_posix -DMUON_ENDIAN=0 -DHAVE_MESON_DOCS_H -MD -MQ muon.p/src/lang/serial.c.o -MF muon.p/src/lang/serial.c.o.d -o muon.p/src/lang/serial.c.o -c ../src/lang/serial.c
[72/133] i686-linux-gnu-gcc -g -O0 -Wpedantic -Wextra -Wall -fdiagnostics-color=always -g -O2 -Werror=implicit-function-declaration -Werror=array-bounds -Werror=clobbered -Werror=volatile-register-var -ffile-prefix-map=/build/reproducible-path/muon-meson-0.4.0=. -fstack-protector-strong -Wformat -Werror=format-security -DBOOTSTRAP_NO_SAMU -Wdate-time -D_FORTIFY_SOURCE=2 -Wendif-labels -Wimplicit-fallthrough=2 -Winit-self -Wlogical-op -Wmissing-include-dirs -Wno-missing-braces -Wno-missing-field-initializers -Wno-unused-parameter -Wold-style-definition -Woverflow -Wstrict-aliasing=2 -Wstrict-prototypes -Wundef -Wvla -fstrict-aliasing -std=c99 -DMUON_BOOTSTRAPPED -I . -I .. -I ../include -I /usr/include/i386-linux-gnu -I /usr/include/p11-kit-1 -I /usr/include/pkgconf -I subprojects/tinyjson -I ../subprojects/tinyjson -I subprojects/bestline -I ../subprojects/bestline -I src/script -I subprojects/meson-docs -DMUON_PLATFORM_posix -DMUON_ENDIAN=0 -DHAVE_MESON_DOCS_H -MD -MQ muon.p/src/lang/typecheck.c.o -MF muon.p/src/lang/typecheck.c.o.d -o muon.p/src/lang/typecheck.c.o -c ../src/lang/typecheck.c
[73/133] i686-linux-gnu-gcc -g -O0 -Wpedantic -Wextra -Wall -fdiagnostics-color=always -g -O2 -Werror=implicit-function-declaration -Werror=array-bounds -Werror=clobbered -Werror=volatile-register-var -ffile-prefix-map=/build/reproducible-path/muon-meson-0.4.0=. -fstack-protector-strong -Wformat -Werror=format-security -DBOOTSTRAP_NO_SAMU -Wdate-time -D_FORTIFY_SOURCE=2 -Wendif-labels -Wimplicit-fallthrough=2 -Winit-self -Wlogical-op -Wmissing-include-dirs -Wno-missing-braces -Wno-missing-field-initializers -Wno-unused-parameter -Wold-style-definition -Woverflow -Wstrict-aliasing=2 -Wstrict-prototypes -Wundef -Wvla -fstrict-aliasing -std=c99 -DMUON_BOOTSTRAPPED -I . -I .. -I ../include -I /usr/include/i386-linux-gnu -I /usr/include/p11-kit-1 -I /usr/include/pkgconf -I subprojects/tinyjson -I ../subprojects/tinyjson -I subprojects/bestline -I ../subprojects/bestline -I src/script -I subprojects/meson-docs -DMUON_PLATFORM_posix -DMUON_ENDIAN=0 -DHAVE_MESON_DOCS_H -MD -MQ muon.p/src/functions/compiler.c.o -MF muon.p/src/functions/compiler.c.o.d -o muon.p/src/functions/compiler.c.o -c ../src/functions/compiler.c
[74/133] i686-linux-gnu-gcc -g -O0 -Wpedantic -Wextra -Wall -fdiagnostics-color=always -g -O2 -Werror=implicit-function-declaration -Werror=array-bounds -Werror=clobbered -Werror=volatile-register-var -ffile-prefix-map=/build/reproducible-path/muon-meson-0.4.0=. -fstack-protector-strong -Wformat -Werror=format-security -DBOOTSTRAP_NO_SAMU -Wdate-time -D_FORTIFY_SOURCE=2 -Wendif-labels -Wimplicit-fallthrough=2 -Winit-self -Wlogical-op -Wmissing-include-dirs -Wno-missing-braces -Wno-missing-field-initializers -Wno-unused-parameter -Wold-style-definition -Woverflow -Wstrict-aliasing=2 -Wstrict-prototypes -Wundef -Wvla -fstrict-aliasing -std=c99 -DMUON_BOOTSTRAPPED -I . -I .. -I ../include -I /usr/include/i386-linux-gnu -I /usr/include/p11-kit-1 -I /usr/include/pkgconf -I subprojects/tinyjson -I ../subprojects/tinyjson -I subprojects/bestline -I ../subprojects/bestline -I src/script -I subprojects/meson-docs -DMUON_PLATFORM_posix -DMUON_ENDIAN=0 -DHAVE_MESON_DOCS_H -MD -MQ muon.p/src/lang/workspace.c.o -MF muon.p/src/lang/workspace.c.o.d -o muon.p/src/lang/workspace.c.o -c ../src/lang/workspace.c
[75/133] i686-linux-gnu-gcc -g -O0 -Wpedantic -Wextra -Wall -fdiagnostics-color=always -g -O2 -Werror=implicit-function-declaration -Werror=array-bounds -Werror=clobbered -Werror=volatile-register-var -ffile-prefix-map=/build/reproducible-path/muon-meson-0.4.0=. -fstack-protector-strong -Wformat -Werror=format-security -DBOOTSTRAP_NO_SAMU -Wdate-time -D_FORTIFY_SOURCE=2 -fPIC -I subprojects/bestline -I ../subprojects/bestline -MD -MQ subprojects/bestline/libbestline.a.p/bestline.c.o -MF subprojects/bestline/libbestline.a.p/bestline.c.o.d -o subprojects/bestline/libbestline.a.p/bestline.c.o -c ../subprojects/bestline/bestline.c
../subprojects/bestline/bestline.c: In function 'GetLineChar':
../subprojects/bestline/bestline.c:1612:17: warning: ignoring return value of 'write' declared with attribute 'warn_unused_result' [-Wunused-result]
 1612 |                 write(fout, "\n", 1);
      |                 ^~~~~~~~~~~~~~~~~~~~
[76/133] i686-linux-gnu-gcc -g -O0 -Wpedantic -Wextra -Wall -fdiagnostics-color=always -g -O2 -Werror=implicit-function-declaration -Werror=array-bounds -Werror=clobbered -Werror=volatile-register-var -ffile-prefix-map=/build/reproducible-path/muon-meson-0.4.0=. -fstack-protector-strong -Wformat -Werror=format-security -DBOOTSTRAP_NO_SAMU -Wdate-time -D_FORTIFY_SOURCE=2 -Wendif-labels -Wimplicit-fallthrough=2 -Winit-self -Wlogical-op -Wmissing-include-dirs -Wno-missing-braces -Wno-missing-field-initializers -Wno-unused-parameter -Wold-style-definition -Woverflow -Wstrict-aliasing=2 -Wstrict-prototypes -Wundef -Wvla -fstrict-aliasing -std=c99 -DMUON_BOOTSTRAPPED -I . -I .. -I ../include -I /usr/include/i386-linux-gnu -I /usr/include/p11-kit-1 -I /usr/include/pkgconf -I subprojects/tinyjson -I ../subprojects/tinyjson -I subprojects/bestline -I ../subprojects/bestline -I src/script -I subprojects/meson-docs -DMUON_PLATFORM_posix -DMUON_ENDIAN=0 -DHAVE_MESON_DOCS_H -MD -MQ muon.p/src/args.c.o -MF muon.p/src/args.c.o.d -o muon.p/src/args.c.o -c ../src/args.c
[77/133] i686-linux-gnu-gcc -g -O0 -Wpedantic -Wextra -Wall -fdiagnostics-color=always -g -O2 -Werror=implicit-function-declaration -Werror=array-bounds -Werror=clobbered -Werror=volatile-register-var -ffile-prefix-map=/build/reproducible-path/muon-meson-0.4.0=. -fstack-protector-strong -Wformat -Werror=format-security -DBOOTSTRAP_NO_SAMU -Wdate-time -D_FORTIFY_SOURCE=2 -Wendif-labels -Wimplicit-fallthrough=2 -Winit-self -Wlogical-op -Wmissing-include-dirs -Wno-missing-braces -Wno-missing-field-initializers -Wno-unused-parameter -Wold-style-definition -Woverflow -Wstrict-aliasing=2 -Wstrict-prototypes -Wundef -Wvla -fstrict-aliasing -std=c99 -DMUON_BOOTSTRAPPED -I . -I .. -I ../include -I /usr/include/i386-linux-gnu -I /usr/include/p11-kit-1 -I /usr/include/pkgconf -I subprojects/tinyjson -I ../subprojects/tinyjson -I subprojects/bestline -I ../subprojects/bestline -I src/script -I subprojects/meson-docs -DMUON_PLATFORM_posix -DMUON_ENDIAN=0 -DHAVE_MESON_DOCS_H -MD -MQ muon.p/src/lang/func_lookup.c.o -MF muon.p/src/lang/func_lookup.c.o.d -o muon.p/src/lang/func_lookup.c.o -c ../src/lang/func_lookup.c
[78/133] i686-linux-gnu-gcc -g -O0 -Wpedantic -Wextra -Wall -fdiagnostics-color=always -g -O2 -Werror=implicit-function-declaration -Werror=array-bounds -Werror=clobbered -Werror=volatile-register-var -ffile-prefix-map=/build/reproducible-path/muon-meson-0.4.0=. -fstack-protector-strong -Wformat -Werror=format-security -DBOOTSTRAP_NO_SAMU -Wdate-time -D_FORTIFY_SOURCE=2 -Wendif-labels -Wimplicit-fallthrough=2 -Winit-self -Wlogical-op -Wmissing-include-dirs -Wno-missing-braces -Wno-missing-field-initializers -Wno-unused-parameter -Wold-style-definition -Woverflow -Wstrict-aliasing=2 -Wstrict-prototypes -Wundef -Wvla -fstrict-aliasing -std=c99 -DMUON_BOOTSTRAPPED -I . -I .. -I ../include -I /usr/include/i386-linux-gnu -I /usr/include/p11-kit-1 -I /usr/include/pkgconf -I subprojects/tinyjson -I ../subprojects/tinyjson -I subprojects/bestline -I ../subprojects/bestline -I src/script -I subprojects/meson-docs -DMUON_PLATFORM_posix -DMUON_ENDIAN=0 -DHAVE_MESON_DOCS_H -MD -MQ muon.p/src/cmd_install.c.o -MF muon.p/src/cmd_install.c.o.d -o muon.p/src/cmd_install.c.o -c ../src/cmd_install.c
[79/133] i686-linux-gnu-gcc -g -O0 -Wpedantic -Wextra -Wall -fdiagnostics-color=always -g -O2 -Werror=implicit-function-declaration -Werror=array-bounds -Werror=clobbered -Werror=volatile-register-var -ffile-prefix-map=/build/reproducible-path/muon-meson-0.4.0=. -fstack-protector-strong -Wformat -Werror=format-security -DBOOTSTRAP_NO_SAMU -Wdate-time -D_FORTIFY_SOURCE=2 -Wendif-labels -Wimplicit-fallthrough=2 -Winit-self -Wlogical-op -Wmissing-include-dirs -Wno-missing-braces -Wno-missing-field-initializers -Wno-unused-parameter -Wold-style-definition -Woverflow -Wstrict-aliasing=2 -Wstrict-prototypes -Wundef -Wvla -fstrict-aliasing -std=c99 -DMUON_BOOTSTRAPPED -I . -I .. -I ../include -I /usr/include/i386-linux-gnu -I /usr/include/p11-kit-1 -I /usr/include/pkgconf -I subprojects/tinyjson -I ../subprojects/tinyjson -I subprojects/bestline -I ../subprojects/bestline -I src/script -I subprojects/meson-docs -DMUON_PLATFORM_posix -DMUON_ENDIAN=0 -DHAVE_MESON_DOCS_H -MD -MQ muon.p/src/lang/lexer.c.o -MF muon.p/src/lang/lexer.c.o.d -o muon.p/src/lang/lexer.c.o -c ../src/lang/lexer.c
[80/133] i686-linux-gnu-gcc -g -O0 -Wpedantic -Wextra -Wall -fdiagnostics-color=always -g -O2 -Werror=implicit-function-declaration -Werror=array-bounds -Werror=clobbered -Werror=volatile-register-var -ffile-prefix-map=/build/reproducible-path/muon-meson-0.4.0=. -fstack-protector-strong -Wformat -Werror=format-security -DBOOTSTRAP_NO_SAMU -Wdate-time -D_FORTIFY_SOURCE=2 -Wendif-labels -Wimplicit-fallthrough=2 -Winit-self -Wlogical-op -Wmissing-include-dirs -Wno-missing-braces -Wno-missing-field-initializers -Wno-unused-parameter -Wold-style-definition -Woverflow -Wstrict-aliasing=2 -Wstrict-prototypes -Wundef -Wvla -fstrict-aliasing -std=c99 -DMUON_BOOTSTRAPPED -I . -I .. -I ../include -I /usr/include/i386-linux-gnu -I /usr/include/p11-kit-1 -I /usr/include/pkgconf -I subprojects/tinyjson -I ../subprojects/tinyjson -I subprojects/bestline -I ../subprojects/bestline -I src/script -I subprojects/meson-docs -DMUON_PLATFORM_posix -DMUON_ENDIAN=0 -DHAVE_MESON_DOCS_H -MD -MQ muon.p/src/lang/compiler.c.o -MF muon.p/src/lang/compiler.c.o.d -o muon.p/src/lang/compiler.c.o -c ../src/lang/compiler.c
[81/133] i686-linux-gnu-gcc -g -O0 -Wpedantic -Wextra -Wall -fdiagnostics-color=always -g -O2 -Werror=implicit-function-declaration -Werror=array-bounds -Werror=clobbered -Werror=volatile-register-var -ffile-prefix-map=/build/reproducible-path/muon-meson-0.4.0=. -fstack-protector-strong -Wformat -Werror=format-security -DBOOTSTRAP_NO_SAMU -Wdate-time -D_FORTIFY_SOURCE=2 -Wendif-labels -Wimplicit-fallthrough=2 -Winit-self -Wlogical-op -Wmissing-include-dirs -Wno-missing-braces -Wno-missing-field-initializers -Wno-unused-parameter -Wold-style-definition -Woverflow -Wstrict-aliasing=2 -Wstrict-prototypes -Wundef -Wvla -fstrict-aliasing -std=c99 -DMUON_BOOTSTRAPPED -I . -I .. -I ../include -I /usr/include/i386-linux-gnu -I /usr/include/p11-kit-1 -I /usr/include/pkgconf -I subprojects/tinyjson -I ../subprojects/tinyjson -I subprojects/bestline -I ../subprojects/bestline -I src/script -I subprojects/meson-docs -DMUON_PLATFORM_posix -DMUON_ENDIAN=0 -DHAVE_MESON_DOCS_H -MD -MQ muon.p/src/cmd_subprojects.c.o -MF muon.p/src/cmd_subprojects.c.o.d -o muon.p/src/cmd_subprojects.c.o -c ../src/cmd_subprojects.c
[82/133] i686-linux-gnu-gcc -g -O0 -Wpedantic -Wextra -Wall -fdiagnostics-color=always -g -O2 -Werror=implicit-function-declaration -Werror=array-bounds -Werror=clobbered -Werror=volatile-register-var -ffile-prefix-map=/build/reproducible-path/muon-meson-0.4.0=. -fstack-protector-strong -Wformat -Werror=format-security -DBOOTSTRAP_NO_SAMU -Wdate-time -D_FORTIFY_SOURCE=2 -Wendif-labels -Wimplicit-fallthrough=2 -Winit-self -Wlogical-op -Wmissing-include-dirs -Wno-missing-braces -Wno-missing-field-initializers -Wno-unused-parameter -Wold-style-definition -Woverflow -Wstrict-aliasing=2 -Wstrict-prototypes -Wundef -Wvla -fstrict-aliasing -std=c99 -DMUON_BOOTSTRAPPED -I . -I .. -I ../include -I /usr/include/i386-linux-gnu -I /usr/include/p11-kit-1 -I /usr/include/pkgconf -I subprojects/tinyjson -I ../subprojects/tinyjson -I subprojects/bestline -I ../subprojects/bestline -I src/script -I subprojects/meson-docs -DMUON_PLATFORM_posix -DMUON_ENDIAN=0 -DHAVE_MESON_DOCS_H -MD -MQ muon.p/src/guess.c.o -MF muon.p/src/guess.c.o.d -o muon.p/src/guess.c.o -c ../src/guess.c
[83/133] i686-linux-gnu-gcc -g -O0 -Wpedantic -Wextra -Wall -fdiagnostics-color=always -g -O2 -Werror=implicit-function-declaration -Werror=array-bounds -Werror=clobbered -Werror=volatile-register-var -ffile-prefix-map=/build/reproducible-path/muon-meson-0.4.0=. -fstack-protector-strong -Wformat -Werror=format-security -DBOOTSTRAP_NO_SAMU -Wdate-time -D_FORTIFY_SOURCE=2 -Wendif-labels -Wimplicit-fallthrough=2 -Winit-self -Wlogical-op -Wmissing-include-dirs -Wno-missing-braces -Wno-missing-field-initializers -Wno-unused-parameter -Wold-style-definition -Woverflow -Wstrict-aliasing=2 -Wstrict-prototypes -Wundef -Wvla -fstrict-aliasing -std=c99 -DMUON_BOOTSTRAPPED -I . -I .. -I ../include -I /usr/include/i386-linux-gnu -I /usr/include/p11-kit-1 -I /usr/include/pkgconf -I subprojects/tinyjson -I ../subprojects/tinyjson -I subprojects/bestline -I ../subprojects/bestline -I src/script -I subprojects/meson-docs -DMUON_PLATFORM_posix -DMUON_ENDIAN=0 -DHAVE_MESON_DOCS_H -MD -MQ muon.p/src/lang/string.c.o -MF muon.p/src/lang/string.c.o.d -o muon.p/src/lang/string.c.o -c ../src/lang/string.c
[84/133] i686-linux-gnu-gcc -g -O0 -Wpedantic -Wextra -Wall -fdiagnostics-color=always -g -O2 -Werror=implicit-function-declaration -Werror=array-bounds -Werror=clobbered -Werror=volatile-register-var -ffile-prefix-map=/build/reproducible-path/muon-meson-0.4.0=. -fstack-protector-strong -Wformat -Werror=format-security -DBOOTSTRAP_NO_SAMU -Wdate-time -D_FORTIFY_SOURCE=2 -Wendif-labels -Wimplicit-fallthrough=2 -Winit-self -Wlogical-op -Wmissing-include-dirs -Wno-missing-braces -Wno-missing-field-initializers -Wno-unused-parameter -Wold-style-definition -Woverflow -Wstrict-aliasing=2 -Wstrict-prototypes -Wundef -Wvla -fstrict-aliasing -std=c99 -DMUON_BOOTSTRAPPED -I . -I .. -I ../include -I /usr/include/i386-linux-gnu -I /usr/include/p11-kit-1 -I /usr/include/pkgconf -I subprojects/tinyjson -I ../subprojects/tinyjson -I subprojects/bestline -I ../subprojects/bestline -I src/script -I subprojects/meson-docs -DMUON_PLATFORM_posix -DMUON_ENDIAN=0 -DHAVE_MESON_DOCS_H -MD -MQ muon.p/src/install.c.o -MF muon.p/src/install.c.o.d -o muon.p/src/install.c.o -c ../src/install.c
[85/133] i686-linux-gnu-gcc -g -O0 -Wpedantic -Wextra -Wall -fdiagnostics-color=always -g -O2 -Werror=implicit-function-declaration -Werror=array-bounds -Werror=clobbered -Werror=volatile-register-var -ffile-prefix-map=/build/reproducible-path/muon-meson-0.4.0=. -fstack-protector-strong -Wformat -Werror=format-security -DBOOTSTRAP_NO_SAMU -Wdate-time -D_FORTIFY_SOURCE=2 -Wendif-labels -Wimplicit-fallthrough=2 -Winit-self -Wlogical-op -Wmissing-include-dirs -Wno-missing-braces -Wno-missing-field-initializers -Wno-unused-parameter -Wold-style-definition -Woverflow -Wstrict-aliasing=2 -Wstrict-prototypes -Wundef -Wvla -fstrict-aliasing -std=c99 -DMUON_BOOTSTRAPPED -I . -I .. -I ../include -I /usr/include/i386-linux-gnu -I /usr/include/p11-kit-1 -I /usr/include/pkgconf -I subprojects/tinyjson -I ../subprojects/tinyjson -I subprojects/bestline -I ../subprojects/bestline -I src/script -I subprojects/meson-docs -DMUON_PLATFORM_posix -DMUON_ENDIAN=0 -DHAVE_MESON_DOCS_H -MD -MQ muon.p/src/log.c.o -MF muon.p/src/log.c.o.d -o muon.p/src/log.c.o -c ../src/log.c
[86/133] i686-linux-gnu-gcc -g -O0 -Wpedantic -Wextra -Wall -fdiagnostics-color=always -g -O2 -Werror=implicit-function-declaration -Werror=array-bounds -Werror=clobbered -Werror=volatile-register-var -ffile-prefix-map=/build/reproducible-path/muon-meson-0.4.0=. -fstack-protector-strong -Wformat -Werror=format-security -DBOOTSTRAP_NO_SAMU -Wdate-time -D_FORTIFY_SOURCE=2 -Wendif-labels -Wimplicit-fallthrough=2 -Winit-self -Wlogical-op -Wmissing-include-dirs -Wno-missing-braces -Wno-missing-field-initializers -Wno-unused-parameter -Wold-style-definition -Woverflow -Wstrict-aliasing=2 -Wstrict-prototypes -Wundef -Wvla -fstrict-aliasing -std=c99 -DMUON_BOOTSTRAPPED -I . -I .. -I ../include -I /usr/include/i386-linux-gnu -I /usr/include/p11-kit-1 -I /usr/include/pkgconf -I subprojects/tinyjson -I ../subprojects/tinyjson -I subprojects/bestline -I ../subprojects/bestline -I src/script -I subprojects/meson-docs -DMUON_PLATFORM_posix -DMUON_ENDIAN=0 -DHAVE_MESON_DOCS_H -MD -MQ muon.p/src/lang/fmt.c.o -MF muon.p/src/lang/fmt.c.o.d -o muon.p/src/lang/fmt.c.o -c ../src/lang/fmt.c
[87/133] i686-linux-gnu-gcc -g -O0 -Wpedantic -Wextra -Wall -fdiagnostics-color=always -g -O2 -Werror=implicit-function-declaration -Werror=array-bounds -Werror=clobbered -Werror=volatile-register-var -ffile-prefix-map=/build/reproducible-path/muon-meson-0.4.0=. -fstack-protector-strong -Wformat -Werror=format-security -DBOOTSTRAP_NO_SAMU -Wdate-time -D_FORTIFY_SOURCE=2 -Wendif-labels -Wimplicit-fallthrough=2 -Winit-self -Wlogical-op -Wmissing-include-dirs -Wno-missing-braces -Wno-missing-field-initializers -Wno-unused-parameter -Wold-style-definition -Woverflow -Wstrict-aliasing=2 -Wstrict-prototypes -Wundef -Wvla -fstrict-aliasing -std=c99 -DMUON_BOOTSTRAPPED -I . -I .. -I ../include -I /usr/include/i386-linux-gnu -I /usr/include/p11-kit-1 -I /usr/include/pkgconf -I subprojects/tinyjson -I ../subprojects/tinyjson -I subprojects/bestline -I ../subprojects/bestline -I src/script -I subprojects/meson-docs -DMUON_PLATFORM_posix -DMUON_ENDIAN=0 -DHAVE_MESON_DOCS_H -MD -MQ muon.p/src/machine_file.c.o -MF muon.p/src/machine_file.c.o.d -o muon.p/src/machine_file.c.o -c ../src/machine_file.c
[88/133] i686-linux-gnu-gcc -g -O0 -Wpedantic -Wextra -Wall -fdiagnostics-color=always -g -O2 -Werror=implicit-function-declaration -Werror=array-bounds -Werror=clobbered -Werror=volatile-register-var -ffile-prefix-map=/build/reproducible-path/muon-meson-0.4.0=. -fstack-protector-strong -Wformat -Werror=format-security -DBOOTSTRAP_NO_SAMU -Wdate-time -D_FORTIFY_SOURCE=2 -Wendif-labels -Wimplicit-fallthrough=2 -Winit-self -Wlogical-op -Wmissing-include-dirs -Wno-missing-braces -Wno-missing-field-initializers -Wno-unused-parameter -Wold-style-definition -Woverflow -Wstrict-aliasing=2 -Wstrict-prototypes -Wundef -Wvla -fstrict-aliasing -std=c99 -DMUON_BOOTSTRAPPED -I . -I .. -I ../include -I /usr/include/i386-linux-gnu -I /usr/include/p11-kit-1 -I /usr/include/pkgconf -I subprojects/tinyjson -I ../subprojects/tinyjson -I subprojects/bestline -I ../subprojects/bestline -I src/script -I subprojects/meson-docs -DMUON_PLATFORM_posix -DMUON_ENDIAN=0 -DHAVE_MESON_DOCS_H -MD -MQ muon.p/src/coerce.c.o -MF muon.p/src/coerce.c.o.d -o muon.p/src/coerce.c.o -c ../src/coerce.c
[89/133] i686-linux-gnu-gcc -g -O0 -Wpedantic -Wextra -Wall -fdiagnostics-color=always -g -O2 -Werror=implicit-function-declaration -Werror=array-bounds -Werror=clobbered -Werror=volatile-register-var -ffile-prefix-map=/build/reproducible-path/muon-meson-0.4.0=. -fstack-protector-strong -Wformat -Werror=format-security -DBOOTSTRAP_NO_SAMU -Wdate-time -D_FORTIFY_SOURCE=2 -Wendif-labels -Wimplicit-fallthrough=2 -Winit-self -Wlogical-op -Wmissing-include-dirs -Wno-missing-braces -Wno-missing-field-initializers -Wno-unused-parameter -Wold-style-definition -Woverflow -Wstrict-aliasing=2 -Wstrict-prototypes -Wundef -Wvla -fstrict-aliasing -std=c99 -DMUON_BOOTSTRAPPED -I . -I .. -I ../include -I /usr/include/i386-linux-gnu -I /usr/include/p11-kit-1 -I /usr/include/pkgconf -I subprojects/tinyjson -I ../subprojects/tinyjson -I subprojects/bestline -I ../subprojects/bestline -I src/script -I subprojects/meson-docs -DMUON_PLATFORM_posix -DMUON_ENDIAN=0 -DHAVE_MESON_DOCS_H -MD -MQ muon.p/src/embedded.c.o -MF muon.p/src/embedded.c.o.d -o muon.p/src/embedded.c.o -c ../src/embedded.c
[90/133] i686-linux-gnu-gcc -g -O0 -Wpedantic -Wextra -Wall -fdiagnostics-color=always -g -O2 -Werror=implicit-function-declaration -Werror=array-bounds -Werror=clobbered -Werror=volatile-register-var -ffile-prefix-map=/build/reproducible-path/muon-meson-0.4.0=. -fstack-protector-strong -Wformat -Werror=format-security -DBOOTSTRAP_NO_SAMU -Wdate-time -D_FORTIFY_SOURCE=2 -Wendif-labels -Wimplicit-fallthrough=2 -Winit-self -Wlogical-op -Wmissing-include-dirs -Wno-missing-braces -Wno-missing-field-initializers -Wno-unused-parameter -Wold-style-definition -Woverflow -Wstrict-aliasing=2 -Wstrict-prototypes -Wundef -Wvla -fstrict-aliasing -std=c99 -DMUON_BOOTSTRAPPED -I . -I .. -I ../include -I /usr/include/i386-linux-gnu -I /usr/include/p11-kit-1 -I /usr/include/pkgconf -I subprojects/tinyjson -I ../subprojects/tinyjson -I subprojects/bestline -I ../subprojects/bestline -I src/script -I subprojects/meson-docs -DMUON_PLATFORM_posix -DMUON_ENDIAN=0 -DHAVE_MESON_DOCS_H -MD -MQ muon.p/src/error.c.o -MF muon.p/src/error.c.o.d -o muon.p/src/error.c.o -c ../src/error.c
[91/133] i686-linux-gnu-gcc -g -O0 -Wpedantic -Wextra -Wall -fdiagnostics-color=always -g -O2 -Werror=implicit-function-declaration -Werror=array-bounds -Werror=clobbered -Werror=volatile-register-var -ffile-prefix-map=/build/reproducible-path/muon-meson-0.4.0=. -fstack-protector-strong -Wformat -Werror=format-security -DBOOTSTRAP_NO_SAMU -Wdate-time -D_FORTIFY_SOURCE=2 -Wendif-labels -Wimplicit-fallthrough=2 -Winit-self -Wlogical-op -Wmissing-include-dirs -Wno-missing-braces -Wno-missing-field-initializers -Wno-unused-parameter -Wold-style-definition -Woverflow -Wstrict-aliasing=2 -Wstrict-prototypes -Wundef -Wvla -fstrict-aliasing -std=c99 -DMUON_BOOTSTRAPPED -I . -I .. -I ../include -I /usr/include/i386-linux-gnu -I /usr/include/p11-kit-1 -I /usr/include/pkgconf -I subprojects/tinyjson -I ../subprojects/tinyjson -I subprojects/bestline -I ../subprojects/bestline -I src/script -I subprojects/meson-docs -DMUON_PLATFORM_posix -DMUON_ENDIAN=0 -DHAVE_MESON_DOCS_H -MD -MQ muon.p/src/lang/analyze.c.o -MF muon.p/src/lang/analyze.c.o.d -o muon.p/src/lang/analyze.c.o -c ../src/lang/analyze.c
[92/133] i686-linux-gnu-gcc -g -O0 -Wpedantic -Wextra -Wall -fdiagnostics-color=always -g -O2 -Werror=implicit-function-declaration -Werror=array-bounds -Werror=clobbered -Werror=volatile-register-var -ffile-prefix-map=/build/reproducible-path/muon-meson-0.4.0=. -fstack-protector-strong -Wformat -Werror=format-security -DBOOTSTRAP_NO_SAMU -Wdate-time -D_FORTIFY_SOURCE=2 -Wendif-labels -Wimplicit-fallthrough=2 -Winit-self -Wlogical-op -Wmissing-include-dirs -Wno-missing-braces -Wno-missing-field-initializers -Wno-unused-parameter -Wold-style-definition -Woverflow -Wstrict-aliasing=2 -Wstrict-prototypes -Wundef -Wvla -fstrict-aliasing -std=c99 -DMUON_BOOTSTRAPPED -I . -I .. -I ../include -I /usr/include/i386-linux-gnu -I /usr/include/p11-kit-1 -I /usr/include/pkgconf -I subprojects/tinyjson -I ../subprojects/tinyjson -I subprojects/bestline -I ../subprojects/bestline -I src/script -I subprojects/meson-docs -DMUON_PLATFORM_posix -DMUON_ENDIAN=0 -DHAVE_MESON_DOCS_H -MD -MQ muon.p/src/opts.c.o -MF muon.p/src/opts.c.o.d -o muon.p/src/opts.c.o -c ../src/opts.c
[93/133] i686-linux-gnu-gcc -g -O0 -Wpedantic -Wextra -Wall -fdiagnostics-color=always -g -O2 -Werror=implicit-function-declaration -Werror=array-bounds -Werror=clobbered -Werror=volatile-register-var -ffile-prefix-map=/build/reproducible-path/muon-meson-0.4.0=. -fstack-protector-strong -Wformat -Werror=format-security -DBOOTSTRAP_NO_SAMU -Wdate-time -D_FORTIFY_SOURCE=2 -Wendif-labels -Wimplicit-fallthrough=2 -Winit-self -Wlogical-op -Wmissing-include-dirs -Wno-missing-braces -Wno-missing-field-initializers -Wno-unused-parameter -Wold-style-definition -Woverflow -Wstrict-aliasing=2 -Wstrict-prototypes -Wundef -Wvla -fstrict-aliasing -std=c99 -DMUON_BOOTSTRAPPED -I . -I .. -I ../include -I /usr/include/i386-linux-gnu -I /usr/include/p11-kit-1 -I /usr/include/pkgconf -I subprojects/tinyjson -I ../subprojects/tinyjson -I subprojects/bestline -I ../subprojects/bestline -I src/script -I subprojects/meson-docs -DMUON_PLATFORM_posix -DMUON_ENDIAN=0 -DHAVE_MESON_DOCS_H -MD -MQ muon.p/src/platform/assert.c.o -MF muon.p/src/platform/assert.c.o.d -o muon.p/src/platform/assert.c.o -c ../src/platform/assert.c
[94/133] i686-linux-gnu-gcc -g -O0 -Wpedantic -Wextra -Wall -fdiagnostics-color=always -g -O2 -Werror=implicit-function-declaration -Werror=array-bounds -Werror=clobbered -Werror=volatile-register-var -ffile-prefix-map=/build/reproducible-path/muon-meson-0.4.0=. -fstack-protector-strong -Wformat -Werror=format-security -DBOOTSTRAP_NO_SAMU -Wdate-time -D_FORTIFY_SOURCE=2 -Wendif-labels -Wimplicit-fallthrough=2 -Winit-self -Wlogical-op -Wmissing-include-dirs -Wno-missing-braces -Wno-missing-field-initializers -Wno-unused-parameter -Wold-style-definition -Woverflow -Wstrict-aliasing=2 -Wstrict-prototypes -Wundef -Wvla -fstrict-aliasing -std=c99 -DMUON_BOOTSTRAPPED -I . -I .. -I ../include -I /usr/include/i386-linux-gnu -I /usr/include/p11-kit-1 -I /usr/include/pkgconf -I subprojects/tinyjson -I ../subprojects/tinyjson -I subprojects/bestline -I ../subprojects/bestline -I src/script -I subprojects/meson-docs -DMUON_PLATFORM_posix -DMUON_ENDIAN=0 -DHAVE_MESON_DOCS_H -MD -MQ muon.p/src/rpmvercmp.c.o -MF muon.p/src/rpmvercmp.c.o.d -o muon.p/src/rpmvercmp.c.o -c ../src/rpmvercmp.c
[95/133] i686-linux-gnu-gcc -g -O0 -Wpedantic -Wextra -Wall -fdiagnostics-color=always -g -O2 -Werror=implicit-function-declaration -Werror=array-bounds -Werror=clobbered -Werror=volatile-register-var -ffile-prefix-map=/build/reproducible-path/muon-meson-0.4.0=. -fstack-protector-strong -Wformat -Werror=format-security -DBOOTSTRAP_NO_SAMU -Wdate-time -D_FORTIFY_SOURCE=2 -Wendif-labels -Wimplicit-fallthrough=2 -Winit-self -Wlogical-op -Wmissing-include-dirs -Wno-missing-braces -Wno-missing-field-initializers -Wno-unused-parameter -Wold-style-definition -Woverflow -Wstrict-aliasing=2 -Wstrict-prototypes -Wundef -Wvla -fstrict-aliasing -std=c99 -DMUON_BOOTSTRAPPED -I . -I .. -I ../include -I /usr/include/i386-linux-gnu -I /usr/include/p11-kit-1 -I /usr/include/pkgconf -I subprojects/tinyjson -I ../subprojects/tinyjson -I subprojects/bestline -I ../subprojects/bestline -I src/script -I subprojects/meson-docs -DMUON_PLATFORM_posix -DMUON_ENDIAN=0 -DHAVE_MESON_DOCS_H -MD -MQ muon.p/src/machines.c.o -MF muon.p/src/machines.c.o.d -o muon.p/src/machines.c.o -c ../src/machines.c
[96/133] i686-linux-gnu-gcc -g -O0 -Wpedantic -Wextra -Wall -fdiagnostics-color=always -g -O2 -Werror=implicit-function-declaration -Werror=array-bounds -Werror=clobbered -Werror=volatile-register-var -ffile-prefix-map=/build/reproducible-path/muon-meson-0.4.0=. -fstack-protector-strong -Wformat -Werror=format-security -DBOOTSTRAP_NO_SAMU -Wdate-time -D_FORTIFY_SOURCE=2 -Wendif-labels -Wimplicit-fallthrough=2 -Winit-self -Wlogical-op -Wmissing-include-dirs -Wno-missing-braces -Wno-missing-field-initializers -Wno-unused-parameter -Wold-style-definition -Woverflow -Wstrict-aliasing=2 -Wstrict-prototypes -Wundef -Wvla -fstrict-aliasing -std=c99 -DMUON_BOOTSTRAPPED -I . -I .. -I ../include -I /usr/include/i386-linux-gnu -I /usr/include/p11-kit-1 -I /usr/include/pkgconf -I subprojects/tinyjson -I ../subprojects/tinyjson -I subprojects/bestline -I ../subprojects/bestline -I src/script -I subprojects/meson-docs -DMUON_PLATFORM_posix -DMUON_ENDIAN=0 -DHAVE_MESON_DOCS_H -MD -MQ muon.p/src/vsenv.c.o -MF muon.p/src/vsenv.c.o.d -o muon.p/src/vsenv.c.o -c ../src/vsenv.c
[97/133] i686-linux-gnu-gcc -g -O0 -Wpedantic -Wextra -Wall -fdiagnostics-color=always -g -O2 -Werror=implicit-function-declaration -Werror=array-bounds -Werror=clobbered -Werror=volatile-register-var -ffile-prefix-map=/build/reproducible-path/muon-meson-0.4.0=. -fstack-protector-strong -Wformat -Werror=format-security -DBOOTSTRAP_NO_SAMU -Wdate-time -D_FORTIFY_SOURCE=2 -Wendif-labels -Wimplicit-fallthrough=2 -Winit-self -Wlogical-op -Wmissing-include-dirs -Wno-missing-braces -Wno-missing-field-initializers -Wno-unused-parameter -Wold-style-definition -Woverflow -Wstrict-aliasing=2 -Wstrict-prototypes -Wundef -Wvla -fstrict-aliasing -std=c99 -DMUON_BOOTSTRAPPED -I . -I .. -I ../include -I /usr/include/i386-linux-gnu -I /usr/include/p11-kit-1 -I /usr/include/pkgconf -I subprojects/tinyjson -I ../subprojects/tinyjson -I subprojects/bestline -I ../subprojects/bestline -I src/script -I subprojects/meson-docs -DMUON_PLATFORM_posix -DMUON_ENDIAN=0 -DHAVE_MESON_DOCS_H -MD -MQ muon.p/src/cmd_test.c.o -MF muon.p/src/cmd_test.c.o.d -o muon.p/src/cmd_test.c.o -c ../src/cmd_test.c
[98/133] i686-linux-gnu-gcc -g -O0 -Wpedantic -Wextra -Wall -fdiagnostics-color=always -g -O2 -Werror=implicit-function-declaration -Werror=array-bounds -Werror=clobbered -Werror=volatile-register-var -ffile-prefix-map=/build/reproducible-path/muon-meson-0.4.0=. -fstack-protector-strong -Wformat -Werror=format-security -DBOOTSTRAP_NO_SAMU -Wdate-time -D_FORTIFY_SOURCE=2 -Wendif-labels -Wimplicit-fallthrough=2 -Winit-self -Wlogical-op -Wmissing-include-dirs -Wno-missing-braces -Wno-missing-field-initializers -Wno-unused-parameter -Wold-style-definition -Woverflow -Wstrict-aliasing=2 -Wstrict-prototypes -Wundef -Wvla -fstrict-aliasing -std=c99 -DMUON_BOOTSTRAPPED -I . -I .. -I ../include -I /usr/include/i386-linux-gnu -I /usr/include/p11-kit-1 -I /usr/include/pkgconf -I subprojects/tinyjson -I ../subprojects/tinyjson -I subprojects/bestline -I ../subprojects/bestline -I src/script -I subprojects/meson-docs -DMUON_PLATFORM_posix -DMUON_ENDIAN=0 -DHAVE_MESON_DOCS_H -MD -MQ muon.p/src/memmem.c.o -MF muon.p/src/memmem.c.o.d -o muon.p/src/memmem.c.o -c ../src/memmem.c
[99/133] i686-linux-gnu-gcc -g -O0 -Wpedantic -Wextra -Wall -fdiagnostics-color=always -g -O2 -Werror=implicit-function-declaration -Werror=array-bounds -Werror=clobbered -Werror=volatile-register-var -ffile-prefix-map=/build/reproducible-path/muon-meson-0.4.0=. -fstack-protector-strong -Wformat -Werror=format-security -DBOOTSTRAP_NO_SAMU -Wdate-time -D_FORTIFY_SOURCE=2 -Wendif-labels -Wimplicit-fallthrough=2 -Winit-self -Wlogical-op -Wmissing-include-dirs -Wno-missing-braces -Wno-missing-field-initializers -Wno-unused-parameter -Wold-style-definition -Woverflow -Wstrict-aliasing=2 -Wstrict-prototypes -Wundef -Wvla -fstrict-aliasing -std=c99 -DMUON_BOOTSTRAPPED -I . -I .. -I ../include -I /usr/include/i386-linux-gnu -I /usr/include/p11-kit-1 -I /usr/include/pkgconf -I subprojects/tinyjson -I ../subprojects/tinyjson -I subprojects/bestline -I ../subprojects/bestline -I src/script -I subprojects/meson-docs -DMUON_PLATFORM_posix -DMUON_ENDIAN=0 -DHAVE_MESON_DOCS_H -MD -MQ muon.p/src/sha_256.c.o -MF muon.p/src/sha_256.c.o.d -o muon.p/src/sha_256.c.o -c ../src/sha_256.c
[100/133] i686-linux-gnu-gcc -g -O0 -Wpedantic -Wextra -Wall -fdiagnostics-color=always -g -O2 -Werror=implicit-function-declaration -Werror=array-bounds -Werror=clobbered -Werror=volatile-register-var -ffile-prefix-map=/build/reproducible-path/muon-meson-0.4.0=. -fstack-protector-strong -Wformat -Werror=format-security -DBOOTSTRAP_NO_SAMU -Wdate-time -D_FORTIFY_SOURCE=2 -Wendif-labels -Wimplicit-fallthrough=2 -Winit-self -Wlogical-op -Wmissing-include-dirs -Wno-missing-braces -Wno-missing-field-initializers -Wno-unused-parameter -Wold-style-definition -Woverflow -Wstrict-aliasing=2 -Wstrict-prototypes -Wundef -Wvla -fstrict-aliasing -std=c99 -DMUON_BOOTSTRAPPED -I . -I .. -I ../include -I /usr/include/i386-linux-gnu -I /usr/include/p11-kit-1 -I /usr/include/pkgconf -I subprojects/tinyjson -I ../subprojects/tinyjson -I subprojects/bestline -I ../subprojects/bestline -I src/script -I subprojects/meson-docs -DMUON_PLATFORM_posix -DMUON_ENDIAN=0 -DHAVE_MESON_DOCS_H -MD -MQ muon.p/src/platform/os.c.o -MF muon.p/src/platform/os.c.o.d -o muon.p/src/platform/os.c.o -c ../src/platform/os.c
[101/133] i686-linux-gnu-gcc -g -O0 -Wpedantic -Wextra -Wall -fdiagnostics-color=always -g -O2 -Werror=implicit-function-declaration -Werror=array-bounds -Werror=clobbered -Werror=volatile-register-var -ffile-prefix-map=/build/reproducible-path/muon-meson-0.4.0=. -fstack-protector-strong -Wformat -Werror=format-security -DBOOTSTRAP_NO_SAMU -Wdate-time -D_FORTIFY_SOURCE=2 -Wendif-labels -Wimplicit-fallthrough=2 -Winit-self -Wlogical-op -Wmissing-include-dirs -Wno-missing-braces -Wno-missing-field-initializers -Wno-unused-parameter -Wold-style-definition -Woverflow -Wstrict-aliasing=2 -Wstrict-prototypes -Wundef -Wvla -fstrict-aliasing -std=c99 -DMUON_BOOTSTRAPPED -I . -I .. -I ../include -I /usr/include/i386-linux-gnu -I /usr/include/p11-kit-1 -I /usr/include/pkgconf -I subprojects/tinyjson -I ../subprojects/tinyjson -I subprojects/bestline -I ../subprojects/bestline -I src/script -I subprojects/meson-docs -DMUON_PLATFORM_posix -DMUON_ENDIAN=0 -DHAVE_MESON_DOCS_H -MD -MQ muon.p/src/platform/mem.c.o -MF muon.p/src/platform/mem.c.o.d -o muon.p/src/platform/mem.c.o -c ../src/platform/mem.c
[102/133] i686-linux-gnu-gcc -g -O0 -Wpedantic -Wextra -Wall -fdiagnostics-color=always -g -O2 -Werror=implicit-function-declaration -Werror=array-bounds -Werror=clobbered -Werror=volatile-register-var -ffile-prefix-map=/build/reproducible-path/muon-meson-0.4.0=. -fstack-protector-strong -Wformat -Werror=format-security -DBOOTSTRAP_NO_SAMU -Wdate-time -D_FORTIFY_SOURCE=2 -Wendif-labels -Wimplicit-fallthrough=2 -Winit-self -Wlogical-op -Wmissing-include-dirs -Wno-missing-braces -Wno-missing-field-initializers -Wno-unused-parameter -Wold-style-definition -Woverflow -Wstrict-aliasing=2 -Wstrict-prototypes -Wundef -Wvla -fstrict-aliasing -std=c99 -DMUON_BOOTSTRAPPED -I . -I .. -I ../include -I /usr/include/i386-linux-gnu -I /usr/include/p11-kit-1 -I /usr/include/pkgconf -I subprojects/tinyjson -I ../subprojects/tinyjson -I subprojects/bestline -I ../subprojects/bestline -I src/script -I subprojects/meson-docs -DMUON_PLATFORM_posix -DMUON_ENDIAN=0 -DHAVE_MESON_DOCS_H -MD -MQ muon.p/src/platform/uname.c.o -MF muon.p/src/platform/uname.c.o.d -o muon.p/src/platform/uname.c.o -c ../src/platform/uname.c
[103/133] i686-linux-gnu-gcc -g -O0 -Wpedantic -Wextra -Wall -fdiagnostics-color=always -g -O2 -Werror=implicit-function-declaration -Werror=array-bounds -Werror=clobbered -Werror=volatile-register-var -ffile-prefix-map=/build/reproducible-path/muon-meson-0.4.0=. -fstack-protector-strong -Wformat -Werror=format-security -DBOOTSTRAP_NO_SAMU -Wdate-time -D_FORTIFY_SOURCE=2 -Wendif-labels -Wimplicit-fallthrough=2 -Winit-self -Wlogical-op -Wmissing-include-dirs -Wno-missing-braces -Wno-missing-field-initializers -Wno-unused-parameter -Wold-style-definition -Woverflow -Wstrict-aliasing=2 -Wstrict-prototypes -Wundef -Wvla -fstrict-aliasing -std=c99 -DMUON_BOOTSTRAPPED -I . -I .. -I ../include -I /usr/include/i386-linux-gnu -I /usr/include/p11-kit-1 -I /usr/include/pkgconf -I subprojects/tinyjson -I ../subprojects/tinyjson -I subprojects/bestline -I ../subprojects/bestline -I src/script -I subprojects/meson-docs -DMUON_PLATFORM_posix -DMUON_ENDIAN=0 -DHAVE_MESON_DOCS_H -MD -MQ muon.p/src/platform/posix/log.c.o -MF muon.p/src/platform/posix/log.c.o.d -o muon.p/src/platform/posix/log.c.o -c ../src/platform/posix/log.c
[104/133] i686-linux-gnu-gcc -g -O0 -Wpedantic -Wextra -Wall -fdiagnostics-color=always -g -O2 -Werror=implicit-function-declaration -Werror=array-bounds -Werror=clobbered -Werror=volatile-register-var -ffile-prefix-map=/build/reproducible-path/muon-meson-0.4.0=. -fstack-protector-strong -Wformat -Werror=format-security -DBOOTSTRAP_NO_SAMU -Wdate-time -D_FORTIFY_SOURCE=2 -Wendif-labels -Wimplicit-fallthrough=2 -Winit-self -Wlogical-op -Wmissing-include-dirs -Wno-missing-braces -Wno-missing-field-initializers -Wno-unused-parameter -Wold-style-definition -Woverflow -Wstrict-aliasing=2 -Wstrict-prototypes -Wundef -Wvla -fstrict-aliasing -std=c99 -DMUON_BOOTSTRAPPED -I . -I .. -I ../include -I /usr/include/i386-linux-gnu -I /usr/include/p11-kit-1 -I /usr/include/pkgconf -I subprojects/tinyjson -I ../subprojects/tinyjson -I subprojects/bestline -I ../subprojects/bestline -I src/script -I subprojects/meson-docs -DMUON_PLATFORM_posix -DMUON_ENDIAN=0 -DHAVE_MESON_DOCS_H -MD -MQ muon.p/src/platform/posix/init.c.o -MF muon.p/src/platform/posix/init.c.o.d -o muon.p/src/platform/posix/init.c.o -c ../src/platform/posix/init.c
[105/133] i686-linux-gnu-gcc -g -O0 -Wpedantic -Wextra -Wall -fdiagnostics-color=always -g -O2 -Werror=implicit-function-declaration -Werror=array-bounds -Werror=clobbered -Werror=volatile-register-var -ffile-prefix-map=/build/reproducible-path/muon-meson-0.4.0=. -fstack-protector-strong -Wformat -Werror=format-security -DBOOTSTRAP_NO_SAMU -Wdate-time -D_FORTIFY_SOURCE=2 -Wendif-labels -Wimplicit-fallthrough=2 -Winit-self -Wlogical-op -Wmissing-include-dirs -Wno-missing-braces -Wno-missing-field-initializers -Wno-unused-parameter -Wold-style-definition -Woverflow -Wstrict-aliasing=2 -Wstrict-prototypes -Wundef -Wvla -fstrict-aliasing -std=c99 -DMUON_BOOTSTRAPPED -I . -I .. -I ../include -I /usr/include/i386-linux-gnu -I /usr/include/p11-kit-1 -I /usr/include/pkgconf -I subprojects/tinyjson -I ../subprojects/tinyjson -I subprojects/bestline -I ../subprojects/bestline -I src/script -I subprojects/meson-docs -DMUON_PLATFORM_posix -DMUON_ENDIAN=0 -DHAVE_MESON_DOCS_H -MD -MQ muon.p/src/platform/run_cmd.c.o -MF muon.p/src/platform/run_cmd.c.o.d -o muon.p/src/platform/run_cmd.c.o -c ../src/platform/run_cmd.c
[106/133] i686-linux-gnu-gcc -g -O0 -Wpedantic -Wextra -Wall -fdiagnostics-color=always -g -O2 -Werror=implicit-function-declaration -Werror=array-bounds -Werror=clobbered -Werror=volatile-register-var -ffile-prefix-map=/build/reproducible-path/muon-meson-0.4.0=. -fstack-protector-strong -Wformat -Werror=format-security -DBOOTSTRAP_NO_SAMU -Wdate-time -D_FORTIFY_SOURCE=2 -Wendif-labels -Wimplicit-fallthrough=2 -Winit-self -Wlogical-op -Wmissing-include-dirs -Wno-missing-braces -Wno-missing-field-initializers -Wno-unused-parameter -Wold-style-definition -Woverflow -Wstrict-aliasing=2 -Wstrict-prototypes -Wundef -Wvla -fstrict-aliasing -std=c99 -DMUON_BOOTSTRAPPED -I . -I .. -I ../include -I /usr/include/i386-linux-gnu -I /usr/include/p11-kit-1 -I /usr/include/pkgconf -I subprojects/tinyjson -I ../subprojects/tinyjson -I subprojects/bestline -I ../subprojects/bestline -I src/script -I subprojects/meson-docs -DMUON_PLATFORM_posix -DMUON_ENDIAN=0 -DHAVE_MESON_DOCS_H -MD -MQ muon.p/src/platform/posix/path.c.o -MF muon.p/src/platform/posix/path.c.o.d -o muon.p/src/platform/posix/path.c.o -c ../src/platform/posix/path.c
[107/133] i686-linux-gnu-gcc -g -O0 -Wpedantic -Wextra -Wall -fdiagnostics-color=always -g -O2 -Werror=implicit-function-declaration -Werror=array-bounds -Werror=clobbered -Werror=volatile-register-var -ffile-prefix-map=/build/reproducible-path/muon-meson-0.4.0=. -fstack-protector-strong -Wformat -Werror=format-security -DBOOTSTRAP_NO_SAMU -Wdate-time -D_FORTIFY_SOURCE=2 -Wendif-labels -Wimplicit-fallthrough=2 -Winit-self -Wlogical-op -Wmissing-include-dirs -Wno-missing-braces -Wno-missing-field-initializers -Wno-unused-parameter -Wold-style-definition -Woverflow -Wstrict-aliasing=2 -Wstrict-prototypes -Wundef -Wvla -fstrict-aliasing -std=c99 -DMUON_BOOTSTRAPPED -I . -I .. -I ../include -I /usr/include/i386-linux-gnu -I /usr/include/p11-kit-1 -I /usr/include/pkgconf -I subprojects/tinyjson -I ../subprojects/tinyjson -I subprojects/bestline -I ../subprojects/bestline -I src/script -I subprojects/meson-docs -DMUON_PLATFORM_posix -DMUON_ENDIAN=0 -DHAVE_MESON_DOCS_H -MD -MQ muon.p/src/platform/posix/os.c.o -MF muon.p/src/platform/posix/os.c.o.d -o muon.p/src/platform/posix/os.c.o -c ../src/platform/posix/os.c
[108/133] i686-linux-gnu-gcc -g -O0 -Wpedantic -Wextra -Wall -fdiagnostics-color=always -g -O2 -Werror=implicit-function-declaration -Werror=array-bounds -Werror=clobbered -Werror=volatile-register-var -ffile-prefix-map=/build/reproducible-path/muon-meson-0.4.0=. -fstack-protector-strong -Wformat -Werror=format-security -DBOOTSTRAP_NO_SAMU -Wdate-time -D_FORTIFY_SOURCE=2 -Wendif-labels -Wimplicit-fallthrough=2 -Winit-self -Wlogical-op -Wmissing-include-dirs -Wno-missing-braces -Wno-missing-field-initializers -Wno-unused-parameter -Wold-style-definition -Woverflow -Wstrict-aliasing=2 -Wstrict-prototypes -Wundef -Wvla -fstrict-aliasing -std=c99 -DMUON_BOOTSTRAPPED -I . -I .. -I ../include -I /usr/include/i386-linux-gnu -I /usr/include/p11-kit-1 -I /usr/include/pkgconf -I subprojects/tinyjson -I ../subprojects/tinyjson -I subprojects/bestline -I ../subprojects/bestline -I src/script -I subprojects/meson-docs -DMUON_PLATFORM_posix -DMUON_ENDIAN=0 -DHAVE_MESON_DOCS_H -MD -MQ muon.p/src/platform/filesystem.c.o -MF muon.p/src/platform/filesystem.c.o.d -o muon.p/src/platform/filesystem.c.o -c ../src/platform/filesystem.c
[109/133] i686-linux-gnu-gcc -g -O0 -Wpedantic -Wextra -Wall -fdiagnostics-color=always -g -O2 -Werror=implicit-function-declaration -Werror=array-bounds -Werror=clobbered -Werror=volatile-register-var -ffile-prefix-map=/build/reproducible-path/muon-meson-0.4.0=. -fstack-protector-strong -Wformat -Werror=format-security -DBOOTSTRAP_NO_SAMU -Wdate-time -D_FORTIFY_SOURCE=2 -Wendif-labels -Wimplicit-fallthrough=2 -Winit-self -Wlogical-op -Wmissing-include-dirs -Wno-missing-braces -Wno-missing-field-initializers -Wno-unused-parameter -Wold-style-definition -Woverflow -Wstrict-aliasing=2 -Wstrict-prototypes -Wundef -Wvla -fstrict-aliasing -std=c99 -DMUON_BOOTSTRAPPED -I . -I .. -I ../include -I /usr/include/i386-linux-gnu -I /usr/include/p11-kit-1 -I /usr/include/pkgconf -I subprojects/tinyjson -I ../subprojects/tinyjson -I subprojects/bestline -I ../subprojects/bestline -I src/script -I subprojects/meson-docs -DMUON_PLATFORM_posix -DMUON_ENDIAN=0 -DHAVE_MESON_DOCS_H -MD -MQ muon.p/src/platform/posix/term.c.o -MF muon.p/src/platform/posix/term.c.o.d -o muon.p/src/platform/posix/term.c.o -c ../src/platform/posix/term.c
[110/133] i686-linux-gnu-gcc -g -O0 -Wpedantic -Wextra -Wall -fdiagnostics-color=always -g -O2 -Werror=implicit-function-declaration -Werror=array-bounds -Werror=clobbered -Werror=volatile-register-var -ffile-prefix-map=/build/reproducible-path/muon-meson-0.4.0=. -fstack-protector-strong -Wformat -Werror=format-security -DBOOTSTRAP_NO_SAMU -Wdate-time -D_FORTIFY_SOURCE=2 -Wendif-labels -Wimplicit-fallthrough=2 -Winit-self -Wlogical-op -Wmissing-include-dirs -Wno-missing-braces -Wno-missing-field-initializers -Wno-unused-parameter -Wold-style-definition -Woverflow -Wstrict-aliasing=2 -Wstrict-prototypes -Wundef -Wvla -fstrict-aliasing -std=c99 -DMUON_BOOTSTRAPPED -I . -I .. -I ../include -I /usr/include/i386-linux-gnu -I /usr/include/p11-kit-1 -I /usr/include/pkgconf -I subprojects/tinyjson -I ../subprojects/tinyjson -I subprojects/bestline -I ../subprojects/bestline -I src/script -I subprojects/meson-docs -DMUON_PLATFORM_posix -DMUON_ENDIAN=0 -DHAVE_MESON_DOCS_H -MD -MQ muon.p/src/platform/posix/filesystem.c.o -MF muon.p/src/platform/posix/filesystem.c.o.d -o muon.p/src/platform/posix/filesystem.c.o -c ../src/platform/posix/filesystem.c
[111/133] i686-linux-gnu-gcc -g -O0 -Wpedantic -Wextra -Wall -fdiagnostics-color=always -g -O2 -Werror=implicit-function-declaration -Werror=array-bounds -Werror=clobbered -Werror=volatile-register-var -ffile-prefix-map=/build/reproducible-path/muon-meson-0.4.0=. -fstack-protector-strong -Wformat -Werror=format-security -DBOOTSTRAP_NO_SAMU -Wdate-time -D_FORTIFY_SOURCE=2 -Wendif-labels -Wimplicit-fallthrough=2 -Winit-self -Wlogical-op -Wmissing-include-dirs -Wno-missing-braces -Wno-missing-field-initializers -Wno-unused-parameter -Wold-style-definition -Woverflow -Wstrict-aliasing=2 -Wstrict-prototypes -Wundef -Wvla -fstrict-aliasing -std=c99 -DMUON_BOOTSTRAPPED -I . -I .. -I ../include -I /usr/include/i386-linux-gnu -I /usr/include/p11-kit-1 -I /usr/include/pkgconf -I subprojects/tinyjson -I ../subprojects/tinyjson -I subprojects/bestline -I ../subprojects/bestline -I src/script -I subprojects/meson-docs -DMUON_PLATFORM_posix -DMUON_ENDIAN=0 -DHAVE_MESON_DOCS_H -MD -MQ muon.p/src/platform/path.c.o -MF muon.p/src/platform/path.c.o.d -o muon.p/src/platform/path.c.o -c ../src/platform/path.c
[112/133] i686-linux-gnu-gcc -g -O0 -Wpedantic -Wextra -Wall -fdiagnostics-color=always -g -O2 -Werror=implicit-function-declaration -Werror=array-bounds -Werror=clobbered -Werror=volatile-register-var -ffile-prefix-map=/build/reproducible-path/muon-meson-0.4.0=. -fstack-protector-strong -Wformat -Werror=format-security -DBOOTSTRAP_NO_SAMU -Wdate-time -D_FORTIFY_SOURCE=2 -Wendif-labels -Wimplicit-fallthrough=2 -Winit-self -Wlogical-op -Wmissing-include-dirs -Wno-missing-braces -Wno-missing-field-initializers -Wno-unused-parameter -Wold-style-definition -Woverflow -Wstrict-aliasing=2 -Wstrict-prototypes -Wundef -Wvla -fstrict-aliasing -std=c99 -DMUON_BOOTSTRAPPED -I . -I .. -I ../include -I /usr/include/i386-linux-gnu -I /usr/include/p11-kit-1 -I /usr/include/pkgconf -I subprojects/tinyjson -I ../subprojects/tinyjson -I subprojects/bestline -I ../subprojects/bestline -I src/script -I subprojects/meson-docs -DMUON_PLATFORM_posix -DMUON_ENDIAN=0 -DHAVE_MESON_DOCS_H -MD -MQ muon.p/src/version.c.o -MF muon.p/src/version.c.o.d -o muon.p/src/version.c.o -c src/version.c
[113/133] i686-linux-gnu-gcc -g -O0 -Wpedantic -Wextra -Wall -fdiagnostics-color=always -g -O2 -Werror=implicit-function-declaration -Werror=array-bounds -Werror=clobbered -Werror=volatile-register-var -ffile-prefix-map=/build/reproducible-path/muon-meson-0.4.0=. -fstack-protector-strong -Wformat -Werror=format-security -DBOOTSTRAP_NO_SAMU -Wdate-time -D_FORTIFY_SOURCE=2 -Wendif-labels -Wimplicit-fallthrough=2 -Winit-self -Wlogical-op -Wmissing-include-dirs -Wno-missing-braces -Wno-missing-field-initializers -Wno-unused-parameter -Wold-style-definition -Woverflow -Wstrict-aliasing=2 -Wstrict-prototypes -Wundef -Wvla -fstrict-aliasing -std=c99 -DMUON_BOOTSTRAPPED -I . -I .. -I ../include -I /usr/include/i386-linux-gnu -I /usr/include/p11-kit-1 -I /usr/include/pkgconf -I subprojects/tinyjson -I ../subprojects/tinyjson -I subprojects/bestline -I ../subprojects/bestline -I src/script -I subprojects/meson-docs -DMUON_PLATFORM_posix -DMUON_ENDIAN=0 -DHAVE_MESON_DOCS_H -MD -MQ muon.p/src/platform/posix/uname.c.o -MF muon.p/src/platform/posix/uname.c.o.d -o muon.p/src/platform/posix/uname.c.o -c ../src/platform/posix/uname.c
[114/133] i686-linux-gnu-gcc -g -O0 -Wpedantic -Wextra -Wall -fdiagnostics-color=always -g -O2 -Werror=implicit-function-declaration -Werror=array-bounds -Werror=clobbered -Werror=volatile-register-var -ffile-prefix-map=/build/reproducible-path/muon-meson-0.4.0=. -fstack-protector-strong -Wformat -Werror=format-security -DBOOTSTRAP_NO_SAMU -Wdate-time -D_FORTIFY_SOURCE=2 -Wendif-labels -Wimplicit-fallthrough=2 -Winit-self -Wlogical-op -Wmissing-include-dirs -Wno-missing-braces -Wno-missing-field-initializers -Wno-unused-parameter -Wold-style-definition -Woverflow -Wstrict-aliasing=2 -Wstrict-prototypes -Wundef -Wvla -fstrict-aliasing -std=c99 -DMUON_BOOTSTRAPPED -I . -I .. -I ../include -I /usr/include/i386-linux-gnu -I /usr/include/p11-kit-1 -I /usr/include/pkgconf -I subprojects/tinyjson -I ../subprojects/tinyjson -I subprojects/bestline -I ../subprojects/bestline -I src/script -I subprojects/meson-docs -DMUON_PLATFORM_posix -DMUON_ENDIAN=0 -DHAVE_MESON_DOCS_H -MD -MQ muon.p/src/wrap.c.o -MF muon.p/src/wrap.c.o.d -o muon.p/src/wrap.c.o -c ../src/wrap.c
[115/133] i686-linux-gnu-gcc -g -O0 -Wpedantic -Wextra -Wall -fdiagnostics-color=always -g -O2 -Werror=implicit-function-declaration -Werror=array-bounds -Werror=clobbered -Werror=volatile-register-var -ffile-prefix-map=/build/reproducible-path/muon-meson-0.4.0=. -fstack-protector-strong -Wformat -Werror=format-security -DBOOTSTRAP_NO_SAMU -Wdate-time -D_FORTIFY_SOURCE=2 -Wendif-labels -Wimplicit-fallthrough=2 -Winit-self -Wlogical-op -Wmissing-include-dirs -Wno-missing-braces -Wno-missing-field-initializers -Wno-unused-parameter -Wold-style-definition -Woverflow -Wstrict-aliasing=2 -Wstrict-prototypes -Wundef -Wvla -fstrict-aliasing -std=c99 -DMUON_BOOTSTRAPPED -I . -I .. -I ../include -I /usr/include/i386-linux-gnu -I /usr/include/p11-kit-1 -I /usr/include/pkgconf -I subprojects/tinyjson -I ../subprojects/tinyjson -I subprojects/bestline -I ../subprojects/bestline -I src/script -I subprojects/meson-docs -DMUON_PLATFORM_posix -DMUON_ENDIAN=0 -DHAVE_MESON_DOCS_H -MD -MQ muon.p/src/platform/posix/timer.c.o -MF muon.p/src/platform/posix/timer.c.o.d -o muon.p/src/platform/posix/timer.c.o -c ../src/platform/posix/timer.c
[116/133] i686-linux-gnu-gcc -g -O0 -Wpedantic -Wextra -Wall -fdiagnostics-color=always -g -O2 -Werror=implicit-function-declaration -Werror=array-bounds -Werror=clobbered -Werror=volatile-register-var -ffile-prefix-map=/build/reproducible-path/muon-meson-0.4.0=. -fstack-protector-strong -Wformat -Werror=format-security -DBOOTSTRAP_NO_SAMU -Wdate-time -D_FORTIFY_SOURCE=2 -Wendif-labels -Wimplicit-fallthrough=2 -Winit-self -Wlogical-op -Wmissing-include-dirs -Wno-missing-braces -Wno-missing-field-initializers -Wno-unused-parameter -Wold-style-definition -Woverflow -Wstrict-aliasing=2 -Wstrict-prototypes -Wundef -Wvla -fstrict-aliasing -std=c99 -DMUON_BOOTSTRAPPED -I . -I .. -I ../include -I /usr/include/i386-linux-gnu -I /usr/include/p11-kit-1 -I /usr/include/pkgconf -I subprojects/tinyjson -I ../subprojects/tinyjson -I subprojects/bestline -I ../subprojects/bestline -I src/script -I subprojects/meson-docs -DMUON_PLATFORM_posix -DMUON_ENDIAN=0 -DHAVE_MESON_DOCS_H -MD -MQ muon.p/src/external/libarchive.c.o -MF muon.p/src/external/libarchive.c.o.d -o muon.p/src/external/libarchive.c.o -c ../src/external/libarchive.c
[117/133] i686-linux-gnu-gcc -g -O0 -Wpedantic -Wextra -Wall -fdiagnostics-color=always -g -O2 -Werror=implicit-function-declaration -Werror=array-bounds -Werror=clobbered -Werror=volatile-register-var -ffile-prefix-map=/build/reproducible-path/muon-meson-0.4.0=. -fstack-protector-strong -Wformat -Werror=format-security -DBOOTSTRAP_NO_SAMU -Wdate-time -D_FORTIFY_SOURCE=2 -Wendif-labels -Wimplicit-fallthrough=2 -Winit-self -Wlogical-op -Wmissing-include-dirs -Wno-missing-braces -Wno-missing-field-initializers -Wno-unused-parameter -Wold-style-definition -Woverflow -Wstrict-aliasing=2 -Wstrict-prototypes -Wundef -Wvla -fstrict-aliasing -std=c99 -DMUON_BOOTSTRAPPED -I . -I .. -I ../include -I /usr/include/i386-linux-gnu -I /usr/include/p11-kit-1 -I /usr/include/pkgconf -I subprojects/tinyjson -I ../subprojects/tinyjson -I subprojects/bestline -I ../subprojects/bestline -I src/script -I subprojects/meson-docs -DMUON_PLATFORM_posix -DMUON_ENDIAN=0 -DHAVE_MESON_DOCS_H -MD -MQ muon.p/src/external/tinyjson.c.o -MF muon.p/src/external/tinyjson.c.o.d -o muon.p/src/external/tinyjson.c.o -c ../src/external/tinyjson.c
[118/133] /build/reproducible-path/muon-meson-0.4.0/build/muon-bootstrap internal exe -R subprojects/bestline/libbestline.a -- i686-linux-gnu-ar csrD subprojects/bestline/libbestline.a subprojects/bestline/libbestline.a.p/bestline.c.o
[119/133] i686-linux-gnu-gcc -g -O0 -Wpedantic -Wextra -Wall -fdiagnostics-color=always -g -O2 -Werror=implicit-function-declaration -Werror=array-bounds -Werror=clobbered -Werror=volatile-register-var -ffile-prefix-map=/build/reproducible-path/muon-meson-0.4.0=. -fstack-protector-strong -Wformat -Werror=format-security -DBOOTSTRAP_NO_SAMU -Wdate-time -D_FORTIFY_SOURCE=2 -Wendif-labels -Wimplicit-fallthrough=2 -Winit-self -Wlogical-op -Wmissing-include-dirs -Wno-missing-braces -Wno-missing-field-initializers -Wno-unused-parameter -Wold-style-definition -Woverflow -Wstrict-aliasing=2 -Wstrict-prototypes -Wundef -Wvla -fstrict-aliasing -std=c99 -DMUON_BOOTSTRAPPED -I . -I .. -I ../include -I /usr/include/i386-linux-gnu -I /usr/include/p11-kit-1 -I /usr/include/pkgconf -I subprojects/tinyjson -I ../subprojects/tinyjson -I subprojects/bestline -I ../subprojects/bestline -I src/script -I subprojects/meson-docs -DMUON_PLATFORM_posix -DMUON_ENDIAN=0 -DHAVE_MESON_DOCS_H -MD -MQ muon.p/src/external/samurai_null.c.o -MF muon.p/src/external/samurai_null.c.o.d -o muon.p/src/external/samurai_null.c.o -c ../src/external/samurai_null.c
[120/133] i686-linux-gnu-gcc -g -O0 -Wpedantic -Wextra -Wall -fdiagnostics-color=always -g -O2 -Werror=implicit-function-declaration -Werror=array-bounds -Werror=clobbered -Werror=volatile-register-var -ffile-prefix-map=/build/reproducible-path/muon-meson-0.4.0=. -fstack-protector-strong -Wformat -Werror=format-security -DBOOTSTRAP_NO_SAMU -Wdate-time -D_FORTIFY_SOURCE=2 -Wendif-labels -Wimplicit-fallthrough=2 -Winit-self -Wlogical-op -Wmissing-include-dirs -Wno-missing-braces -Wno-missing-field-initializers -Wno-unused-parameter -Wold-style-definition -Woverflow -Wstrict-aliasing=2 -Wstrict-prototypes -Wundef -Wvla -fstrict-aliasing -std=c99 -DMUON_BOOTSTRAPPED -I . -I .. -I ../include -I /usr/include/i386-linux-gnu -I /usr/include/p11-kit-1 -I /usr/include/pkgconf -I subprojects/tinyjson -I ../subprojects/tinyjson -I subprojects/bestline -I ../subprojects/bestline -I src/script -I subprojects/meson-docs -DMUON_PLATFORM_posix -DMUON_ENDIAN=0 -DHAVE_MESON_DOCS_H -MD -MQ muon.p/src/meson_opts.c.o -MF muon.p/src/meson_opts.c.o.d -o muon.p/src/meson_opts.c.o -c ../src/meson_opts.c
[121/133] i686-linux-gnu-gcc -g -O0 -Wpedantic -Wextra -Wall -fdiagnostics-color=always -g -O2 -Werror=implicit-function-declaration -Werror=array-bounds -Werror=clobbered -Werror=volatile-register-var -ffile-prefix-map=/build/reproducible-path/muon-meson-0.4.0=. -fstack-protector-strong -Wformat -Werror=format-security -DBOOTSTRAP_NO_SAMU -Wdate-time -D_FORTIFY_SOURCE=2 -Wendif-labels -Wimplicit-fallthrough=2 -Winit-self -Wlogical-op -Wmissing-include-dirs -Wno-missing-braces -Wno-missing-field-initializers -Wno-unused-parameter -Wold-style-definition -Woverflow -Wstrict-aliasing=2 -Wstrict-prototypes -Wundef -Wvla -fstrict-aliasing -std=c99 -DMUON_BOOTSTRAPPED -I . -I .. -I ../include -I /usr/include/i386-linux-gnu -I /usr/include/p11-kit-1 -I /usr/include/pkgconf -I subprojects/tinyjson -I ../subprojects/tinyjson -I subprojects/bestline -I ../subprojects/bestline -I src/script -I subprojects/meson-docs -DMUON_PLATFORM_posix -DMUON_ENDIAN=0 -DHAVE_MESON_DOCS_H -MD -MQ muon.p/src/external/libcurl.c.o -MF muon.p/src/external/libcurl.c.o.d -o muon.p/src/external/libcurl.c.o -c ../src/external/libcurl.c
[122/133] i686-linux-gnu-gcc -g -O0 -Wpedantic -Wextra -Wall -fdiagnostics-color=always -g -O2 -Werror=implicit-function-declaration -Werror=array-bounds -Werror=clobbered -Werror=volatile-register-var -ffile-prefix-map=/build/reproducible-path/muon-meson-0.4.0=. -fstack-protector-strong -Wformat -Werror=format-security -DBOOTSTRAP_NO_SAMU -Wdate-time -D_FORTIFY_SOURCE=2 -Wendif-labels -Wimplicit-fallthrough=2 -Winit-self -Wlogical-op -Wmissing-include-dirs -Wno-missing-braces -Wno-missing-field-initializers -Wno-unused-parameter -Wold-style-definition -Woverflow -Wstrict-aliasing=2 -Wstrict-prototypes -Wundef -Wvla -fstrict-aliasing -std=c99 -DMUON_BOOTSTRAPPED -I . -I .. -I ../include -I /usr/include/i386-linux-gnu -I /usr/include/p11-kit-1 -I /usr/include/pkgconf -I subprojects/tinyjson -I ../subprojects/tinyjson -I subprojects/bestline -I ../subprojects/bestline -I src/script -I subprojects/meson-docs -DMUON_PLATFORM_posix -DMUON_ENDIAN=0 -DHAVE_MESON_DOCS_H -MD -MQ muon.p/src/external/readline_bestline.c.o -MF muon.p/src/external/readline_bestline.c.o.d -o muon.p/src/external/readline_bestline.c.o -c ../src/external/readline_bestline.c
[123/133] i686-linux-gnu-gcc -g -O0 -Wpedantic -Wextra -Wall -fdiagnostics-color=always -g -O2 -Werror=implicit-function-declaration -Werror=array-bounds -Werror=clobbered -Werror=volatile-register-var -ffile-prefix-map=/build/reproducible-path/muon-meson-0.4.0=. -fstack-protector-strong -Wformat -Werror=format-security -DBOOTSTRAP_NO_SAMU -Wdate-time -D_FORTIFY_SOURCE=2 -Wendif-labels -Wimplicit-fallthrough=2 -Winit-self -Wlogical-op -Wmissing-include-dirs -Wno-missing-braces -Wno-missing-field-initializers -Wno-unused-parameter -Wold-style-definition -Woverflow -Wstrict-aliasing=2 -Wstrict-prototypes -Wundef -Wvla -fstrict-aliasing -std=c99 -DMUON_BOOTSTRAPPED -I . -I .. -I ../include -I /usr/include/i386-linux-gnu -I /usr/include/p11-kit-1 -I /usr/include/pkgconf -I subprojects/tinyjson -I ../subprojects/tinyjson -I subprojects/bestline -I ../subprojects/bestline -I src/script -I subprojects/meson-docs -DMUON_PLATFORM_posix -DMUON_ENDIAN=0 -DHAVE_MESON_DOCS_H -MD -MQ muon.p/src/ui_null.c.o -MF muon.p/src/ui_null.c.o.d -o muon.p/src/ui_null.c.o -c ../src/ui_null.c
[124/133] i686-linux-gnu-gcc -g -O0 -Wpedantic -Wextra -Wall -fdiagnostics-color=always -g -O2 -Werror=implicit-function-declaration -Werror=array-bounds -Werror=clobbered -Werror=volatile-register-var -ffile-prefix-map=/build/reproducible-path/muon-meson-0.4.0=. -fstack-protector-strong -Wformat -Werror=format-security -DBOOTSTRAP_NO_SAMU -Wdate-time -D_FORTIFY_SOURCE=2 -Wendif-labels -Wimplicit-fallthrough=2 -Winit-self -Wlogical-op -Wmissing-include-dirs -Wno-missing-braces -Wno-missing-field-initializers -Wno-unused-parameter -Wold-style-definition -Woverflow -Wstrict-aliasing=2 -Wstrict-prototypes -Wundef -Wvla -fstrict-aliasing -std=c99 -DMUON_BOOTSTRAPPED -I . -I .. -I ../include -I /usr/include/i386-linux-gnu -I /usr/include/p11-kit-1 -I /usr/include/pkgconf -I subprojects/tinyjson -I ../subprojects/tinyjson -I subprojects/bestline -I ../subprojects/bestline -I src/script -I subprojects/meson-docs -DMUON_PLATFORM_posix -DMUON_ENDIAN=0 -DHAVE_MESON_DOCS_H -MD -MQ muon.p/src/platform/posix/rpath_fixer.c.o -MF muon.p/src/platform/posix/rpath_fixer.c.o.d -o muon.p/src/platform/posix/rpath_fixer.c.o -c ../src/platform/posix/rpath_fixer.c
[125/133] i686-linux-gnu-gcc -g -O0 -Wpedantic -Wextra -Wall -fdiagnostics-color=always -g -O2 -Werror=implicit-function-declaration -Werror=array-bounds -Werror=clobbered -Werror=volatile-register-var -ffile-prefix-map=/build/reproducible-path/muon-meson-0.4.0=. -fstack-protector-strong -Wformat -Werror=format-security -DBOOTSTRAP_NO_SAMU -Wdate-time -D_FORTIFY_SOURCE=2 -Wendif-labels -Wimplicit-fallthrough=2 -Winit-self -Wlogical-op -Wmissing-include-dirs -Wno-missing-braces -Wno-missing-field-initializers -Wno-unused-parameter -Wold-style-definition -Woverflow -Wstrict-aliasing=2 -Wstrict-prototypes -Wundef -Wvla -fstrict-aliasing -std=c99 -DMUON_BOOTSTRAPPED -I . -I .. -I ../include -I /usr/include/i386-linux-gnu -I /usr/include/p11-kit-1 -I /usr/include/pkgconf -I subprojects/tinyjson -I ../subprojects/tinyjson -I subprojects/bestline -I ../subprojects/bestline -I src/script -I subprojects/meson-docs -DMUON_PLATFORM_posix -DMUON_ENDIAN=0 -DHAVE_MESON_DOCS_H -MD -MQ muon.p/src/platform/posix/run_cmd.c.o -MF muon.p/src/platform/posix/run_cmd.c.o.d -o muon.p/src/platform/posix/run_cmd.c.o -c ../src/platform/posix/run_cmd.c
[126/133] i686-linux-gnu-gcc -g -O0 -Wpedantic -Wextra -Wall -fdiagnostics-color=always -g -O2 -Werror=implicit-function-declaration -Werror=array-bounds -Werror=clobbered -Werror=volatile-register-var -ffile-prefix-map=/build/reproducible-path/muon-meson-0.4.0=. -fstack-protector-strong -Wformat -Werror=format-security -DBOOTSTRAP_NO_SAMU -Wdate-time -D_FORTIFY_SOURCE=2 -Wendif-labels -Wimplicit-fallthrough=2 -Winit-self -Wlogical-op -Wmissing-include-dirs -Wno-missing-braces -Wno-missing-field-initializers -Wno-unused-parameter -Wold-style-definition -Woverflow -Wstrict-aliasing=2 -Wstrict-prototypes -Wundef -Wvla -fstrict-aliasing -std=c99 -DMUON_BOOTSTRAPPED -I . -I .. -I ../include -I /usr/include/i386-linux-gnu -I /usr/include/p11-kit-1 -I /usr/include/pkgconf -I subprojects/tinyjson -I ../subprojects/tinyjson -I subprojects/bestline -I ../subprojects/bestline -I src/script -I subprojects/meson-docs -DMUON_PLATFORM_posix -DMUON_ENDIAN=0 -DHAVE_MESON_DOCS_H -MD -MQ muon.p/src/main.c.o -MF muon.p/src/main.c.o.d -o muon.p/src/main.c.o -c ../src/main.c
[127/133] i686-linux-gnu-gcc -g -O0 -Wpedantic -Wextra -Wall -fdiagnostics-color=always -g -O2 -Werror=implicit-function-declaration -Werror=array-bounds -Werror=clobbered -Werror=volatile-register-var -ffile-prefix-map=/build/reproducible-path/muon-meson-0.4.0=. -fstack-protector-strong -Wformat -Werror=format-security -DBOOTSTRAP_NO_SAMU -Wdate-time -D_FORTIFY_SOURCE=2 -Wendif-labels -Wimplicit-fallthrough=2 -Winit-self -Wlogical-op -Wmissing-include-dirs -Wno-missing-braces -Wno-missing-field-initializers -Wno-unused-parameter -Wold-style-definition -Woverflow -Wstrict-aliasing=2 -Wstrict-prototypes -Wundef -Wvla -fstrict-aliasing -std=c99 -DMUON_BOOTSTRAPPED -I . -I .. -I ../include -I /usr/include/i386-linux-gnu -I /usr/include/p11-kit-1 -I /usr/include/pkgconf -I subprojects/tinyjson -I ../subprojects/tinyjson -I subprojects/bestline -I ../subprojects/bestline -I src/script -I subprojects/meson-docs -DMUON_PLATFORM_posix -DMUON_ENDIAN=0 -DHAVE_MESON_DOCS_H -MD -MQ muon.p/src/options.c.o -MF muon.p/src/options.c.o.d -o muon.p/src/options.c.o -c ../src/options.c
[128/133] i686-linux-gnu-gcc -g -O0 -Wpedantic -Wextra -Wall -fdiagnostics-color=always -g -O2 -Werror=implicit-function-declaration -Werror=array-bounds -Werror=clobbered -Werror=volatile-register-var -ffile-prefix-map=/build/reproducible-path/muon-meson-0.4.0=. -fstack-protector-strong -Wformat -Werror=format-security -DBOOTSTRAP_NO_SAMU -Wdate-time -D_FORTIFY_SOURCE=2 -Wendif-labels -Wimplicit-fallthrough=2 -Winit-self -Wlogical-op -Wmissing-include-dirs -Wno-missing-braces -Wno-missing-field-initializers -Wno-unused-parameter -Wold-style-definition -Woverflow -Wstrict-aliasing=2 -Wstrict-prototypes -Wundef -Wvla -fstrict-aliasing -std=c99 -DMUON_BOOTSTRAPPED -I . -I .. -I ../include -I /usr/include/i386-linux-gnu -I /usr/include/p11-kit-1 -I /usr/include/pkgconf -I subprojects/tinyjson -I ../subprojects/tinyjson -I subprojects/bestline -I ../subprojects/bestline -I src/script -I subprojects/meson-docs -DMUON_PLATFORM_posix -DMUON_ENDIAN=0 -DHAVE_MESON_DOCS_H -MD -MQ muon.p/src/external/libpkgconf.c.o -MF muon.p/src/external/libpkgconf.c.o.d -o muon.p/src/external/libpkgconf.c.o -c ../src/external/libpkgconf.c
[129/133] i686-linux-gnu-gcc -g -O0 -Wpedantic -Wextra -Wall -fdiagnostics-color=always -g -O2 -Werror=implicit-function-declaration -Werror=array-bounds -Werror=clobbered -Werror=volatile-register-var -ffile-prefix-map=/build/reproducible-path/muon-meson-0.4.0=. -fstack-protector-strong -Wformat -Werror=format-security -DBOOTSTRAP_NO_SAMU -Wdate-time -D_FORTIFY_SOURCE=2 -Wendif-labels -Wimplicit-fallthrough=2 -Winit-self -Wlogical-op -Wmissing-include-dirs -Wno-missing-braces -Wno-missing-field-initializers -Wno-unused-parameter -Wold-style-definition -Woverflow -Wstrict-aliasing=2 -Wstrict-prototypes -Wundef -Wvla -fstrict-aliasing -std=c99 -DMUON_BOOTSTRAPPED -I . -I .. -I ../include -I /usr/include/i386-linux-gnu -I /usr/include/p11-kit-1 -I /usr/include/pkgconf -I subprojects/tinyjson -I ../subprojects/tinyjson -I subprojects/bestline -I ../subprojects/bestline -I src/script -I subprojects/meson-docs -DMUON_PLATFORM_posix -DMUON_ENDIAN=0 -DHAVE_MESON_DOCS_H -MD -MQ muon.p/src/lang/object.c.o -MF muon.p/src/lang/object.c.o.d -o muon.p/src/lang/object.c.o -c ../src/lang/object.c
[130/133] i686-linux-gnu-gcc -g -O0 -Wpedantic -Wextra -Wall -fdiagnostics-color=always -g -O2 -Werror=implicit-function-declaration -Werror=array-bounds -Werror=clobbered -Werror=volatile-register-var -ffile-prefix-map=/build/reproducible-path/muon-meson-0.4.0=. -fstack-protector-strong -Wformat -Werror=format-security -DBOOTSTRAP_NO_SAMU -Wdate-time -D_FORTIFY_SOURCE=2 -Wendif-labels -Wimplicit-fallthrough=2 -Winit-self -Wlogical-op -Wmissing-include-dirs -Wno-missing-braces -Wno-missing-field-initializers -Wno-unused-parameter -Wold-style-definition -Woverflow -Wstrict-aliasing=2 -Wstrict-prototypes -Wundef -Wvla -fstrict-aliasing -std=c99 -DMUON_BOOTSTRAPPED -I . -I .. -I ../include -I /usr/include/i386-linux-gnu -I /usr/include/p11-kit-1 -I /usr/include/pkgconf -I subprojects/tinyjson -I ../subprojects/tinyjson -I subprojects/bestline -I ../subprojects/bestline -I src/script -I subprojects/meson-docs -DMUON_PLATFORM_posix -DMUON_ENDIAN=0 -DHAVE_MESON_DOCS_H -MD -MQ muon.p/src/lang/parser.c.o -MF muon.p/src/lang/parser.c.o.d -o muon.p/src/lang/parser.c.o -c ../src/lang/parser.c
[131/133] i686-linux-gnu-gcc -g -O0 -Wpedantic -Wextra -Wall -fdiagnostics-color=always -g -O2 -Werror=implicit-function-declaration -Werror=array-bounds -Werror=clobbered -Werror=volatile-register-var -ffile-prefix-map=/build/reproducible-path/muon-meson-0.4.0=. -fstack-protector-strong -Wformat -Werror=format-security -DBOOTSTRAP_NO_SAMU -Wdate-time -D_FORTIFY_SOURCE=2 -Wendif-labels -Wimplicit-fallthrough=2 -Winit-self -Wlogical-op -Wmissing-include-dirs -Wno-missing-braces -Wno-missing-field-initializers -Wno-unused-parameter -Wold-style-definition -Woverflow -Wstrict-aliasing=2 -Wstrict-prototypes -Wundef -Wvla -fstrict-aliasing -std=c99 -DMUON_BOOTSTRAPPED -I . -I .. -I ../include -I /usr/include/i386-linux-gnu -I /usr/include/p11-kit-1 -I /usr/include/pkgconf -I subprojects/tinyjson -I ../subprojects/tinyjson -I subprojects/bestline -I ../subprojects/bestline -I src/script -I subprojects/meson-docs -DMUON_PLATFORM_posix -DMUON_ENDIAN=0 -DHAVE_MESON_DOCS_H -MD -MQ muon.p/src/lang/vm.c.o -MF muon.p/src/lang/vm.c.o.d -o muon.p/src/lang/vm.c.o -c ../src/lang/vm.c
[132/133] i686-linux-gnu-gcc -g -O0 -Wpedantic -Wextra -Wall -fdiagnostics-color=always -g -O2 -Werror=implicit-function-declaration -Werror=array-bounds -Werror=clobbered -Werror=volatile-register-var -ffile-prefix-map=/build/reproducible-path/muon-meson-0.4.0=. -fstack-protector-strong -Wformat -Werror=format-security -DBOOTSTRAP_NO_SAMU -Wdate-time -D_FORTIFY_SOURCE=2 -Wendif-labels -Wimplicit-fallthrough=2 -Winit-self -Wlogical-op -Wmissing-include-dirs -Wno-missing-braces -Wno-missing-field-initializers -Wno-unused-parameter -Wold-style-definition -Woverflow -Wstrict-aliasing=2 -Wstrict-prototypes -Wundef -Wvla -fstrict-aliasing -std=c99 -DMUON_BOOTSTRAPPED -I . -I .. -I ../include -I /usr/include/i386-linux-gnu -I /usr/include/p11-kit-1 -I /usr/include/pkgconf -I subprojects/tinyjson -I ../subprojects/tinyjson -I subprojects/bestline -I ../subprojects/bestline -I src/script -I subprojects/meson-docs -DMUON_PLATFORM_posix -DMUON_ENDIAN=0 -DHAVE_MESON_DOCS_H -MD -MQ muon.p/src/compilers.c.o -MF muon.p/src/compilers.c.o.d -o muon.p/src/compilers.c.o -c ../src/compilers.c
[133/133] i686-linux-gnu-gcc  -o muon muon.p/src/backend/backend.c.o muon.p/src/backend/common_args.c.o muon.p/src/backend/introspect.c.o muon.p/src/backend/ninja.c.o muon.p/src/backend/ninja/alias_target.c.o muon.p/src/backend/ninja/build_target.c.o muon.p/src/backend/ninja/coverage.c.o muon.p/src/backend/ninja/custom_target.c.o muon.p/src/backend/ninja/rules.c.o muon.p/src/backend/output.c.o muon.p/src/backend/xcode.c.o muon.p/src/datastructures/arr.c.o muon.p/src/datastructures/bucket_arr.c.o muon.p/src/datastructures/hash.c.o muon.p/src/datastructures/stack.c.o muon.p/src/formats/editorconfig.c.o muon.p/src/formats/ini.c.o muon.p/src/formats/lines.c.o muon.p/src/formats/tap.c.o muon.p/src/formats/xml.c.o muon.p/src/functions/array.c.o muon.p/src/functions/boolean.c.o muon.p/src/functions/both_libs.c.o muon.p/src/functions/build_target.c.o muon.p/src/functions/compiler.c.o muon.p/src/functions/configuration_data.c.o muon.p/src/functions/custom_target.c.o muon.p/src/functions/dependency.c.o muon.p/src/functions/dict.c.o muon.p/src/functions/disabler.c.o muon.p/src/functions/environment.c.o muon.p/src/functions/external_program.c.o muon.p/src/functions/feature_opt.c.o muon.p/src/functions/file.c.o muon.p/src/functions/generator.c.o muon.p/src/functions/kernel.c.o muon.p/src/functions/kernel/build_target.c.o muon.p/src/functions/kernel/configure_file.c.o muon.p/src/functions/kernel/custom_target.c.o muon.p/src/functions/kernel/dependency.c.o muon.p/src/functions/kernel/install.c.o muon.p/src/functions/kernel/options.c.o muon.p/src/functions/kernel/subproject.c.o muon.p/src/functions/machine.c.o muon.p/src/functions/meson.c.o muon.p/src/functions/modules.c.o muon.p/src/functions/modules/fs.c.o muon.p/src/functions/modules/getopt.c.o muon.p/src/functions/modules/keyval.c.o muon.p/src/functions/modules/pkgconfig.c.o muon.p/src/functions/modules/python.c.o muon.p/src/functions/modules/sourceset.c.o muon.p/src/functions/modules/subprojects.c.o muon.p/src/functions/modules/toolchain.c.o muon.p/src/functions/number.c.o muon.p/src/functions/run_result.c.o muon.p/src/functions/source_configuration.c.o muon.p/src/functions/source_set.c.o muon.p/src/functions/string.c.o muon.p/src/functions/subproject.c.o muon.p/src/lang/analyze.c.o muon.p/src/lang/compiler.c.o muon.p/src/lang/eval.c.o muon.p/src/lang/fmt.c.o muon.p/src/lang/func_lookup.c.o muon.p/src/lang/lexer.c.o muon.p/src/lang/object.c.o muon.p/src/lang/object_iterators.c.o muon.p/src/lang/parser.c.o muon.p/src/lang/serial.c.o muon.p/src/lang/string.c.o muon.p/src/lang/typecheck.c.o muon.p/src/lang/vm.c.o muon.p/src/lang/workspace.c.o muon.p/src/args.c.o muon.p/src/cmd_install.c.o muon.p/src/cmd_subprojects.c.o muon.p/src/cmd_test.c.o muon.p/src/coerce.c.o muon.p/src/compilers.c.o muon.p/src/embedded.c.o muon.p/src/error.c.o muon.p/src/guess.c.o muon.p/src/install.c.o muon.p/src/log.c.o muon.p/src/machine_file.c.o muon.p/src/machines.c.o muon.p/src/main.c.o muon.p/src/memmem.c.o muon.p/src/meson_opts.c.o muon.p/src/options.c.o muon.p/src/opts.c.o muon.p/src/rpmvercmp.c.o muon.p/src/sha_256.c.o muon.p/src/vsenv.c.o muon.p/src/wrap.c.o muon.p/src/platform/assert.c.o muon.p/src/platform/filesystem.c.o muon.p/src/platform/mem.c.o muon.p/src/platform/os.c.o muon.p/src/platform/path.c.o muon.p/src/platform/run_cmd.c.o muon.p/src/platform/uname.c.o muon.p/src/platform/posix/filesystem.c.o muon.p/src/platform/posix/init.c.o muon.p/src/platform/posix/log.c.o muon.p/src/platform/posix/os.c.o muon.p/src/platform/posix/path.c.o muon.p/src/platform/posix/run_cmd.c.o muon.p/src/platform/posix/term.c.o muon.p/src/platform/posix/timer.c.o muon.p/src/platform/posix/uname.c.o muon.p/src/platform/posix/rpath_fixer.c.o muon.p/src/version.c.o muon.p/src/external/libcurl.c.o muon.p/src/external/libarchive.c.o muon.p/src/external/libpkgconf.c.o muon.p/src/external/tinyjson.c.o muon.p/src/external/samurai_null.c.o muon.p/src/external/readline_bestline.c.o muon.p/src/ui_null.c.o -Wl,--as-needed -Wl,--no-undefined -g -O2 -Werror=implicit-function-declaration -Werror=array-bounds -Werror=clobbered -Werror=volatile-register-var -ffile-prefix-map=/build/reproducible-path/muon-meson-0.4.0=. -fstack-protector-strong -Wformat -Werror=format-security -DBOOTSTRAP_NO_SAMU -Wl,-z,relro -Wl,-z,now -Wl,--start-group /usr/lib/i386-linux-gnu/libcurl.so /usr/lib/i386-linux-gnu/libarchive.so /usr/lib/i386-linux-gnu/libpkgconf.so subprojects/tinyjson/libtiny-json.a subprojects/bestline/libbestline.a -Wl,--end-group
make[1]: Leaving directory '/build/reproducible-path/muon-meson-0.4.0'
   debian/rules override_dh_auto_test
make[1]: Entering directory '/build/reproducible-path/muon-meson-0.4.0'
mkdir build/home
HOME=$(realpath build/home) build/muon -C build test -v
ninja: no work to do.
ninja: no work to do.
running tests for project 'muon'
ok      0.04s fmt:editorconfig basic
ok      0.04s fmt:editorconfig no-match
ok      0.04s fmt:editorconfig esc[pe
ok      0.03s fmt:editorconfig root/sub
ok      0.03s fmt:case/space_array
ok      0.03s fmt:case/kwargs_force_multiline
ok      0.03s fmt:case/wide_colon
ok      0.03s fmt:case/no_single_comma_function
ok      0.03s fmt:case/indent_before_comments
ok      0.05s fmt:case/group_arg_value
ok      0.06s fmt:case/insert_final_newline_false
ok      0.06s fmt:case/sort_files
ok      0.06s fmt:case/simplify_string_literals
ok      0.04s fmt:case/sticky_parens
ok      0.04s fmt:case/continuation_indent
ok      0.04s lang:array.meson
ok      0.07s fmt:case/insert_final_newline_true
ok      0.06s fmt:case/end_of_line_lf_to_crlf
ok      0.06s fmt:case/end_of_line_crlf_to_lf
ok      0.06s fmt:case/end_of_line_auto_lf
fail*   0.05s lang:badnum.meson
ok      0.05s lang:configuration_data.meson
ok      0.03s lang:disabler.meson
ok      0.04s lang:dict.meson
ok      0.03s lang:fstring.meson
ok      0.03s lang:func.meson
ok      0.03s lang:join.meson
ok      0.03s lang:join_paths.meson
ok      0.03s lang:katie.meson
ok      0.03s lang:line_continuation.meson
ok      0.03s lang:multiline.meson
ok      0.09s fmt:case/end_of_line_auto_crlf
ok      0.03s lang:object_stack_page_size.meson
ok      0.03s lang:range.meson
ok      0.06s lang:environment.meson
ok      0.03s lang:string_format_escape.meson
ok      0.03s lang:ternary.meson
ok      0.03s lang:unicode.meson
ok      0.05s lang:return_during_iteration.meson
ok      0.05s lang:run_command.meson
ok      0.04s lang:strings.meson
ok      0.05s lang:version_compare.meson
ok      0.19s fmt:test_all_meson_files
ok      0.22s project+muon:muon/str
ok      0.31s project+muon:muon/sizeof_invalid
ok      0.26s project+meson-tests:meson-tests/common/9 header install
ok      0.36s project+muon:muon/script_module
ok      0.38s project+unit+requires_python:unit/65 alias target
ok      0.45s project+meson-tests:meson-tests/common/3 static
ok      0.46s project+meson-tests+requires_python:meson-tests/common/8 install
ok      0.49s project+meson-tests:meson-tests/common/1 trivial
ok      0.49s project+meson-tests:meson-tests/common/4 shared
ok      0.30s project+meson-tests:meson-tests/common/10 man install
ok      0.56s project+meson-tests:meson-tests/common/5 linkstatic
ok      0.26s project+meson-tests:meson-tests/common/12 data
ok      0.57s project+meson-tests:meson-tests/common/6 linkshared
ok      0.57s project+meson-tests:meson-tests/common/7 mixed
ok      0.52s project+meson-tests:meson-tests/common/11 subdir
ok      1.05s project+muon+requires_python:muon/python
ok      0.66s project+meson-tests:meson-tests/common/19 header in file list
ok      0.75s project+meson-tests:meson-tests/common/15 if
ok      0.75s project+meson-tests:meson-tests/common/17 array
ok      0.80s project+meson-tests:meson-tests/common/18 includedir
ok      0.55s project+meson-tests:meson-tests/common/24 library versions
ok      0.81s project+meson-tests:meson-tests/common/20 global arg
ok      0.92s project+meson-tests:meson-tests/common/16 comparison
ok      0.85s project+meson-tests:meson-tests/common/23 endian
ok      0.87s project+meson-tests:meson-tests/common/21 target arg
ok      0.89s project+meson-tests+requires_python:meson-tests/common/22 object extraction
ok      0.34s project+meson-tests:meson-tests/common/27 multiline string
ok      0.54s project+meson-tests:meson-tests/common/25 config subdir
ok      0.28s project+meson-tests:meson-tests/common/29 compiler id
ok      0.21s project+meson-tests:meson-tests/common/35 string operations
ok      0.25s project+meson-tests:meson-tests/common/34 logic ops
ok      0.45s project+meson-tests:meson-tests/common/31 define10
ok      0.46s project+meson-tests+requires_python:meson-tests/common/33 run program
ok      0.72s project+meson-tests+requires_python:meson-tests/common/26 find program
ok      0.24s project+meson-tests:meson-tests/common/40 options
ok      1.95s project+meson-tests:meson-tests/common/2 cpp
fail*   2.09s project+muon:muon/timeout
ok      0.23s project+meson-tests:meson-tests/common/43 subproject options
ok      0.72s project+meson-tests:meson-tests/common/39 library chain
ok      0.92s project+meson-tests:meson-tests/common/37 has member
ok      1.11s project+meson-tests:meson-tests/common/32 has header
ok      0.75s project+meson-tests+requires_python:meson-tests/common/41 test args
ok      0.65s project+meson-tests:meson-tests/common/45 custom install dirs
ok      0.72s project+meson-tests:meson-tests/common/42 subproject
ok      0.64s project+meson-tests:meson-tests/common/47 same file name
ok      0.30s project+meson-tests+requires_python:meson-tests/common/49 custom target
ok      0.90s project+meson-tests+requires_python:meson-tests/common/44 pkgconfig-gen
ok      0.78s project+meson-tests:meson-tests/common/46 subproject subproject
ok      2.49s project+meson-tests+requires_python:meson-tests/common/14 configure file
ok      1.61s project+meson-tests:meson-tests/common/30 sizeof
ok      0.55s project+meson-tests+requires_python:meson-tests/common/50 custom target chain
ok      0.70s project+meson-tests:meson-tests/common/48 file grabber
ok      0.30s project+meson-tests:meson-tests/common/56 array methods
ok      0.25s project+meson-tests:meson-tests/common/59 install subdir
ok      0.67s project+meson-tests+requires_python:meson-tests/common/52 object generator
ok      1.76s project+meson-tests:meson-tests/common/38 alignment
ok      0.26s project+meson-tests:meson-tests/common/61 number arithmetic
ok      0.25s project+meson-tests:meson-tests/common/62 string arithmetic
ok      0.61s project+meson-tests+requires_python:meson-tests/common/54 custom target source output
ok      0.61s project+meson-tests:meson-tests/common/55 exe static shared
ok      0.21s project+meson-tests:meson-tests/common/63 array arithmetic
ok      0.43s project+meson-tests:meson-tests/common/60 foreach
ok      0.64s project+meson-tests+requires_python:meson-tests/common/57 custom header generator
ok      0.23s project+meson-tests:meson-tests/common/64 arithmetic bidmas
ok      0.65s project+meson-tests+requires_python:meson-tests/common/58 multiple generators
ok      0.20s project+meson-tests:meson-tests/common/67 modules
ok      0.21s project+meson-tests+requires_python:meson-tests/common/69 configure file in custom target
ok      3.32s project+meson-tests+requires_python:meson-tests/common/13 pch
ok      0.28s project+meson-tests+requires_python:meson-tests/common/71 ctarget dependency
ok      0.33s project+meson-tests+requires_python:meson-tests/common/70 external test program
ok      0.53s project+meson-tests:meson-tests/common/68 should fail
ok      2.67s project+meson-tests:meson-tests/common/28 try compile
ok      0.61s project+meson-tests+requires_python:meson-tests/common/65 build always
ok      1.44s project+meson-tests+requires_python:meson-tests/common/53 install script
ok      1.51s project+meson-tests+requires_python:meson-tests/common/51 run target
ok      0.51s project+meson-tests:meson-tests/common/77 extract from nested subdir
ok      0.70s project+meson-tests:meson-tests/common/72 shared subproject
ok      0.70s project+meson-tests:meson-tests/common/73 shared subproject 2
ok      0.72s project+meson-tests:meson-tests/common/74 file object
ok      0.90s project+meson-tests+requires_python:meson-tests/common/66 vcstag
ok      0.67s project+meson-tests:meson-tests/common/76 has type
ok      0.80s project+meson-tests:meson-tests/common/75 custom subproject dir
ok      0.32s project+meson-tests:meson-tests/common/84 plusassign
ok      0.25s project+meson-tests:meson-tests/common/85 skip subdir
ok      0.68s project+meson-tests:meson-tests/common/79 same basename
ok      0.70s project+meson-tests:meson-tests/common/78 internal dependency
ok      0.44s project+meson-tests+requires_python:meson-tests/common/83 identical target name in subproject
ok      0.34s project+meson-tests:meson-tests/common/87 default options
ok      0.67s project+meson-tests:meson-tests/common/81 extract all
ok      0.70s project+meson-tests:meson-tests/common/80 declare dep
ok      0.73s project+meson-tests+requires_python:meson-tests/common/86 private include
ok      0.72s project+meson-tests+requires_python:meson-tests/common/88 dep fallback
ok      0.59s project+meson-tests:meson-tests/common/91 benchmark
ok      0.55s project+meson-tests:meson-tests/common/96 stringdef
ok      0.79s project+meson-tests+requires_python:meson-tests/common/90 gen extra
ok      0.69s project+meson-tests:meson-tests/common/93 suites
ok      0.55s project+meson-tests+requires_python:meson-tests/common/99 postconf
ok      0.76s project+meson-tests+requires_python:meson-tests/common/92 test workdir
ok      0.60s project+meson-tests:meson-tests/common/98 subproject subdir
ok      0.25s project+meson-tests:meson-tests/common/101 testframework options
ok      0.84s project+meson-tests+requires_python:meson-tests/common/95 manygen
ok      0.79s project+meson-tests+requires_python:meson-tests/common/97 find program path
ok      0.24s project+meson-tests:meson-tests/common/108 ternary
ok      0.30s project+meson-tests+requires_python:meson-tests/common/106 multiple dir configure file
ok      0.50s project+meson-tests:meson-tests/common/102 extract same name
ok      0.57s project+meson-tests+requires_python:meson-tests/common/100 postconf with args
ok      0.34s project+meson-tests+requires_python:meson-tests/common/109 custom target capture
skip    0.15s project+meson-tests:meson-tests/common/114 skip
ok      0.31s project+meson-tests:meson-tests/common/111 pathjoin
ok      0.56s project+meson-tests:meson-tests/common/107 spaces backslash
ok      1.28s project+meson-tests:meson-tests/common/94 threads
ok      0.27s project+meson-tests:meson-tests/common/113 interpreter copy mutable var on assignment
ok      1.85s project+meson-tests:meson-tests/common/82 add language
ok      1.61s project+meson-tests:meson-tests/common/89 default library
ok      0.84s project+meson-tests:meson-tests/common/104 has arg
ok      0.82s project+meson-tests+requires_python:meson-tests/common/105 generatorcustom
ok      0.53s project+meson-tests:meson-tests/common/112 subdir subproject
ok      0.67s project+meson-tests+requires_python:meson-tests/common/110 allgenerate
ok      0.44s project+meson-tests:meson-tests/common/116 test skip
ok      0.61s project+meson-tests:meson-tests/common/115 subproject project arguments
fail    0.45s project+meson-tests:meson-tests/common/118 llvm ir and assembly
skip    0.15s project+meson-tests+requires_python:meson-tests/common/126 generated llvm ir
ok      0.54s project+meson-tests:meson-tests/common/117 shared module
ok      0.32s project+meson-tests+requires_python:meson-tests/common/123 custom target directory install
ok      0.49s project+meson-tests:meson-tests/common/122 no buildincdir
ok      0.58s project+meson-tests:meson-tests/common/120 extract all shared library
ok      0.41s project+meson-tests:meson-tests/common/124 dependency file generation
fail    0.42s project+meson-tests+requires_python:meson-tests/common/127 generated assembly
ok      0.53s project+meson-tests+requires_python:meson-tests/common/128 build by default targets in tests
ok      0.61s project+meson-tests+requires_python:meson-tests/common/125 configure file in generator
ok      0.47s project+meson-tests+requires_python:meson-tests/common/129 build by default
ok      0.26s project+meson-tests:meson-tests/common/136 empty build file
ok      0.53s project+meson-tests:meson-tests/common/131 override options
ok      0.69s project+meson-tests+requires_python:meson-tests/common/130 include order
ok      0.45s project+meson-tests+requires_python:meson-tests/common/140 custom target multiple outputs
ok      0.71s project+meson-tests+requires_python:meson-tests/common/135 custom target object output
ok      0.45s project+meson-tests+requires_python:meson-tests/common/143 list of file sources
ok      1.42s project+meson-tests+requires_python:meson-tests/common/121 object only target
fail    1.51s project+meson-tests:meson-tests/common/119 cpp and asm
ok      0.66s project+meson-tests:meson-tests/common/142 nested links
ok      0.94s project+meson-tests:meson-tests/common/137 whole archive
ok      5.91s project+meson-tests:meson-tests/common/36 has function
ok      0.77s project+meson-tests+requires_python:meson-tests/common/144 link depends custom target
ok      1.70s project+meson-tests:meson-tests/common/132 get define
ok      1.31s project+meson-tests+requires_python:meson-tests/common/141 special characters
ok      0.82s project+meson-tests:meson-tests/common/148 shared module resolving symbol in executable
ok      0.89s project+meson-tests:meson-tests/common/146 library at root
ok      0.82s project+meson-tests:meson-tests/common/149 dotinclude
ok      0.89s project+meson-tests:meson-tests/common/151 duplicate source names
ok      0.87s project+meson-tests:meson-tests/common/154 includedir subproj
ok      0.53s project+meson-tests:meson-tests/common/159 array option
ok      1.22s project+meson-tests+requires_python:meson-tests/common/150 reserved targets
fail    2.25s project+meson-tests:meson-tests/common/133 c cpp and asm
ok      1.01s project+meson-tests:meson-tests/common/153 wrap file should not failed
ok      1.12s project+meson-tests+requires_python:meson-tests/common/152 index customtarget
ok      0.56s project+meson-tests:meson-tests/common/158 disabler
ok      1.58s project+meson-tests:meson-tests/common/145 recursive linking
ok      0.54s project+meson-tests:meson-tests/common/161 not-found dependency
ok      0.24s project+meson-tests:meson-tests/common/162 subdir if_found
ok      0.24s project+meson-tests:meson-tests/common/163 default options prefix dependent defaults
ok      0.84s project+meson-tests:meson-tests/common/155 subproject dir name collision
ok      0.25s project+meson-tests:meson-tests/common/166 yield
ok      0.28s project+meson-tests:meson-tests/common/164 dependency factory
ok      0.86s project+meson-tests+requires_python:meson-tests/common/157 custom target subdir depend files
ok      0.79s project+meson-tests+requires_python:meson-tests/common/160 custom target template substitution
ok      0.46s project+meson-tests:meson-tests/common/165 get project license
ok      0.28s project+meson-tests:meson-tests/common/177 subdir_done
ok      0.32s project+meson-tests:meson-tests/common/176 subproject version
ok      0.60s project+meson-tests:meson-tests/common/167 subproject nested subproject dirs
ok      2.66s project+meson-tests:meson-tests/common/138 C and CPP link
ok      0.76s project+meson-tests+requires_python:meson-tests/common/168 preserve gendir
ok      0.68s project+meson-tests+requires_python:meson-tests/common/169 source in dep
ok      0.64s project+meson-tests:meson-tests/common/171 initial c_args
ok      0.62s project+meson-tests:meson-tests/common/174 ndebug if-release enabled
ok      0.68s project+meson-tests:meson-tests/common/175 ndebug if-release disabled
ok      0.73s project+meson-tests:meson-tests/common/172 identical target name in subproject flat layout
ok      0.74s project+meson-tests:meson-tests/common/173 as-needed
ok      3.27s project+meson-tests:meson-tests/common/134 compute int
ok      0.94s project+meson-tests+requires_python:meson-tests/common/170 generator link whole
ok      0.31s project+meson-tests:meson-tests/common/187 args flattening
ok      0.66s project+meson-tests:meson-tests/common/181 same target name flat layout
ok      0.52s project+meson-tests:meson-tests/common/185 same target name
ok      4.76s project+meson-tests:meson-tests/common/103 has header symbol
ok      0.26s project+meson-tests:meson-tests/common/191 subproject array version
ok      0.79s project+meson-tests+requires_python:meson-tests/common/179 escape and unicode
ok      0.63s project+meson-tests:meson-tests/common/183 partial dependency
ok      0.54s project+meson-tests+requires_python:meson-tests/common/186 test depends
ok      0.29s project+meson-tests:meson-tests/common/192 feature option
ok      0.26s project+meson-tests:meson-tests/common/193 feature option disabled
ok      0.51s project+meson-tests:meson-tests/common/188 dict
ok      0.82s project+meson-tests+requires_python:meson-tests/common/182 find override
ok      0.57s project+meson-tests:meson-tests/common/190 install_mode
ok      0.23s project+meson-tests:meson-tests/common/198 broken subproject
ok      0.27s project+meson-tests:meson-tests/common/199 argument syntax
ok      0.26s project+meson-tests+requires_python:meson-tests/common/202 custom target build by default
ok      0.50s project+meson-tests:meson-tests/common/194 static threads
ok      0.44s project+meson-tests:meson-tests/common/196 subproject with features
ok      0.26s project+meson-tests:meson-tests/common/204 line continuation
ok      0.42s project+meson-tests:meson-tests/common/203 find_library and headers
ok      0.48s project+meson-tests:meson-tests/common/201 kwarg entry
ok      0.52s project+meson-tests:meson-tests/common/200 install name_prefix name_suffix
ok      0.65s project+meson-tests+requires_python:meson-tests/common/195 generator in subdir
ok      1.52s project+meson-tests+requires_python:meson-tests/common/178 bothlibraries
ok      1.17s project+meson-tests:meson-tests/common/189 check header
ok      0.57s project+meson-tests:meson-tests/common/206 tap tests
ok      0.40s project+meson-tests:meson-tests/common/211 dependency get_variable method
ok      1.65s project+meson-tests:meson-tests/common/180 has link arg
ok      0.48s project+meson-tests+requires_python:meson-tests/common/217 test priorities
ok      0.56s project+meson-tests:meson-tests/common/219 include_type dependency
ok      0.91s project+meson-tests:meson-tests/common/212 source set configuration_data
skip    0.29s project+meson-tests:meson-tests/common/221 zlib
ok      1.21s project+meson-tests+requires_python:meson-tests/common/208 link custom
ok      0.98s project+meson-tests+requires_python:meson-tests/common/214 source set custom target
ok      1.16s project+meson-tests+requires_python:meson-tests/common/209 link custom_i single from multiple
ok      1.19s project+meson-tests+requires_python:meson-tests/common/210 link custom_i multiple from multiple
ok      0.80s project+meson-tests:meson-tests/common/218 include_dir dot
ok      1.08s project+meson-tests:meson-tests/common/213 source set dictionary
ok      1.09s project+meson-tests+requires_python:meson-tests/common/216 custom target input extracted objects
ok      0.85s project+meson-tests:meson-tests/common/220 fs module
ok      0.40s project+meson-tests:meson-tests/common/224 arithmetic operators
ok      0.53s project+meson-tests:meson-tests/common/232 dependency allow_fallback
ok      0.44s project+meson-tests:meson-tests/common/234 get_file_contents
ok      0.73s project+meson-tests:meson-tests/common/231 subdir files
ok      0.83s project+meson-tests:meson-tests/common/229 disabler array addition
ok      0.32s project+meson-tests:meson-tests/common/237 fstrings
ok      0.98s project+meson-tests+requires_python:meson-tests/common/228 custom_target source
ok      0.43s project+meson-tests:meson-tests/common/238 dependency include_type inconsistency
ok      0.95s project+meson-tests:meson-tests/common/233 wrap case
ok      1.08s project+meson-tests:meson-tests/common/225 link language
ok      0.89s project+meson-tests:meson-tests/common/235 invalid standard overridden to valid
ok      0.82s project+meson-tests:meson-tests/common/236 proper args splitting
ok      0.35s project+meson-tests:meson-tests/common/239 includedir violation
ok      1.15s project+meson-tests+requires_python:meson-tests/common/226 link depends indexed custom target
ok      0.32s project+meson-tests:meson-tests/common/240 dependency native host == build
ok      0.30s project+meson-tests:meson-tests/common/241 set and get variable
ok      2.60s project+meson-tests:meson-tests/common/205 native file path override
ok      0.28s project+meson-tests:meson-tests/common/244 variable scope
ok      0.28s project+meson-tests+requires_python:meson-tests/common/247 deprecated option
ok      0.30s project+meson-tests:meson-tests/common/246 dependency fallbacks
ok      0.25s project+meson-tests:meson-tests/common/248 install_emptydir
ok      0.43s project+meson-tests+requires_python:meson-tests/common/242 custom target feed
ok      2.68s project+meson-tests:meson-tests/common/207 warning level 0
ok      0.31s project+meson-tests:meson-tests/common/249 install_symlink
ok      0.57s project+meson-tests:meson-tests/common/243 escape++
ok      0.40s project+meson-tests+requires_python:meson-tests/common/252 install data structured
ok      0.23s project+meson-tests:meson-tests/common/258 subsubproject inplace
ok      0.52s project+meson-tests:meson-tests/common/250 system include dir
ok      2.67s project+meson-tests:meson-tests/common/215 source set realistic example
ok      0.60s project+meson-tests:meson-tests/common/251 add_project_dependencies
ok      0.53s project+meson-tests:meson-tests/common/253 subproject dependency variables
ok      0.48s project+meson-tests:meson-tests/common/257 generated header dep
ok      0.51s project+meson-tests:meson-tests/common/256 subproject extracted objects
ok      0.48s project+meson-tests:meson-tests/common/260 declare_dependency objects
ok      0.33s project+meson-tests:meson-tests/common/263 internal dependency includes in checks
ok      0.92s project+meson-tests+requires_python:meson-tests/common/245 custom target index source
ok      0.25s project+meson-tests:meson-tests/common/266 format string
ok      0.19s project+meson-tests:meson-tests/common/270 int_to_str_fill
ok      0.40s project+meson-tests:meson-tests/common/265 default_options dict
ok      0.67s project+meson-tests:meson-tests/common/259 preprocess
ok      0.27s project+meson-tests+requires_python:meson-tests/common/269 configure file output format
ok      2.34s project+meson-tests:meson-tests/common/223 persubproject options
fail*   0.10s project+meson-tests+requires_python:meson-tests/python/6 failing subproject
ok      0.27s project+meson-tests+requires_python:meson-tests/common/274 environment
ok      0.45s project+meson-tests:meson-tests/common/267 default_options in find_program
ok      0.73s project+meson-tests+requires_python:meson-tests/common/262 generator chain
ok      0.41s project+meson-tests+requires_python:meson-tests/common/273 customtarget exe for test
ok      0.29s project+meson-tests:meson-tests/common/277 custom target private dir
ok      0.52s project+meson-tests+requires_python:meson-tests/common/271 env in generator.process
ok      0.42s project+meson-tests:meson-tests/common/276 generator custom_tgt subdir
ok      0.21s project+meson-tests:meson-tests/native/1 trivial
ok      0.36s project+meson-tests+requires_python:meson-tests/python/1 basic
ok      0.51s project+meson-tests:meson-tests/common/275 required keyword in compiles functions
ok      0.38s project+meson-tests+requires_python:meson-tests/python/7 install path
skip    0.18s project+meson-tests:meson-tests/nasm/1 configure file
ok      0.52s project+meson-tests+requires_python:meson-tests/python/5 modules kwarg
skip    0.21s project+meson-tests:meson-tests/nasm/2 asm language
ok      0.47s project+meson-tests:meson-tests/native/2 global arg
skip    0.14s project+meson-tests:meson-tests/nasm/3 nasm only
skip    0.12s project+meson-tests:meson-tests/nasm/4 through configure
ok      1.20s project+meson-tests:meson-tests/common/264 required keyword in has functions
ok      0.26s project+meson-tests:meson-tests/keyval/1 basic
ok      0.25s project+meson-tests:meson-tests/keyval/2 subdir
ok      0.06s analyze:commands/copyfile.meson
ok      1.59s project+meson-tests:meson-tests/common/254 long output
ok      0.26s project+meson-tests:meson-tests/keyval/3 load_config files
ok      0.27s project+meson-tests:meson-tests/keyval/4 load_config builddir
ok      0.03s analyze:commands/i18n/itstool.meson
ok      0.06s analyze:commands/coverage.meson
ok      0.06s analyze:commands/delete_suffix.meson
ok      0.04s analyze:commands/i18n/msgfmthelper.meson
ok      0.06s analyze:commands/i18n/gettext.meson
ok      0.03s analyze:commands/vcs_tagger.meson
ok      0.64s project+meson-tests:meson-tests/native/8 external program shebang parsing
skip    0.20s project+meson-tests+requires_python:meson-tests/frameworks/7 gnome
ok      0.04s analyze:lib/cmake_prelude.meson
ok      0.04s analyze:modules/_test.meson
ok      0.04s analyze:runtime/dependencies.meson
ok      0.05s analyze:modules/gnome.meson
ok      0.05s analyze:modules/i18n.meson
ok      0.74s project+meson-tests+requires_python:meson-tests/native/5 install script
ok      0.84s project+meson-tests+requires_python:meson-tests/native/3 pipeline
ok      0.67s project+meson-tests:meson-tests/native/9 override with exe
ok      0.64s project+meson-tests+requires_python:meson-tests/frameworks/6 gettext
ok      1.29s project+meson-tests:meson-tests/native/6 add language
ok      1.42s project+meson-tests:meson-tests/native/4 tryrun
ok      5.33s project+meson-tests:meson-tests/common/197 function attributes
ok      1.52s project+meson-tests:meson-tests/native/7 selfbuilt custom

finished 350 tests, 3 expected fail, 4 fail, 8 skipped
fail    0.45s project+meson-tests:meson-tests/common/118 llvm ir and assembly
stdout: '/build/reproducible-path/muon-meson-0.4.0/tests/project/runner.meson:73:1: error command failed
 73 | run_command(ninja, '-C', build, check: true)
      ^___________________________________________
stdout:
ninja: Entering directory `/build/reproducible-path/muon-meson-0.4.0/build/tests/project/meson-tests/common/118 llvm ir and assembly'
[1/6] compiling assembly square_asm_c.p/square-x86_64.S.o
FAILED: square_asm_c.p/square-x86_64.S.o 
i686-linux-gnu-g++ -g -O0 -Wall -fdiagnostics-color=always -g -O2 -Werror=array-bounds -Werror=clobbered -Werror=volatile-register-var -ffile-prefix-map=/build/reproducible-path/muon-meson-0.4.0=. -fstack-protector-strong -Wformat -Werror=format-security -Wdate-time -D_FORTIFY_SOURCE=2 -I . -I "../../../../../../subprojects/meson-tests/common/118 llvm ir and assembly" -MD -MQ square_asm_c.p/square-x86_64.S.o -MF square_asm_c.p/square-x86_64.S.o.d -o square_asm_c.p/square-x86_64.S.o -c '../../../../../../subprojects/meson-tests/common/118 llvm ir and assembly/square-x86_64.S'
../../../../../../subprojects/meson-tests/common/118 llvm ir and assembly/square-x86_64.S: Assembler messages:
../../../../../../subprojects/meson-tests/common/118 llvm ir and assembly/square-x86_64.S:34: Error: `retq' is only supported in 64-bit mode
[2/6] compiling assembly square_asm_cpp.p/square-x86_64.S.o
FAILED: square_asm_cpp.p/square-x86_64.S.o 
i686-linux-gnu-g++ -g -O0 -Wall -fdiagnostics-color=always -g -O2 -Werror=array-bounds -Werror=clobbered -Werror=volatile-register-var -ffile-prefix-map=/build/reproducible-path/muon-meson-0.4.0=. -fstack-protector-strong -Wformat -Werror=format-security -Wdate-time -D_FORTIFY_SOURCE=2 -I . -I "../../../../../../subprojects/meson-tests/common/118 llvm ir and assembly" -MD -MQ square_asm_cpp.p/square-x86_64.S.o -MF square_asm_cpp.p/square-x86_64.S.o.d -o square_asm_cpp.p/square-x86_64.S.o -c '../../../../../../subprojects/meson-tests/common/118 llvm ir and assembly/square-x86_64.S'
../../../../../../subprojects/meson-tests/common/118 llvm ir and assembly/square-x86_64.S: Assembler messages:
../../../../../../subprojects/meson-tests/common/118 llvm ir and assembly/square-x86_64.S:34: Error: `retq' is only supported in 64-bit mode
[3/6] compiling c square_asm_c.p/main.c.o
[4/6] compiling cpp square_asm_cpp.p/main.cpp.o
ninja: build stopped: subcommand failed.
/build/reproducible-path/muon-meson-0.4.0/tests/project/runner.meson:73:1: error in run_command
 73 | run_command(ninja, '-C', build, check: true)
      ^___________________________________________
'
fail    0.42s project+meson-tests+requires_python:meson-tests/common/127 generated assembly
stdout: '/build/reproducible-path/muon-meson-0.4.0/tests/project/runner.meson:73:1: error command failed
 73 | run_command(ninja, '-C', build, check: true)
      ^___________________________________________
stdout:
ninja: Entering directory `/build/reproducible-path/muon-meson-0.4.0/build/tests/project/meson-tests/common/127 generated assembly'
[1/10] /build/reproducible-path/muon-meson-0.4.0/build/muon internal exe -e "/build/reproducible-path/muon-meson-0.4.0/build/tests/project/meson-tests/common/127 generated assembly/.muon/custom_tgt_env/square1_dat" -- "../../../../../../subprojects/meson-tests/common/127 generated assembly/copyfile.py" "../../../../../../subprojects/meson-tests/common/127 generated assembly/square-x86_64.S.in" square-x86_64.S
[2/10] compiling c square-gen-test.p/main.c.o
[3/10] compiling c square-ct-test.p/main.c.o
[4/10] /build/reproducible-path/muon-meson-0.4.0/build/muon internal exe -e "/build/reproducible-path/muon-meson-0.4.0/build/tests/project/meson-tests/common/127 generated assembly/.muon/custom_tgt_env/_gen:_libsquare-gen_a_p_square-x86_64_S_0_dat" -- "../../../../../../subprojects/meson-tests/common/127 generated assembly/copyfile.py" "../../../../../../subprojects/meson-tests/common/127 generated assembly/square-x86_64.S.in" libsquare-gen.a.p/square-x86_64.S
[5/10] compiling assembly libsquare-ct.a.p/square-x86_64.S.o
FAILED: libsquare-ct.a.p/square-x86_64.S.o 
i686-linux-gnu-gcc -g -O0 -Wall -fdiagnostics-color=always -g -O2 -Werror=implicit-function-declaration -Werror=array-bounds -Werror=clobbered -Werror=volatile-register-var -ffile-prefix-map=/build/reproducible-path/muon-meson-0.4.0=. -fstack-protector-strong -Wformat -Werror=format-security -DBOOTSTRAP_NO_SAMU -Wdate-time -D_FORTIFY_SOURCE=2 -fPIC -I . -I "../../../../../../subprojects/meson-tests/common/127 generated assembly" -MD -MQ libsquare-ct.a.p/square-x86_64.S.o -MF libsquare-ct.a.p/square-x86_64.S.o.d -o libsquare-ct.a.p/square-x86_64.S.o -c square-x86_64.S
square-x86_64.S: Assembler messages:
square-x86_64.S:35: Error: `retq' is only supported in 64-bit mode
[6/10] compiling assembly libsquare-gen.a.p/square-x86_64.S.o
FAILED: libsquare-gen.a.p/square-x86_64.S.o 
i686-linux-gnu-gcc -g -O0 -Wall -fdiagnostics-color=always -g -O2 -Werror=implicit-function-declaration -Werror=array-bounds -Werror=clobbered -Werror=volatile-register-var -ffile-prefix-map=/build/reproducible-path/muon-meson-0.4.0=. -fstack-protector-strong -Wformat -Werror=format-security -DBOOTSTRAP_NO_SAMU -Wdate-time -D_FORTIFY_SOURCE=2 -fPIC -I . -I "../../../../../../subprojects/meson-tests/common/127 generated assembly" -MD -MQ libsquare-gen.a.p/square-x86_64.S.o -MF libsquare-gen.a.p/square-x86_64.S.o.d -o libsquare-gen.a.p/square-x86_64.S.o -c libsquare-gen.a.p/square-x86_64.S
libsquare-gen.a.p/square-x86_64.S: Assembler messages:
libsquare-gen.a.p/square-x86_64.S:35: Error: `retq' is only supported in 64-bit mode
ninja: build stopped: subcommand failed.
/build/reproducible-path/muon-meson-0.4.0/tests/project/runner.meson:73:1: error in run_command
 73 | run_command(ninja, '-C', build, check: true)
      ^___________________________________________
'
fail    1.51s project+meson-tests:meson-tests/common/119 cpp and asm
stdout: '/build/reproducible-path/muon-meson-0.4.0/tests/project/runner.meson:73:1: error command failed
 73 | run_command(ninja, '-C', build, check: true)
      ^___________________________________________
stdout:
ninja: Entering directory `/build/reproducible-path/muon-meson-0.4.0/build/tests/project/meson-tests/common/119 cpp and asm'
[1/3] compiling assembly trivialprog.p/retval-x86_64.S.o
FAILED: trivialprog.p/retval-x86_64.S.o 
i686-linux-gnu-g++ -g -O0 -Wall -fdiagnostics-color=always -g -O2 -Werror=array-bounds -Werror=clobbered -Werror=volatile-register-var -ffile-prefix-map=/build/reproducible-path/muon-meson-0.4.0=. -fstack-protector-strong -Wformat -Werror=format-security -Wdate-time -D_FORTIFY_SOURCE=2 -I . -I "../../../../../../subprojects/meson-tests/common/119 cpp and asm" -DUSE_ASM -MD -MQ trivialprog.p/retval-x86_64.S.o -MF trivialprog.p/retval-x86_64.S.o.d -o trivialprog.p/retval-x86_64.S.o -c '../../../../../../subprojects/meson-tests/common/119 cpp and asm/retval-x86_64.S'
../../../../../../subprojects/meson-tests/common/119 cpp and asm/retval-x86_64.S: Assembler messages:
../../../../../../subprojects/meson-tests/common/119 cpp and asm/retval-x86_64.S:11: Error: `retq' is only supported in 64-bit mode
[2/3] compiling cpp trivialprog.p/trivial.cc.o
ninja: build stopped: subcommand failed.
/build/reproducible-path/muon-meson-0.4.0/tests/project/runner.meson:73:1: error in run_command
 73 | run_command(ninja, '-C', build, check: true)
      ^___________________________________________
'
fail    2.25s project+meson-tests:meson-tests/common/133 c cpp and asm
stdout: '/build/reproducible-path/muon-meson-0.4.0/tests/project/runner.meson:73:1: error command failed
 73 | run_command(ninja, '-C', build, check: true)
      ^___________________________________________
stdout:
ninja: Entering directory `/build/reproducible-path/muon-meson-0.4.0/build/tests/project/meson-tests/common/133 c cpp and asm'
[1/14] compiling assembly c-asm.p/retval-x86_64.S.o
FAILED: c-asm.p/retval-x86_64.S.o 
i686-linux-gnu-g++ -g -O0 -Wall -fdiagnostics-color=always -g -O2 -Werror=array-bounds -Werror=clobbered -Werror=volatile-register-var -ffile-prefix-map=/build/reproducible-path/muon-meson-0.4.0=. -fstack-protector-strong -Wformat -Werror=format-security -Wdate-time -D_FORTIFY_SOURCE=2 -I . -I "../../../../../../subprojects/meson-tests/common/133 c cpp and asm" -MD -MQ c-asm.p/retval-x86_64.S.o -MF c-asm.p/retval-x86_64.S.o.d -o c-asm.p/retval-x86_64.S.o -c '../../../../../../subprojects/meson-tests/common/133 c cpp and asm/retval-x86_64.S'
../../../../../../subprojects/meson-tests/common/133 c cpp and asm/retval-x86_64.S: Assembler messages:
../../../../../../subprojects/meson-tests/common/133 c cpp and asm/retval-x86_64.S:12: Error: `retq' is only supported in 64-bit mode
[2/14] compiling assembly cpp-asm.p/retval-x86_64.S.o
FAILED: cpp-asm.p/retval-x86_64.S.o 
i686-linux-gnu-g++ -g -O0 -Wall -fdiagnostics-color=always -g -O2 -Werror=array-bounds -Werror=clobbered -Werror=volatile-register-var -ffile-prefix-map=/build/reproducible-path/muon-meson-0.4.0=. -fstack-protector-strong -Wformat -Werror=format-security -Wdate-time -D_FORTIFY_SOURCE=2 -I . -I "../../../../../../subprojects/meson-tests/common/133 c cpp and asm" -MD -MQ cpp-asm.p/retval-x86_64.S.o -MF cpp-asm.p/retval-x86_64.S.o.d -o cpp-asm.p/retval-x86_64.S.o -c '../../../../../../subprojects/meson-tests/common/133 c cpp and asm/retval-x86_64.S'
../../../../../../subprojects/meson-tests/common/133 c cpp and asm/retval-x86_64.S: Assembler messages:
../../../../../../subprojects/meson-tests/common/133 c cpp and asm/retval-x86_64.S:12: Error: `retq' is only supported in 64-bit mode
[3/14] compiling assembly c-cpp-asm.p/retval-x86_64.S.o
FAILED: c-cpp-asm.p/retval-x86_64.S.o 
i686-linux-gnu-g++ -g -O0 -Wall -fdiagnostics-color=always -g -O2 -Werror=array-bounds -Werror=clobbered -Werror=volatile-register-var -ffile-prefix-map=/build/reproducible-path/muon-meson-0.4.0=. -fstack-protector-strong -Wformat -Werror=format-security -Wdate-time -D_FORTIFY_SOURCE=2 -I . -I "../../../../../../subprojects/meson-tests/common/133 c cpp and asm" -MD -MQ c-cpp-asm.p/retval-x86_64.S.o -MF c-cpp-asm.p/retval-x86_64.S.o.d -o c-cpp-asm.p/retval-x86_64.S.o -c '../../../../../../subprojects/meson-tests/common/133 c cpp and asm/retval-x86_64.S'
../../../../../../subprojects/meson-tests/common/133 c cpp and asm/retval-x86_64.S: Assembler messages:
../../../../../../subprojects/meson-tests/common/133 c cpp and asm/retval-x86_64.S:12: Error: `retq' is only supported in 64-bit mode
[4/14] compiling c c-cpp-asm.p/somelib.c.o
[5/14] compiling c c-asm.p/main.c.o
[6/14] compiling assembly cpp-c-asm.p/retval-x86_64.S.o
FAILED: cpp-c-asm.p/retval-x86_64.S.o 
i686-linux-gnu-g++ -g -O0 -Wall -fdiagnostics-color=always -g -O2 -Werror=array-bounds -Werror=clobbered -Werror=volatile-register-var -ffile-prefix-map=/build/reproducible-path/muon-meson-0.4.0=. -fstack-protector-strong -Wformat -Werror=format-security -Wdate-time -D_FORTIFY_SOURCE=2 -I . -I "../../../../../../subprojects/meson-tests/common/133 c cpp and asm" -MD -MQ cpp-c-asm.p/retval-x86_64.S.o -MF cpp-c-asm.p/retval-x86_64.S.o.d -o cpp-c-asm.p/retval-x86_64.S.o -c '../../../../../../subprojects/meson-tests/common/133 c cpp and asm/retval-x86_64.S'
../../../../../../subprojects/meson-tests/common/133 c cpp and asm/retval-x86_64.S: Assembler messages:
../../../../../../subprojects/meson-tests/common/133 c cpp and asm/retval-x86_64.S:12: Error: `retq' is only supported in 64-bit mode
[7/14] compiling c cpp-c-asm.p/somelib.c.o
[8/14] compiling cpp cpp-asm.p/main.cpp.o
[9/14] compiling cpp c-cpp-asm.p/main.cpp.o
[10/14] compiling cpp cpp-c-asm.p/main.cpp.o
ninja: build stopped: subcommand failed.
/build/reproducible-path/muon-meson-0.4.0/tests/project/runner.meson:73:1: error in run_command
 73 | run_command(ninja, '-C', build, check: true)
      ^___________________________________________
'
make[1]: *** [debian/rules:23: override_dh_auto_test] Error 1
make[1]: Leaving directory '/build/reproducible-path/muon-meson-0.4.0'
make: *** [debian/rules:13: binary] Error 2
dpkg-buildpackage: error: debian/rules binary subprocess returned exit status 2
I: copying local configuration
E: Failed autobuilding of package
I: unmounting dev/ptmx filesystem
I: unmounting dev/pts filesystem
I: unmounting dev/shm filesystem
I: unmounting proc filesystem
I: unmounting sys filesystem
I: cleaning the build env 
I: removing directory /srv/workspace/pbuilder/39193 and its subdirectories
Sat Mar 22 23:26:19 UTC 2025  W: No second build log, what happened?