Thu Mar 20 23:56:22 UTC 2025  I: starting to build ck/unstable/i386 on jenkins on '2025-03-20 23:55'
Thu Mar 20 23:56:22 UTC 2025  I: The jenkins build log is/was available at https://jenkins.debian.net/userContent/reproducible/debian/build_service/i386_9/47058/console.log
Thu Mar 20 23:56:22 UTC 2025  I: Downloading source for unstable/ck=0.7.2-5
--2025-03-20 23:56:22--  http://deb.debian.org/debian/pool/main/c/ck/ck_0.7.2-5.dsc
Connecting to 46.16.76.132:3128... connected.
Proxy request sent, awaiting response... 200 OK
Length: 1277 (1.2K) [text/prs.lines.tag]
Saving to: ‘ck_0.7.2-5.dsc’

     0K .                                                     100%  185M=0s

2025-03-20 23:56:22 (185 MB/s) - ‘ck_0.7.2-5.dsc’ saved [1277/1277]

Thu Mar 20 23:56:22 UTC 2025  I: ck_0.7.2-5.dsc
-----BEGIN PGP SIGNED MESSAGE-----
Hash: SHA512

Format: 3.0 (quilt)
Source: ck
Binary: libck-dev, libck0t64
Architecture: linux-any
Version: 0.7.2-5
Maintainer: Daniel Baumann <daniel@debian.org>
Homepage: http://concurrencykit.org
Standards-Version: 4.7.2
Vcs-Browser: https://forgejo.debian.net/dns-oarc/ck
Vcs-Git: https://forgejo.debian.net/dns-oarc/ck
Build-Depends: debhelper (>= 13.14~), debhelper-compat (= 13), dpkg-dev (>= 1.22.5)
Package-List:
 libck-dev deb libdevel optional arch=linux-any
 libck0t64 deb libs optional arch=linux-any
Checksums-Sha1:
 48ba3cc9ec6798275a512cd642752cc8a01753c5 182744 ck_0.7.2.orig.tar.xz
 ed33e90e372a8e8dca671d97a2053f0d7ad56eaf 5444 ck_0.7.2-5.debian.tar.xz
Checksums-Sha256:
 2798d0a179287312de271aa84cbc82bf73eceddad19a26df810f1518011ce4c0 182744 ck_0.7.2.orig.tar.xz
 98c853112d3df0fc32d4e219d4a7879c5bb493990068b389c2a7c544be69a77e 5444 ck_0.7.2-5.debian.tar.xz
Files:
 b46d7308facc3daf5641533ae5c3d07e 182744 ck_0.7.2.orig.tar.xz
 318ea5ce2826cfcd3a9a54317a223d8b 5444 ck_0.7.2-5.debian.tar.xz


-----BEGIN PGP SIGNATURE-----

iHUEARYKAB0WIQQmmGg4gLaoSj0ERgL7tPDoCoAiLwUCZ9wnmAAKCRD7tPDoCoAi
L9rEAP9plScdDEAyEBTsVBV6TgzQLNG9gu+rjOAM0pshq1Mb9wEAoejnwocPM0FH
4w7E+yyOh2wcnhn3lRupdHxFS/L6kgo=
=/q0T
-----END PGP SIGNATURE-----
Thu Mar 20 23:56:22 UTC 2025  I: Checking whether the package is not for us
Thu Mar 20 23:56:22 UTC 2025  I: Starting 1st build on remote node ionos2-i386.debian.net.
Thu Mar 20 23:56:22 UTC 2025  I: Preparing to do remote build '1' on ionos2-i386.debian.net.
Thu Mar 20 23:57:11 UTC 2025  I: Deleting $TMPDIR on ionos2-i386.debian.net.
I: pbuilder: network access will be disabled during build
I: Current time: Thu Mar 20 11:56:28 -12 2025
I: pbuilder-time-stamp: 1742514988
I: Building the build Environment
I: extracting base tarball [/var/cache/pbuilder/unstable-reproducible-base.tgz]
I: copying local configuration
W: --override-config is not set; not updating apt.conf Read the manpage for details.
I: mounting /proc filesystem
I: mounting /sys filesystem
I: creating /{dev,run}/shm
I: mounting /dev/pts filesystem
I: redirecting /dev/ptmx to /dev/pts/ptmx
I: policy-rc.d already exists
I: using eatmydata during job
I: Copying source file
I: copying [ck_0.7.2-5.dsc]
I: copying [./ck_0.7.2.orig.tar.xz]
I: copying [./ck_0.7.2-5.debian.tar.xz]
I: Extracting source
dpkg-source: warning: cannot verify inline signature for ./ck_0.7.2-5.dsc: unsupported subcommand
dpkg-source: info: extracting ck in ck-0.7.2
dpkg-source: info: unpacking ck_0.7.2.orig.tar.xz
dpkg-source: info: unpacking ck_0.7.2-5.debian.tar.xz
dpkg-source: info: using patch list from debian/patches/series
dpkg-source: info: applying debian/0001-ftbfs-armhf.patch
I: Not using root during the build.
I: Installing the build-deps
I: user script /srv/workspace/pbuilder/17996/tmp/hooks/D02_print_environment starting
I: set
  BUILDDIR='/build/reproducible-path'
  BUILDUSERGECOS='first user,first room,first work-phone,first home-phone,first other'
  BUILDUSERNAME='pbuilder1'
  BUILD_ARCH='i386'
  DEBIAN_FRONTEND='noninteractive'
  DEB_BUILD_OPTIONS='buildinfo=+all reproducible=+all parallel=11 '
  DISTRIBUTION='unstable'
  HOME='/root'
  HOST_ARCH='i386'
  IFS=' 	
  '
  INVOCATION_ID='ba535bac26ef42509f1c7a63866e6603'
  LANG='C'
  LANGUAGE='en_US:en'
  LC_ALL='C'
  LD_LIBRARY_PATH='/usr/lib/libeatmydata'
  LD_PRELOAD='libeatmydata.so'
  MAIL='/var/mail/root'
  OPTIND='1'
  PATH='/usr/sbin:/usr/bin:/sbin:/bin:/usr/games'
  PBCURRENTCOMMANDLINEOPERATION='build'
  PBUILDER_OPERATION='build'
  PBUILDER_PKGDATADIR='/usr/share/pbuilder'
  PBUILDER_PKGLIBDIR='/usr/lib/pbuilder'
  PBUILDER_SYSCONFDIR='/etc'
  PPID='17996'
  PS1='# '
  PS2='> '
  PS4='+ '
  PWD='/'
  SHELL='/bin/bash'
  SHLVL='2'
  SUDO_COMMAND='/usr/bin/timeout -k 18.1h 18h /usr/bin/ionice -c 3 /usr/bin/nice /usr/sbin/pbuilder --build --configfile /srv/reproducible-results/rbuild-debian/r-b-build.OCL4v5LE/pbuilderrc_rMso --distribution unstable --hookdir /etc/pbuilder/first-build-hooks --debbuildopts -b --basetgz /var/cache/pbuilder/unstable-reproducible-base.tgz --buildresult /srv/reproducible-results/rbuild-debian/r-b-build.OCL4v5LE/b1 --logfile b1/build.log ck_0.7.2-5.dsc'
  SUDO_GID='112'
  SUDO_UID='107'
  SUDO_USER='jenkins'
  TERM='unknown'
  TZ='/usr/share/zoneinfo/Etc/GMT+12'
  USER='root'
  _='/usr/bin/systemd-run'
  http_proxy='http://46.16.76.132:3128'
I: uname -a
  Linux ionos2-i386 6.1.0-32-amd64 #1 SMP PREEMPT_DYNAMIC Debian 6.1.129-1 (2025-03-06) x86_64 GNU/Linux
I: ls -l /bin
  lrwxrwxrwx 1 root root 7 Mar  4 11:20 /bin -> usr/bin
I: user script /srv/workspace/pbuilder/17996/tmp/hooks/D02_print_environment finished
 -> Attempting to satisfy build-dependencies
 -> Creating pbuilder-satisfydepends-dummy package
Package: pbuilder-satisfydepends-dummy
Version: 0.invalid.0
Architecture: i386
Maintainer: Debian Pbuilder Team <pbuilder-maint@lists.alioth.debian.org>
Description: Dummy package to satisfy dependencies with aptitude - created by pbuilder
 This package was created automatically by pbuilder to satisfy the
 build-dependencies of the package being currently built.
Depends: debhelper (>= 13.14~), debhelper-compat (= 13), dpkg-dev (>= 1.22.5)
dpkg-deb: building package 'pbuilder-satisfydepends-dummy' in '/tmp/satisfydepends-aptitude/pbuilder-satisfydepends-dummy.deb'.
Selecting previously unselected package pbuilder-satisfydepends-dummy.
(Reading database ... 19792 files and directories currently installed.)
Preparing to unpack .../pbuilder-satisfydepends-dummy.deb ...
Unpacking pbuilder-satisfydepends-dummy (0.invalid.0) ...
dpkg: pbuilder-satisfydepends-dummy: dependency problems, but configuring anyway as you requested:
 pbuilder-satisfydepends-dummy depends on debhelper (>= 13.14~); however:
  Package debhelper is not installed.
 pbuilder-satisfydepends-dummy depends on debhelper-compat (= 13); however:
  Package debhelper-compat is not installed.

Setting up pbuilder-satisfydepends-dummy (0.invalid.0) ...
Reading package lists...
Building dependency tree...
Reading state information...
Initializing package states...
Writing extended state information...
Building tag database...
pbuilder-satisfydepends-dummy is already installed at the requested version (0.invalid.0)
pbuilder-satisfydepends-dummy is already installed at the requested version (0.invalid.0)
The following NEW packages will be installed:
  autoconf{a} automake{a} autopoint{a} autotools-dev{a} bsdextrautils{a} debhelper{a} dh-autoreconf{a} dh-strip-nondeterminism{a} dwz{a} file{a} gettext{a} gettext-base{a} groff-base{a} intltool-debian{a} libarchive-zip-perl{a} libdebhelper-perl{a} libelf1t64{a} libfile-stripnondeterminism-perl{a} libicu76{a} libmagic-mgc{a} libmagic1t64{a} libpipeline1{a} libtool{a} libuchardet0{a} libunistring5{a} libxml2{a} m4{a} man-db{a} po-debconf{a} sensible-utils{a} 
The following packages are RECOMMENDED but will NOT be installed:
  curl libarchive-cpio-perl libltdl-dev libmail-sendmail-perl lynx wget 
0 packages upgraded, 30 newly installed, 0 to remove and 0 not upgraded.
Need to get 21.2 MB of archives. After unpacking 81.1 MB will be used.
Writing extended state information...
Get: 1 http://deb.debian.org/debian unstable/main i386 sensible-utils all 0.0.24 [24.8 kB]
Get: 2 http://deb.debian.org/debian unstable/main i386 libmagic-mgc i386 1:5.46-2 [337 kB]
Get: 3 http://deb.debian.org/debian unstable/main i386 libmagic1t64 i386 1:5.46-2 [117 kB]
Get: 4 http://deb.debian.org/debian unstable/main i386 file i386 1:5.46-2 [43.4 kB]
Get: 5 http://deb.debian.org/debian unstable/main i386 gettext-base i386 0.23.1-1 [245 kB]
Get: 6 http://deb.debian.org/debian unstable/main i386 libuchardet0 i386 0.0.8-1+b2 [69.2 kB]
Get: 7 http://deb.debian.org/debian unstable/main i386 groff-base i386 1.23.0-7 [1199 kB]
Get: 8 http://deb.debian.org/debian unstable/main i386 bsdextrautils i386 2.40.4-5 [96.5 kB]
Get: 9 http://deb.debian.org/debian unstable/main i386 libpipeline1 i386 1.5.8-1 [41.2 kB]
Get: 10 http://deb.debian.org/debian unstable/main i386 man-db i386 2.13.0-1 [1428 kB]
Get: 11 http://deb.debian.org/debian unstable/main i386 m4 i386 1.4.19-7 [301 kB]
Get: 12 http://deb.debian.org/debian unstable/main i386 autoconf all 2.72-3 [493 kB]
Get: 13 http://deb.debian.org/debian unstable/main i386 autotools-dev all 20220109.1 [51.6 kB]
Get: 14 http://deb.debian.org/debian unstable/main i386 automake all 1:1.17-3 [862 kB]
Get: 15 http://deb.debian.org/debian unstable/main i386 autopoint all 0.23.1-1 [770 kB]
Get: 16 http://deb.debian.org/debian unstable/main i386 libdebhelper-perl all 13.24.1 [90.9 kB]
Get: 17 http://deb.debian.org/debian unstable/main i386 libtool all 2.5.4-4 [539 kB]
Get: 18 http://deb.debian.org/debian unstable/main i386 dh-autoreconf all 20 [17.1 kB]
Get: 19 http://deb.debian.org/debian unstable/main i386 libarchive-zip-perl all 1.68-1 [104 kB]
Get: 20 http://deb.debian.org/debian unstable/main i386 libfile-stripnondeterminism-perl all 1.14.1-2 [19.7 kB]
Get: 21 http://deb.debian.org/debian unstable/main i386 dh-strip-nondeterminism all 1.14.1-2 [8620 B]
Get: 22 http://deb.debian.org/debian unstable/main i386 libelf1t64 i386 0.192-4 [195 kB]
Get: 23 http://deb.debian.org/debian unstable/main i386 dwz i386 0.15-1+b1 [116 kB]
Get: 24 http://deb.debian.org/debian unstable/main i386 libunistring5 i386 1.3-1 [458 kB]
Get: 25 http://deb.debian.org/debian unstable/main i386 libicu76 i386 76.1-3 [9893 kB]
Get: 26 http://deb.debian.org/debian unstable/main i386 libxml2 i386 2.12.7+dfsg+really2.9.14-0.3+b1 [734 kB]
Get: 27 http://deb.debian.org/debian unstable/main i386 gettext i386 0.23.1-1 [1714 kB]
Get: 28 http://deb.debian.org/debian unstable/main i386 intltool-debian all 0.35.0+20060710.6 [22.9 kB]
Get: 29 http://deb.debian.org/debian unstable/main i386 po-debconf all 1.0.21+nmu1 [248 kB]
Get: 30 http://deb.debian.org/debian unstable/main i386 debhelper all 13.24.1 [920 kB]
Fetched 21.2 MB in 0s (64.8 MB/s)
Preconfiguring packages ...
Selecting previously unselected package sensible-utils.
(Reading database ... 
(Reading database ... 5%
(Reading database ... 10%
(Reading database ... 15%
(Reading database ... 20%
(Reading database ... 25%
(Reading database ... 30%
(Reading database ... 35%
(Reading database ... 40%
(Reading database ... 45%
(Reading database ... 50%
(Reading database ... 55%
(Reading database ... 60%
(Reading database ... 65%
(Reading database ... 70%
(Reading database ... 75%
(Reading database ... 80%
(Reading database ... 85%
(Reading database ... 90%
(Reading database ... 95%
(Reading database ... 100%
(Reading database ... 19792 files and directories currently installed.)
Preparing to unpack .../00-sensible-utils_0.0.24_all.deb ...
Unpacking sensible-utils (0.0.24) ...
Selecting previously unselected package libmagic-mgc.
Preparing to unpack .../01-libmagic-mgc_1%3a5.46-2_i386.deb ...
Unpacking libmagic-mgc (1:5.46-2) ...
Selecting previously unselected package libmagic1t64:i386.
Preparing to unpack .../02-libmagic1t64_1%3a5.46-2_i386.deb ...
Unpacking libmagic1t64:i386 (1:5.46-2) ...
Selecting previously unselected package file.
Preparing to unpack .../03-file_1%3a5.46-2_i386.deb ...
Unpacking file (1:5.46-2) ...
Selecting previously unselected package gettext-base.
Preparing to unpack .../04-gettext-base_0.23.1-1_i386.deb ...
Unpacking gettext-base (0.23.1-1) ...
Selecting previously unselected package libuchardet0:i386.
Preparing to unpack .../05-libuchardet0_0.0.8-1+b2_i386.deb ...
Unpacking libuchardet0:i386 (0.0.8-1+b2) ...
Selecting previously unselected package groff-base.
Preparing to unpack .../06-groff-base_1.23.0-7_i386.deb ...
Unpacking groff-base (1.23.0-7) ...
Selecting previously unselected package bsdextrautils.
Preparing to unpack .../07-bsdextrautils_2.40.4-5_i386.deb ...
Unpacking bsdextrautils (2.40.4-5) ...
Selecting previously unselected package libpipeline1:i386.
Preparing to unpack .../08-libpipeline1_1.5.8-1_i386.deb ...
Unpacking libpipeline1:i386 (1.5.8-1) ...
Selecting previously unselected package man-db.
Preparing to unpack .../09-man-db_2.13.0-1_i386.deb ...
Unpacking man-db (2.13.0-1) ...
Selecting previously unselected package m4.
Preparing to unpack .../10-m4_1.4.19-7_i386.deb ...
Unpacking m4 (1.4.19-7) ...
Selecting previously unselected package autoconf.
Preparing to unpack .../11-autoconf_2.72-3_all.deb ...
Unpacking autoconf (2.72-3) ...
Selecting previously unselected package autotools-dev.
Preparing to unpack .../12-autotools-dev_20220109.1_all.deb ...
Unpacking autotools-dev (20220109.1) ...
Selecting previously unselected package automake.
Preparing to unpack .../13-automake_1%3a1.17-3_all.deb ...
Unpacking automake (1:1.17-3) ...
Selecting previously unselected package autopoint.
Preparing to unpack .../14-autopoint_0.23.1-1_all.deb ...
Unpacking autopoint (0.23.1-1) ...
Selecting previously unselected package libdebhelper-perl.
Preparing to unpack .../15-libdebhelper-perl_13.24.1_all.deb ...
Unpacking libdebhelper-perl (13.24.1) ...
Selecting previously unselected package libtool.
Preparing to unpack .../16-libtool_2.5.4-4_all.deb ...
Unpacking libtool (2.5.4-4) ...
Selecting previously unselected package dh-autoreconf.
Preparing to unpack .../17-dh-autoreconf_20_all.deb ...
Unpacking dh-autoreconf (20) ...
Selecting previously unselected package libarchive-zip-perl.
Preparing to unpack .../18-libarchive-zip-perl_1.68-1_all.deb ...
Unpacking libarchive-zip-perl (1.68-1) ...
Selecting previously unselected package libfile-stripnondeterminism-perl.
Preparing to unpack .../19-libfile-stripnondeterminism-perl_1.14.1-2_all.deb ...
Unpacking libfile-stripnondeterminism-perl (1.14.1-2) ...
Selecting previously unselected package dh-strip-nondeterminism.
Preparing to unpack .../20-dh-strip-nondeterminism_1.14.1-2_all.deb ...
Unpacking dh-strip-nondeterminism (1.14.1-2) ...
Selecting previously unselected package libelf1t64:i386.
Preparing to unpack .../21-libelf1t64_0.192-4_i386.deb ...
Unpacking libelf1t64:i386 (0.192-4) ...
Selecting previously unselected package dwz.
Preparing to unpack .../22-dwz_0.15-1+b1_i386.deb ...
Unpacking dwz (0.15-1+b1) ...
Selecting previously unselected package libunistring5:i386.
Preparing to unpack .../23-libunistring5_1.3-1_i386.deb ...
Unpacking libunistring5:i386 (1.3-1) ...
Selecting previously unselected package libicu76:i386.
Preparing to unpack .../24-libicu76_76.1-3_i386.deb ...
Unpacking libicu76:i386 (76.1-3) ...
Selecting previously unselected package libxml2:i386.
Preparing to unpack .../25-libxml2_2.12.7+dfsg+really2.9.14-0.3+b1_i386.deb ...
Unpacking libxml2:i386 (2.12.7+dfsg+really2.9.14-0.3+b1) ...
Selecting previously unselected package gettext.
Preparing to unpack .../26-gettext_0.23.1-1_i386.deb ...
Unpacking gettext (0.23.1-1) ...
Selecting previously unselected package intltool-debian.
Preparing to unpack .../27-intltool-debian_0.35.0+20060710.6_all.deb ...
Unpacking intltool-debian (0.35.0+20060710.6) ...
Selecting previously unselected package po-debconf.
Preparing to unpack .../28-po-debconf_1.0.21+nmu1_all.deb ...
Unpacking po-debconf (1.0.21+nmu1) ...
Selecting previously unselected package debhelper.
Preparing to unpack .../29-debhelper_13.24.1_all.deb ...
Unpacking debhelper (13.24.1) ...
Setting up libpipeline1:i386 (1.5.8-1) ...
Setting up bsdextrautils (2.40.4-5) ...
Setting up libmagic-mgc (1:5.46-2) ...
Setting up libarchive-zip-perl (1.68-1) ...
Setting up libdebhelper-perl (13.24.1) ...
Setting up libmagic1t64:i386 (1:5.46-2) ...
Setting up gettext-base (0.23.1-1) ...
Setting up m4 (1.4.19-7) ...
Setting up file (1:5.46-2) ...
Setting up libelf1t64:i386 (0.192-4) ...
Setting up autotools-dev (20220109.1) ...
Setting up libunistring5:i386 (1.3-1) ...
Setting up autopoint (0.23.1-1) ...
Setting up autoconf (2.72-3) ...
Setting up dwz (0.15-1+b1) ...
Setting up sensible-utils (0.0.24) ...
Setting up libuchardet0:i386 (0.0.8-1+b2) ...
Setting up libicu76:i386 (76.1-3) ...
Setting up libxml2:i386 (2.12.7+dfsg+really2.9.14-0.3+b1) ...
Setting up automake (1:1.17-3) ...
update-alternatives: using /usr/bin/automake-1.17 to provide /usr/bin/automake (automake) in auto mode
Setting up libfile-stripnondeterminism-perl (1.14.1-2) ...
Setting up gettext (0.23.1-1) ...
Setting up libtool (2.5.4-4) ...
Setting up intltool-debian (0.35.0+20060710.6) ...
Setting up dh-autoreconf (20) ...
Setting up dh-strip-nondeterminism (1.14.1-2) ...
Setting up groff-base (1.23.0-7) ...
Setting up po-debconf (1.0.21+nmu1) ...
Setting up man-db (2.13.0-1) ...
Not building database; man-db/auto-update is not 'true'.
Setting up debhelper (13.24.1) ...
Processing triggers for libc-bin (2.41-6) ...
Reading package lists...
Building dependency tree...
Reading state information...
Reading extended state information...
Initializing package states...
Writing extended state information...
Building tag database...
 -> Finished parsing the build-deps
I: Building the package
I: Running cd /build/reproducible-path/ck-0.7.2/ && env PATH="/usr/sbin:/usr/bin:/sbin:/bin:/usr/games" HOME="/nonexistent/first-build" dpkg-buildpackage -us -uc -b && env PATH="/usr/sbin:/usr/bin:/sbin:/bin:/usr/games" HOME="/nonexistent/first-build" dpkg-genchanges -S  > ../ck_0.7.2-5_source.changes
dpkg-buildpackage: info: source package ck
dpkg-buildpackage: info: source version 0.7.2-5
dpkg-buildpackage: info: source distribution sid
dpkg-buildpackage: info: source changed by Daniel Baumann <daniel@debian.org>
 dpkg-source --before-build .
dpkg-buildpackage: info: host architecture i386
 debian/rules clean
dh clean
   debian/rules execute_after_dh_auto_clean
make[1]: Entering directory '/build/reproducible-path/ck-0.7.2'
# remove generated files
rm -f doc/*.gz src/*.a src/*.so
for FILE in $(find . -type f -name "*.in"); \
do \
	rm -f "$(dirname "${FILE}")"/"$(basename "${FILE}" .in)"; \
done
make[1]: Leaving directory '/build/reproducible-path/ck-0.7.2'
   dh_clean
 debian/rules binary
dh binary
   dh_update_autotools_config
   dh_autoreconf
   debian/rules override_dh_auto_configure
make[1]: Entering directory '/build/reproducible-path/ck-0.7.2'
dh_auto_configure -- \
	--prefix=/usr \
	--libdir=/usr/lib/i386-linux-gnu \
	--includedir=/usr/include \
	--mandir=/usr/share/man \
	--cores=2 \
	--disable-sse
	./configure --build=i686-linux-gnu --prefix=/usr --includedir=\${prefix}/include --mandir=\${prefix}/share/man --infodir=\${prefix}/share/info --sysconfdir=/etc --localstatedir=/var --disable-option-checking --disable-silent-rules --libdir=\${prefix}/lib/i386-linux-gnu --runstatedir=/run --disable-maintainer-mode --disable-dependency-tracking --prefix=/usr --libdir=/usr/lib/i386-linux-gnu --includedir=/usr/include --mandir=/usr/share/man --cores=2 --disable-sse
Detecting operating system.......success [linux]
Detecting machine architecture...success [x86_64]
Finding dirname command..........success [/usr/bin/dirname]
Determining source directory......success [/build/reproducible-path/ck-0.7.2]
Finding gzip tool................success [/usr/bin/gzip]
Finding suitable compiler........success [/usr/bin/cc]
Finding suitable archiver........success [/usr/bin/ar]
Detecting VMA bits...............success [48]
Checking header file usability...success [stdbool.h]
Checking header file usability...success [stddef.h]
Checking header file usability...success [stdint.h]
Checking header file usability...success [string.h]
Detecting git SHA................git not installed or executable []
Generating header files..........success
Generating build files...........success

           VERSION = 0.7.2
           GIT_SHA = 
         BUILD_DIR = /build/reproducible-path/ck-0.7.2
           SRC_DIR = /build/reproducible-path/ck-0.7.2
            SYSTEM = linux
           PROFILE = x86_64
                AR = /usr/bin/ar
                CC = /usr/bin/cc
          COMPILER = gcc
            CFLAGS = -D_BSD_SOURCE -D_DEFAULT_SOURCE -std=gnu99 -pedantic -Wall -W -Wundef -Wendif-labels -Wshadow -Wpointer-arith -Wcast-align -Wcast-qual -Wwrite-strings -Wstrict-prototypes -Wmissing-prototypes -Wnested-externs -Winline -Wdisabled-optimization -fstrict-aliasing -O2 -pipe -Wno-parentheses -g -O2 -Werror=implicit-function-declaration -ffile-prefix-map=/build/reproducible-path/ck-0.7.2=. -fstack-protector-strong -Wformat -Werror=format-security -fPIC -D_XOPEN_SOURCE=600
    PTHREAD_CFLAGS = -pthread
                LD = /usr/bin/cc
            LDNAME = libck.so
    LDNAME_VERSION = libck.so.0.7.2
      LDNAME_MAJOR = libck.so.0
           LDFLAGS = -Wl,-soname,libck.so.0 -m64 -Wl,-z,relro -shared -fPIC
        SHARED_LIB = 1
        STATIC_LIB = 1
       EXTRA_BUILD = doc
              GZIP = /usr/bin/gzip -c
             CORES = 2
      POINTER_PACK = CK_MD_POINTER_PACK_DISABLE
      PPC32_LWSYNC = CK_MD_PPC32_LWSYNC_DISABLE
          VMA_BITS = 48
      MEMORY_MODEL = CK_MD_TSO
               RTM = CK_MD_RTM_DISABLE
               LSE = CK_MD_LSE_DISABLE
               SSE = CK_MD_SSE_DISABLE

Headers will be installed in /usr/include
Libraries will be installed in /usr/lib/i386-linux-gnu
Documentation will be installed in /usr/share/man
make[1]: Leaving directory '/build/reproducible-path/ck-0.7.2'
   dh_auto_build
	make -j11
make[1]: Entering directory '/build/reproducible-path/ck-0.7.2'
make -C doc all || exit
make[2]: Entering directory '/build/reproducible-path/ck-0.7.2/doc'
for target in CK_ARRAY_FOREACH ck_array_buffer ck_array_commit ck_array_deinit ck_array_init ck_array_initialized ck_array_length ck_array_put ck_array_put_unique ck_array_remove ck_array_deinit ck_brlock ck_ht_count ck_ht_destroy ck_ht_gc ck_ht_get_spmc ck_ht_grow_spmc ck_ht_hash ck_ht_hash_direct ck_ht_init ck_ht_put_spmc ck_ht_remove_spmc ck_ht_reset_spmc ck_ht_reset_size_spmc ck_ht_set_spmc ck_ht_entry_empty ck_ht_entry_key ck_ht_entry_key_direct ck_ht_entry_key_length ck_ht_entry_key_set ck_ht_entry_key_set_direct ck_ht_entry_set ck_ht_entry_set_direct ck_ht_entry_value_direct ck_ht_entry_value ck_ht_iterator_init ck_ht_next ck_ht_stat ck_bitmap_init ck_bitmap_reset ck_bitmap_set ck_bitmap_bts ck_bitmap_test ck_bitmap_base ck_bitmap_union ck_bitmap_size ck_bitmap_clear ck_bitmap_bits ck_bitmap_buffer ck_bitmap_next ck_bitmap_iterator_init ck_elide ck_epoch_barrier ck_epoch_begin ck_epoch_call ck_epoch_end ck_epoch_init ck_epoch_poll ck_epoch_recycle ck_epoch_register ck_epoch_reclaim ck_epoch_synchronize ck_epoch_unregister ck_hs_gc ck_hs_init ck_hs_destroy CK_HS_HASH ck_hs_apply ck_hs_iterator_init ck_hs_next ck_hs_get ck_hs_put ck_hs_put_unique ck_hs_set ck_hs_fas ck_hs_remove ck_hs_move ck_hs_grow ck_hs_rebuild ck_hs_count ck_hs_reset ck_hs_reset_size ck_hs_stat ck_rhs_gc ck_rhs_init ck_rhs_destroy CK_RHS_HASH ck_rhs_apply ck_rhs_iterator_init ck_rhs_next ck_rhs_get ck_rhs_put ck_rhs_put_unique ck_rhs_set ck_rhs_fas ck_rhs_remove ck_rhs_move ck_rhs_grow ck_rhs_rebuild ck_rhs_count ck_rhs_reset ck_rhs_reset_size ck_rhs_stat ck_rwcohort CK_RWCOHORT_INIT CK_RWCOHORT_INSTANCE CK_RWCOHORT_PROTOTYPE CK_RWCOHORT_READ_LOCK CK_RWCOHORT_READ_UNLOCK CK_RWCOHORT_WRITE_LOCK CK_RWCOHORT_WRITE_UNLOCK ck_cohort CK_COHORT_PROTOTYPE CK_COHORT_TRYLOCK_PROTOTYPE CK_COHORT_INSTANCE CK_COHORT_INIT CK_COHORT_LOCK CK_COHORT_UNLOCK CK_COHORT_TRYLOCK ck_pr ck_pr_fence_acquire ck_pr_fence_release ck_pr_barrier ck_pr_fas ck_pr_fence_atomic ck_pr_fence_atomic_load ck_pr_fence_atomic_store ck_pr_fence_load ck_pr_fence_load_atomic ck_pr_fence_load_store ck_pr_fence_load_depends ck_pr_fence_memory ck_pr_fence_store ck_pr_fence_store_atomic ck_pr_fence_store_load ck_pr_stall ck_pr_faa ck_pr_inc ck_pr_dec ck_pr_not ck_pr_neg ck_pr_add ck_pr_sub ck_pr_and ck_pr_xor ck_pr_or ck_pr_cas ck_pr_bts ck_pr_btc ck_pr_btr ck_pr_store ck_pr_load ck_pr_rtm ck_queue ck_ring_init ck_ring_dequeue_spmc ck_ring_enqueue_spmc ck_ring_enqueue_spmc_size ck_ring_trydequeue_spmc ck_ring_dequeue_spsc ck_ring_enqueue_spsc ck_ring_enqueue_spsc_size ck_ring_size ck_ring_capacity ck_tflock ck_rwlock ck_pflock ck_swlock ck_sequence ck_spinlock; do 			   \
	/usr/bin/gzip -c /build/reproducible-path/ck-0.7.2/doc/$target > /build/reproducible-path/ck-0.7.2/doc/$target.3.gz; \
done
make[2]: Leaving directory '/build/reproducible-path/ck-0.7.2/doc'
---[ Manual pages are ready for installation.
make -C src all || exit
make[2]: Entering directory '/build/reproducible-path/ck-0.7.2/src'
/usr/bin/cc -D_BSD_SOURCE -D_DEFAULT_SOURCE -std=gnu99 -pedantic -Wall -W -Wundef -Wendif-labels -Wshadow -Wpointer-arith -Wcast-align -Wcast-qual -Wwrite-strings -Wstrict-prototypes -Wmissing-prototypes -Wnested-externs -Winline -Wdisabled-optimization -fstrict-aliasing -O2 -pipe -Wno-parentheses -g -O2 -Werror=implicit-function-declaration -ffile-prefix-map=/build/reproducible-path/ck-0.7.2=. -fstack-protector-strong -Wformat -Werror=format-security -fPIC -D_XOPEN_SOURCE=600 -D_BSD_SOURCE -D_DEFAULT_SOURCE -std=gnu99 -pedantic -Wall -W -Wundef -Wendif-labels -Wshadow -Wpointer-arith -Wcast-align -Wcast-qual -Wwrite-strings -Wstrict-prototypes -Wmissing-prototypes -Wnested-externs -Winline -Wdisabled-optimization -fstrict-aliasing -O2 -pipe -Wno-parentheses -g -O2 -Werror=implicit-function-declaration -ffile-prefix-map=/build/reproducible-path/ck-0.7.2=. -fstack-protector-strong -Wformat -Werror=format-security -fPIC -D_XOPEN_SOURCE=600 -I/build/reproducible-path/ck-0.7.2/include -I/build/reproducible-path/ck-0.7.2/include -m64 -D__x86_64__ -c -o /build/reproducible-path/ck-0.7.2/src/ck_barrier_centralized.o /build/reproducible-path/ck-0.7.2/src/ck_barrier_centralized.c
/usr/bin/cc -D_BSD_SOURCE -D_DEFAULT_SOURCE -std=gnu99 -pedantic -Wall -W -Wundef -Wendif-labels -Wshadow -Wpointer-arith -Wcast-align -Wcast-qual -Wwrite-strings -Wstrict-prototypes -Wmissing-prototypes -Wnested-externs -Winline -Wdisabled-optimization -fstrict-aliasing -O2 -pipe -Wno-parentheses -g -O2 -Werror=implicit-function-declaration -ffile-prefix-map=/build/reproducible-path/ck-0.7.2=. -fstack-protector-strong -Wformat -Werror=format-security -fPIC -D_XOPEN_SOURCE=600 -D_BSD_SOURCE -D_DEFAULT_SOURCE -std=gnu99 -pedantic -Wall -W -Wundef -Wendif-labels -Wshadow -Wpointer-arith -Wcast-align -Wcast-qual -Wwrite-strings -Wstrict-prototypes -Wmissing-prototypes -Wnested-externs -Winline -Wdisabled-optimization -fstrict-aliasing -O2 -pipe -Wno-parentheses -g -O2 -Werror=implicit-function-declaration -ffile-prefix-map=/build/reproducible-path/ck-0.7.2=. -fstack-protector-strong -Wformat -Werror=format-security -fPIC -D_XOPEN_SOURCE=600 -I/build/reproducible-path/ck-0.7.2/include -I/build/reproducible-path/ck-0.7.2/include -m64 -D__x86_64__ -c -o /build/reproducible-path/ck-0.7.2/src/ck_barrier_combining.o /build/reproducible-path/ck-0.7.2/src/ck_barrier_combining.c
/usr/bin/cc -D_BSD_SOURCE -D_DEFAULT_SOURCE -std=gnu99 -pedantic -Wall -W -Wundef -Wendif-labels -Wshadow -Wpointer-arith -Wcast-align -Wcast-qual -Wwrite-strings -Wstrict-prototypes -Wmissing-prototypes -Wnested-externs -Winline -Wdisabled-optimization -fstrict-aliasing -O2 -pipe -Wno-parentheses -g -O2 -Werror=implicit-function-declaration -ffile-prefix-map=/build/reproducible-path/ck-0.7.2=. -fstack-protector-strong -Wformat -Werror=format-security -fPIC -D_XOPEN_SOURCE=600 -D_BSD_SOURCE -D_DEFAULT_SOURCE -std=gnu99 -pedantic -Wall -W -Wundef -Wendif-labels -Wshadow -Wpointer-arith -Wcast-align -Wcast-qual -Wwrite-strings -Wstrict-prototypes -Wmissing-prototypes -Wnested-externs -Winline -Wdisabled-optimization -fstrict-aliasing -O2 -pipe -Wno-parentheses -g -O2 -Werror=implicit-function-declaration -ffile-prefix-map=/build/reproducible-path/ck-0.7.2=. -fstack-protector-strong -Wformat -Werror=format-security -fPIC -D_XOPEN_SOURCE=600 -I/build/reproducible-path/ck-0.7.2/include -I/build/reproducible-path/ck-0.7.2/include -m64 -D__x86_64__ -c -o /build/reproducible-path/ck-0.7.2/src/ck_barrier_dissemination.o /build/reproducible-path/ck-0.7.2/src/ck_barrier_dissemination.c
/usr/bin/cc -D_BSD_SOURCE -D_DEFAULT_SOURCE -std=gnu99 -pedantic -Wall -W -Wundef -Wendif-labels -Wshadow -Wpointer-arith -Wcast-align -Wcast-qual -Wwrite-strings -Wstrict-prototypes -Wmissing-prototypes -Wnested-externs -Winline -Wdisabled-optimization -fstrict-aliasing -O2 -pipe -Wno-parentheses -g -O2 -Werror=implicit-function-declaration -ffile-prefix-map=/build/reproducible-path/ck-0.7.2=. -fstack-protector-strong -Wformat -Werror=format-security -fPIC -D_XOPEN_SOURCE=600 -D_BSD_SOURCE -D_DEFAULT_SOURCE -std=gnu99 -pedantic -Wall -W -Wundef -Wendif-labels -Wshadow -Wpointer-arith -Wcast-align -Wcast-qual -Wwrite-strings -Wstrict-prototypes -Wmissing-prototypes -Wnested-externs -Winline -Wdisabled-optimization -fstrict-aliasing -O2 -pipe -Wno-parentheses -g -O2 -Werror=implicit-function-declaration -ffile-prefix-map=/build/reproducible-path/ck-0.7.2=. -fstack-protector-strong -Wformat -Werror=format-security -fPIC -D_XOPEN_SOURCE=600 -I/build/reproducible-path/ck-0.7.2/include -I/build/reproducible-path/ck-0.7.2/include -m64 -D__x86_64__ -c -o /build/reproducible-path/ck-0.7.2/src/ck_barrier_tournament.o /build/reproducible-path/ck-0.7.2/src/ck_barrier_tournament.c
/usr/bin/cc -D_BSD_SOURCE -D_DEFAULT_SOURCE -std=gnu99 -pedantic -Wall -W -Wundef -Wendif-labels -Wshadow -Wpointer-arith -Wcast-align -Wcast-qual -Wwrite-strings -Wstrict-prototypes -Wmissing-prototypes -Wnested-externs -Winline -Wdisabled-optimization -fstrict-aliasing -O2 -pipe -Wno-parentheses -g -O2 -Werror=implicit-function-declaration -ffile-prefix-map=/build/reproducible-path/ck-0.7.2=. -fstack-protector-strong -Wformat -Werror=format-security -fPIC -D_XOPEN_SOURCE=600 -D_BSD_SOURCE -D_DEFAULT_SOURCE -std=gnu99 -pedantic -Wall -W -Wundef -Wendif-labels -Wshadow -Wpointer-arith -Wcast-align -Wcast-qual -Wwrite-strings -Wstrict-prototypes -Wmissing-prototypes -Wnested-externs -Winline -Wdisabled-optimization -fstrict-aliasing -O2 -pipe -Wno-parentheses -g -O2 -Werror=implicit-function-declaration -ffile-prefix-map=/build/reproducible-path/ck-0.7.2=. -fstack-protector-strong -Wformat -Werror=format-security -fPIC -D_XOPEN_SOURCE=600 -I/build/reproducible-path/ck-0.7.2/include -I/build/reproducible-path/ck-0.7.2/include -m64 -D__x86_64__ -c -o /build/reproducible-path/ck-0.7.2/src/ck_barrier_mcs.o /build/reproducible-path/ck-0.7.2/src/ck_barrier_mcs.c
In file included from /usr/lib/gcc/i686-linux-gnu/14/include/limits.h:210,
                 from /usr/lib/gcc/i686-linux-gnu/14/include/syslimits.h:7,
                 from /usr/lib/gcc/i686-linux-gnu/14/include/limits.h:34,
                 from /build/reproducible-path/ck-0.7.2/include/ck_limits.h:47,
                 from /build/reproducible-path/ck-0.7.2/include/spinlock/anderson.h:31,
                 from /build/reproducible-path/ck-0.7.2/include/ck_spinlock.h:30,
                 from /build/reproducible-path/ck-0.7.2/include/ck_barrier.h:31,
                 from /build/reproducible-path/ck-0.7.2/src/ck_barrier_dissemination.c:28:
/usr/include/limits.h:26:10: fatal error: bits/libc-header-start.h: No such file or directory
   26 | #include <bits/libc-header-start.h>
      |          ^~~~~~~~~~~~~~~~~~~~~~~~~~
In file included from /usr/lib/gcc/i686-linux-gnu/14/include/limits.h:210,
                 from /usr/lib/gcc/i686-linux-gnu/14/include/syslimits.h:7,
                 from /usr/lib/gcc/i686-linux-gnu/14/include/limits.h:34,
                 from /build/reproducible-path/ck-0.7.2/include/ck_limits.h:47,
                 from /build/reproducible-path/ck-0.7.2/include/spinlock/anderson.h:31,
                 from /build/reproducible-path/ck-0.7.2/include/ck_spinlock.h:30,
                 from /build/reproducible-path/ck-0.7.2/include/ck_barrier.h:31,
                 from /build/reproducible-path/ck-0.7.2/src/ck_barrier_centralized.c:28:
/usr/include/limits.h:26:10: fatal error: bits/libc-header-start.h: No such file or directory
   26 | #include <bits/libc-header-start.h>
      |          ^~~~~~~~~~~~~~~~~~~~~~~~~~
compilation terminated.
compilation terminated.
In file included from /usr/lib/gcc/i686-linux-gnu/14/include/limits.h:210,
                 from /usr/lib/gcc/i686-linux-gnu/14/include/syslimits.h:7,
                 from /usr/lib/gcc/i686-linux-gnu/14/include/limits.h:34,
                 from /build/reproducible-path/ck-0.7.2/include/ck_limits.h:47,
                 from /build/reproducible-path/ck-0.7.2/include/spinlock/anderson.h:31,
                 from /build/reproducible-path/ck-0.7.2/include/ck_spinlock.h:30,
                 from /build/reproducible-path/ck-0.7.2/include/ck_barrier.h:31,
                 from /build/reproducible-path/ck-0.7.2/src/ck_barrier_combining.c:28:
/usr/include/limits.h:26:10: fatal error: bits/libc-header-start.h: No such file or directory
   26 | #include <bits/libc-header-start.h>
      |          ^~~~~~~~~~~~~~~~~~~~~~~~~~
compilation terminated.
make[2]: *** [Makefile:52: ck_barrier_centralized.o] Error 1
make[2]: *** Waiting for unfinished jobs....
make[2]: *** [Makefile:58: ck_barrier_dissemination.o] Error 1
In file included from /usr/lib/gcc/i686-linux-gnu/14/include/limits.h:210,
                 from /usr/lib/gcc/i686-linux-gnu/14/include/syslimits.h:7,
                 from /usr/lib/gcc/i686-linux-gnu/14/include/limits.h:34,
                 from /build/reproducible-path/ck-0.7.2/include/ck_limits.h:47,
                 from /build/reproducible-path/ck-0.7.2/include/spinlock/anderson.h:31,
                 from /build/reproducible-path/ck-0.7.2/include/ck_spinlock.h:30,
                 from /build/reproducible-path/ck-0.7.2/include/ck_barrier.h:31,
                 from /build/reproducible-path/ck-0.7.2/src/ck_barrier_tournament.c:28:
/usr/include/limits.h:26:10: fatal error: bits/libc-header-start.h: No such file or directory
   26 | #include <bits/libc-header-start.h>
      |          ^~~~~~~~~~~~~~~~~~~~~~~~~~
compilation terminated.
make[2]: *** [Makefile:55: ck_barrier_combining.o] Error 1
make[2]: *** [Makefile:61: ck_barrier_tournament.o] Error 1
In file included from /usr/lib/gcc/i686-linux-gnu/14/include/limits.h:210,
                 from /usr/lib/gcc/i686-linux-gnu/14/include/syslimits.h:7,
                 from /usr/lib/gcc/i686-linux-gnu/14/include/limits.h:34,
                 from /build/reproducible-path/ck-0.7.2/include/ck_limits.h:47,
                 from /build/reproducible-path/ck-0.7.2/include/spinlock/anderson.h:31,
                 from /build/reproducible-path/ck-0.7.2/include/ck_spinlock.h:30,
                 from /build/reproducible-path/ck-0.7.2/include/ck_barrier.h:31,
                 from /build/reproducible-path/ck-0.7.2/src/ck_barrier_mcs.c:28:
/usr/include/limits.h:26:10: fatal error: bits/libc-header-start.h: No such file or directory
   26 | #include <bits/libc-header-start.h>
      |          ^~~~~~~~~~~~~~~~~~~~~~~~~~
compilation terminated.
make[2]: *** [Makefile:64: ck_barrier_mcs.o] Error 1
make[2]: Leaving directory '/build/reproducible-path/ck-0.7.2/src'
make[1]: *** [Makefile:17: all] Error 2
make[1]: Leaving directory '/build/reproducible-path/ck-0.7.2'
dh_auto_build: error: make -j11 returned exit code 2
make: *** [debian/rules:25: binary] Error 25
dpkg-buildpackage: error: debian/rules binary subprocess returned exit status 2
I: copying local configuration
E: Failed autobuilding of package
I: unmounting dev/ptmx filesystem
I: unmounting dev/pts filesystem
I: unmounting dev/shm filesystem
I: unmounting proc filesystem
I: unmounting sys filesystem
I: cleaning the build env 
I: removing directory /srv/workspace/pbuilder/17996 and its subdirectories
Thu Mar 20 23:57:12 UTC 2025  W: No second build log, what happened?