Thu Jan 30 05:12:59 UTC 2025  I: starting to build redmine/unstable/armhf on jenkins on '2025-01-30 05:12'
Thu Jan 30 05:12:59 UTC 2025  I: The jenkins build log is/was available at https://jenkins.debian.net/userContent/reproducible/debian/build_service/armhf_31/12233/console.log
Thu Jan 30 05:12:59 UTC 2025  I: Downloading source for unstable/redmine=5.1.3+ds-6
--2025-01-30 05:13:00--  http://deb.debian.org/debian/pool/main/r/redmine/redmine_5.1.3%2bds-6.dsc
Connecting to 46.16.76.132:3128... connected.
Proxy request sent, awaiting response... 200 OK
Length: 2821 (2.8K) [text/prs.lines.tag]
Saving to: ‘redmine_5.1.3+ds-6.dsc’

     0K ..                                                    100%  445M=0s

2025-01-30 05:13:00 (445 MB/s) - ‘redmine_5.1.3+ds-6.dsc’ saved [2821/2821]

Thu Jan 30 05:13:00 UTC 2025  I: redmine_5.1.3+ds-6.dsc
-----BEGIN PGP SIGNED MESSAGE-----
Hash: SHA512

Format: 3.0 (quilt)
Source: redmine
Binary: redmine, redmine-mysql, redmine-pgsql, redmine-sqlite
Architecture: all
Version: 5.1.3+ds-6
Maintainer: Debian Ruby Team <pkg-ruby-extras-maintainers@lists.alioth.debian.org>
Uploaders: Jérémy Lal <kapouer@melix.org>, Lucas Kanashiro <kanashiro@debian.org>, Marc Dequènes (Duck) <Duck@DuckCorp.org>, Utkarsh Gupta <utkarsh@debian.org>, Soren Stoutner <soren@debian.org>
Homepage: https://www.redmine.org
Standards-Version: 4.7.0
Vcs-Browser: https://salsa.debian.org/ruby-team/redmine
Vcs-Git: https://salsa.debian.org/ruby-team/redmine.git
Testsuite: autopkgtest
Testsuite-Triggers: apache2, curl, dbconfig-no-thanks, default-mysql-server, libapache2-mod-passenger, lighttpd, mercurial, multiwatch, nginx-light, postgresql, redmine-plugin-custom-css, ruby-fcgi, spawn-fcgi, thin
Build-Depends: dbconfig-common, debhelper-compat (= 13), gem2deb (>= 2.1~), ruby-actionpack-action-caching (>= 1.2.2~), ruby-actionpack-xml-parser, ruby-addressable, ruby-bundler, ruby-coderay (>= 1.0.6~), ruby-commonmarker (>= 0.23.1~), ruby-csv (>= 3.2.0~), ruby-task-list (>= 2.3.2~), ruby-html-pipeline (>= 2.13.2~), ruby-i18n (>= 1.14.1~), ruby-jquery-rails (>= 4.0.5~), ruby-mail (>= 2.8.1~), ruby-marcel (>= 1.0.1+dfsg-2~), ruby-mini-magick (>= 4.13.0~), ruby-mini-mime (>= 1.1.0~), ruby-net-ldap (>= 0.19.0~), ruby-nokogiri (>= 1.16.4~), ruby-rack (>= 1.4.5~), ruby-rails (>= 2:6.1.7~), ruby-rails-observers, ruby-rbpdf (>= 1.21~), ruby-redcarpet (>= 3.6.0~), ruby-request-store (>= 1.5.0~), ruby-rmagick (>= 2.14.0~), ruby-roadie (>= 3.2.2~), ruby-roadie-rails (>= 3.0.0~), ruby-rotp (>= 5.0.0~), ruby-rouge (>= 4.2~), ruby-rqrcode, ruby-sanitize (>= 6.0~), ruby-zip (>= 2.3.0~), ruby-rails-dom-testing, ruby-mocha (>= 1.4.0), ruby-sqlite3, gsfonts
Build-Depends-Indep: po-debconf
Package-List:
 redmine deb web optional arch=all
 redmine-mysql deb web optional arch=all
 redmine-pgsql deb web optional arch=all
 redmine-sqlite deb web optional arch=all
Checksums-Sha1:
 40f04d6e43a10ce1e21356b5ebb0a4a7927e074e 1939828 redmine_5.1.3+ds.orig.tar.xz
 3b8fab33ff1dd3c74742b84bdbf9423ff1fad2ae 99720 redmine_5.1.3+ds-6.debian.tar.xz
Checksums-Sha256:
 97a2b142c4641c61fcfa766fc7cf4cdc59926cf3ef90fbdafb2deb74bfd6cfee 1939828 redmine_5.1.3+ds.orig.tar.xz
 ce20caf34c8729c012a89c8ea6439d720eef210fd927ebce637888774d86eb48 99720 redmine_5.1.3+ds-6.debian.tar.xz
Files:
 daaf394d2ef184d0f94b15aed17af9f7 1939828 redmine_5.1.3+ds.orig.tar.xz
 06958546906a0d4087af64b9ab93ee83 99720 redmine_5.1.3+ds-6.debian.tar.xz

-----BEGIN PGP SIGNATURE-----

iHUEARYKAB0WIQSEz/3CFSD4gwbsKdFSaZq2P58rwwUCZ5ixTwAKCRBSaZq2P58r
wxJbAP47/aWs+tixFdRf38LfehxVxsTxfsNzKXeCW3ji0ib/VQEA0AHKFGg3xp/O
V2NHSmWH4UPMqikKfflU+i2fEtMDAgw=
=8rff
-----END PGP SIGNATURE-----
Thu Jan 30 05:13:00 UTC 2025  I: Checking whether the package is not for us
Thu Jan 30 05:13:00 UTC 2025  I: Starting 1st build on remote node virt64c-armhf-rb.debian.net.
Thu Jan 30 05:13:00 UTC 2025  I: Preparing to do remote build '1' on virt64c-armhf-rb.debian.net.
Thu Jan 30 05:16:49 UTC 2025  I: Deleting $TMPDIR on virt64c-armhf-rb.debian.net.
I: pbuilder: network access will be disabled during build
I: Current time: Wed Jan 29 17:13:06 -12 2025
I: pbuilder-time-stamp: 1738213986
I: Building the build Environment
I: extracting base tarball [/var/cache/pbuilder/unstable-reproducible-base.tgz]
I: copying local configuration
W: --override-config is not set; not updating apt.conf Read the manpage for details.
I: mounting /proc filesystem
I: mounting /sys filesystem
I: creating /{dev,run}/shm
I: mounting /dev/pts filesystem
I: redirecting /dev/ptmx to /dev/pts/ptmx
I: policy-rc.d already exists
I: Copying source file
I: copying [redmine_5.1.3+ds-6.dsc]
I: copying [./redmine_5.1.3+ds.orig.tar.xz]
I: copying [./redmine_5.1.3+ds-6.debian.tar.xz]
I: Extracting source
dpkg-source: warning: cannot verify inline signature for ./redmine_5.1.3+ds-6.dsc: unsupported subcommand
dpkg-source: info: extracting redmine in redmine-5.1.3+ds
dpkg-source: info: unpacking redmine_5.1.3+ds.orig.tar.xz
dpkg-source: info: unpacking redmine_5.1.3+ds-6.debian.tar.xz
dpkg-source: info: using patch list from debian/patches/series
dpkg-source: info: applying gemfile-deps-adjustment.patch
dpkg-source: info: applying 0002-Force-table-encoding-in-mysql.patch
dpkg-source: info: applying 0003-Use-production-environment-by-default.patch
dpkg-source: info: applying 0004-Add-multi-tenancy-support.patch
dpkg-source: info: applying 0005-Assume-default-instance.patch
dpkg-source: info: applying use_system_jquery_libs.patch
dpkg-source: info: applying broken-tests-skip.patch
dpkg-source: info: applying relax-pg-version.patch
dpkg-source: info: applying stop-unnecessary-recursive-chowning.patch
dpkg-source: info: applying autoload-thin-gem
dpkg-source: info: applying mercurial-py3-fix
dpkg-source: warning: unexpected end of diff 'redmine-5.1.3+ds/debian/patches/test-timezone.patch'
dpkg-source: info: applying test-timezone.patch
dpkg-source: info: applying rouge_4.5.patch
dpkg-source: info: applying tests_missing_fixtures.patch
dpkg-source: info: applying relax-ruby-version-constraint.patch
I: Not using root during the build.
I: Installing the build-deps
I: user script /srv/workspace/pbuilder/25253/tmp/hooks/D02_print_environment starting
I: set
  BUILDDIR='/build/reproducible-path'
  BUILDUSERGECOS='first user,first room,first work-phone,first home-phone,first other'
  BUILDUSERNAME='pbuilder1'
  BUILD_ARCH='armhf'
  DEBIAN_FRONTEND='noninteractive'
  DEB_BUILD_OPTIONS='buildinfo=+all reproducible=+all parallel=3 '
  DISTRIBUTION='unstable'
  HOME='/root'
  HOST_ARCH='armhf'
  IFS=' 	
  '
  INVOCATION_ID='441f49f3e36742fda3c1a27d664a14a1'
  LANG='C'
  LANGUAGE='en_US:en'
  LC_ALL='C'
  MAIL='/var/mail/root'
  OPTIND='1'
  PATH='/usr/sbin:/usr/bin:/sbin:/bin:/usr/games'
  PBCURRENTCOMMANDLINEOPERATION='build'
  PBUILDER_OPERATION='build'
  PBUILDER_PKGDATADIR='/usr/share/pbuilder'
  PBUILDER_PKGLIBDIR='/usr/lib/pbuilder'
  PBUILDER_SYSCONFDIR='/etc'
  PPID='25253'
  PS1='# '
  PS2='> '
  PS4='+ '
  PWD='/'
  SHELL='/bin/bash'
  SHLVL='2'
  SUDO_COMMAND='/usr/bin/timeout -k 18.1h 18h /usr/bin/ionice -c 3 /usr/bin/nice /usr/sbin/pbuilder --build --configfile /srv/reproducible-results/rbuild-debian/r-b-build.fLoBZtZN/pbuilderrc_LfTe --distribution unstable --hookdir /etc/pbuilder/first-build-hooks --debbuildopts -b --basetgz /var/cache/pbuilder/unstable-reproducible-base.tgz --buildresult /srv/reproducible-results/rbuild-debian/r-b-build.fLoBZtZN/b1 --logfile b1/build.log redmine_5.1.3+ds-6.dsc'
  SUDO_GID='113'
  SUDO_UID='107'
  SUDO_USER='jenkins'
  TERM='unknown'
  TZ='/usr/share/zoneinfo/Etc/GMT+12'
  USER='root'
  _='/usr/bin/systemd-run'
  http_proxy='http://10.0.0.15:3142/'
I: uname -a
  Linux virt64c 6.1.0-30-arm64 #1 SMP Debian 6.1.124-1 (2025-01-12) aarch64 GNU/Linux
I: ls -l /bin
  lrwxrwxrwx 1 root root 7 Nov 22 14:40 /bin -> usr/bin
I: user script /srv/workspace/pbuilder/25253/tmp/hooks/D02_print_environment finished
 -> Attempting to satisfy build-dependencies
 -> Creating pbuilder-satisfydepends-dummy package
Package: pbuilder-satisfydepends-dummy
Version: 0.invalid.0
Architecture: armhf
Maintainer: Debian Pbuilder Team <pbuilder-maint@lists.alioth.debian.org>
Description: Dummy package to satisfy dependencies with aptitude - created by pbuilder
 This package was created automatically by pbuilder to satisfy the
 build-dependencies of the package being currently built.
Depends: dbconfig-common, debhelper-compat (= 13), gem2deb (>= 2.1~), ruby-actionpack-action-caching (>= 1.2.2~), ruby-actionpack-xml-parser, ruby-addressable, ruby-bundler, ruby-coderay (>= 1.0.6~), ruby-commonmarker (>= 0.23.1~), ruby-csv (>= 3.2.0~), ruby-task-list (>= 2.3.2~), ruby-html-pipeline (>= 2.13.2~), ruby-i18n (>= 1.14.1~), ruby-jquery-rails (>= 4.0.5~), ruby-mail (>= 2.8.1~), ruby-marcel (>= 1.0.1+dfsg-2~), ruby-mini-magick (>= 4.13.0~), ruby-mini-mime (>= 1.1.0~), ruby-net-ldap (>= 0.19.0~), ruby-nokogiri (>= 1.16.4~), ruby-rack (>= 1.4.5~), ruby-rails (>= 2:6.1.7~), ruby-rails-observers, ruby-rbpdf (>= 1.21~), ruby-redcarpet (>= 3.6.0~), ruby-request-store (>= 1.5.0~), ruby-rmagick (>= 2.14.0~), ruby-roadie (>= 3.2.2~), ruby-roadie-rails (>= 3.0.0~), ruby-rotp (>= 5.0.0~), ruby-rouge (>= 4.2~), ruby-rqrcode, ruby-sanitize (>= 6.0~), ruby-zip (>= 2.3.0~), ruby-rails-dom-testing, ruby-mocha (>= 1.4.0), ruby-sqlite3, gsfonts, po-debconf
dpkg-deb: building package 'pbuilder-satisfydepends-dummy' in '/tmp/satisfydepends-aptitude/pbuilder-satisfydepends-dummy.deb'.
Selecting previously unselected package pbuilder-satisfydepends-dummy.
(Reading database ... 19568 files and directories currently installed.)
Preparing to unpack .../pbuilder-satisfydepends-dummy.deb ...
Unpacking pbuilder-satisfydepends-dummy (0.invalid.0) ...
dpkg: pbuilder-satisfydepends-dummy: dependency problems, but configuring anyway as you requested:
 pbuilder-satisfydepends-dummy depends on dbconfig-common; however:
  Package dbconfig-common is not installed.
 pbuilder-satisfydepends-dummy depends on debhelper-compat (= 13); however:
  Package debhelper-compat is not installed.
 pbuilder-satisfydepends-dummy depends on gem2deb (>= 2.1~); however:
  Package gem2deb is not installed.
 pbuilder-satisfydepends-dummy depends on ruby-actionpack-action-caching (>= 1.2.2~); however:
  Package ruby-actionpack-action-caching is not installed.
 pbuilder-satisfydepends-dummy depends on ruby-actionpack-xml-parser; however:
  Package ruby-actionpack-xml-parser is not installed.
 pbuilder-satisfydepends-dummy depends on ruby-addressable; however:
  Package ruby-addressable is not installed.
 pbuilder-satisfydepends-dummy depends on ruby-bundler; however:
  Package ruby-bundler is not installed.
 pbuilder-satisfydepends-dummy depends on ruby-coderay (>= 1.0.6~); however:
  Package ruby-coderay is not installed.
 pbuilder-satisfydepends-dummy depends on ruby-commonmarker (>= 0.23.1~); however:
  Package ruby-commonmarker is not installed.
 pbuilder-satisfydepends-dummy depends on ruby-csv (>= 3.2.0~); however:
  Package ruby-csv is not installed.
 pbuilder-satisfydepends-dummy depends on ruby-task-list (>= 2.3.2~); however:
  Package ruby-task-list is not installed.
 pbuilder-satisfydepends-dummy depends on ruby-html-pipeline (>= 2.13.2~); however:
  Package ruby-html-pipeline is not installed.
 pbuilder-satisfydepends-dummy depends on ruby-i18n (>= 1.14.1~); however:
  Package ruby-i18n is not installed.
 pbuilder-satisfydepends-dummy depends on ruby-jquery-rails (>= 4.0.5~); however:
  Package ruby-jquery-rails is not installed.
 pbuilder-satisfydepends-dummy depends on ruby-mail (>= 2.8.1~); however:
  Package ruby-mail is not installed.
 pbuilder-satisfydepends-dummy depends on ruby-marcel (>= 1.0.1+dfsg-2~); however:
  Package ruby-marcel is not installed.
 pbuilder-satisfydepends-dummy depends on ruby-mini-magick (>= 4.13.0~); however:
  Package ruby-mini-magick is not installed.
 pbuilder-satisfydepends-dummy depends on ruby-mini-mime (>= 1.1.0~); however:
  Package ruby-mini-mime is not installed.
 pbuilder-satisfydepends-dummy depends on ruby-net-ldap (>= 0.19.0~); however:
  Package ruby-net-ldap is not installed.
 pbuilder-satisfydepends-dummy depends on ruby-nokogiri (>= 1.16.4~); however:
  Package ruby-nokogiri is not installed.
 pbuilder-satisfydepends-dummy depends on ruby-rack (>= 1.4.5~); however:
  Package ruby-rack is not installed.
 pbuilder-satisfydepends-dummy depends on ruby-rails (>= 2:6.1.7~); however:
  Package ruby-rails is not installed.
 pbuilder-satisfydepends-dummy depends on ruby-rails-observers; however:
  Package ruby-rails-observers is not installed.
 pbuilder-satisfydepends-dummy depends on ruby-rbpdf (>= 1.21~); however:
  Package ruby-rbpdf is not installed.
 pbuilder-satisfydepends-dummy depends on ruby-redcarpet (>= 3.6.0~); however:
  Package ruby-redcarpet is not installed.
 pbuilder-satisfydepends-dummy depends on ruby-request-store (>= 1.5.0~); however:
  Package ruby-request-store is not installed.
 pbuilder-satisfydepends-dummy depends on ruby-rmagick (>= 2.14.0~); however:
  Package ruby-rmagick is not installed.
 pbuilder-satisfydepends-dummy depends on ruby-roadie (>= 3.2.2~); however:
  Package ruby-roadie is not installed.
 pbuilder-satisfydepends-dummy depends on ruby-roadie-rails (>= 3.0.0~); however:
  Package ruby-roadie-rails is not installed.
 pbuilder-satisfydepends-dummy depends on ruby-rotp (>= 5.0.0~); however:
  Package ruby-rotp is not installed.
 pbuilder-satisfydepends-dummy depends on ruby-rouge (>= 4.2~); however:
  Package ruby-rouge is not installed.
 pbuilder-satisfydepends-dummy depends on ruby-rqrcode; however:
  Package ruby-rqrcode is not installed.
 pbuilder-satisfydepends-dummy depends on ruby-sanitize (>= 6.0~); however:
  Package ruby-sanitize is not installed.
 pbuilder-satisfydepends-dummy depends on ruby-zip (>= 2.3.0~); however:
  Package ruby-zip is not installed.
 pbuilder-satisfydepends-dummy depends on ruby-rails-dom-testing; however:
  Package ruby-rails-dom-testing is not installed.
 pbuilder-satisfydepends-dummy depends on ruby-mocha (>= 1.4.0); however:
  Package ruby-mocha is not installed.
 pbuilder-satisfydepends-dummy depends on ruby-sqlite3; however:
  Package ruby-sqlite3 is not installed.
 pbuilder-satisfydepends-dummy depends on gsfonts; however:
  Package gsfonts is not installed.
 pbuilder-satisfydepends-dummy depends on po-debconf; however:
  Package po-debconf is not installed.

Setting up pbuilder-satisfydepends-dummy (0.invalid.0) ...
Reading package lists...
Building dependency tree...
Reading state information...
Initializing package states...
Writing extended state information...
Building tag database...
pbuilder-satisfydepends-dummy is already installed at the requested version (0.invalid.0)
pbuilder-satisfydepends-dummy is already installed at the requested version (0.invalid.0)
The following NEW packages will be installed:
  autoconf{a} automake{a} autopoint{a} autotools-dev{a} bsdextrautils{a} ca-certificates{a} dbconfig-common{a} debhelper{a} devscripts{a} dh-autoreconf{a} dh-strip-nondeterminism{a} dirmngr{a} dwz{a} file{a} fontconfig-config{a} fonts-dejavu-core{a} fonts-dejavu-mono{a} fonts-urw-base35{a} gem2deb{a} gem2deb-test-runner{a} gettext{a} gettext-base{a} gnupg{a} gnupg-l10n{a} gpg{a} gpg-agent{a} gpgconf{a} gpgsm{a} gpgv{a} groff-base{a} gsfonts{a} hicolor-icon-theme{a} imagemagick{a} imagemagick-7-common{a} imagemagick-7.q16{a} intltool-debian{a} libarchive-zip-perl{a} libassuan9{a} libb-hooks-op-check-perl{a} libbrotli1{a} libclass-method-modifiers-perl{a} libclass-xsaccessor-perl{a} libclone-perl{a} libdav1d7{a} libde265-0{a} libdebhelper-perl{a} libdeflate0{a} libdevel-callchecker-perl{a} libdynaloader-functions-perl{a} libedit2{a} libelf1t64{a} libencode-locale-perl{a} libexpat1{a} libffi8{a} libfftw3-double3{a} libfile-dirlist-perl{a} libfile-homedir-perl{a} libfile-listing-perl{a} libfile-stripnondeterminism-perl{a} libfile-touch-perl{a} libfile-which-perl{a} libfontconfig1{a} libfontenc1{a} libfreetype6{a} libgcrypt20{a} libglib2.0-0t64{a} libgmp-dev{a} libgmpxx4ldbl{a} libgnutls30t64{a} libgpg-error0{a} libheif-plugin-dav1d{a} libheif-plugin-libde265{a} libheif1{a} libhtml-parser-perl{a} libhtml-tagset-perl{a} libhtml-tree-perl{a} libhttp-cookies-perl{a} libhttp-date-perl{a} libhttp-message-perl{a} libhttp-negotiate-perl{a} libicu72{a} libidn2-0{a} libimport-into-perl{a} libio-html-perl{a} libio-pty-perl{a} libio-socket-ssl-perl{a} libipc-run-perl{a} libjbig0{a} libjpeg62-turbo{a} libjs-jquery{a} libksba8{a} liblcms2-2{a} libldap2{a} liblerc4{a} liblqr-1-0{a} libltdl7{a} liblwp-mediatypes-perl{a} liblwp-protocol-https-perl{a} libmagic-mgc{a} libmagic1t64{a} libmagickcore-7.q16-10{a} libmagickwand-7.q16-10{a} libmodule-runtime-perl{a} libmoo-perl{a} libncurses6{a} libnet-http-perl{a} libnet-ssleay-perl{a} libnpth0t64{a} libopenjp2-7{a} libp11-kit0{a} libparams-classify-perl{a} libpipeline1{a} libpng16-16t64{a} libproc2-0{a} libpython3-stdlib{a} libpython3.13-minimal{a} libpython3.13-stdlib{a} libraw23t64{a} libreadline8t64{a} librole-tiny-perl{a} libruby{a} libruby3.1t64{a} libruby3.3{a} libsasl2-2{a} libsasl2-modules-db{a} libsharpyuv0{a} libsub-quote-perl{a} libtasn1-6{a} libtext-charwidth-perl{a} libtext-wrapi18n-perl{a} libtiff6{a} libtimedate-perl{a} libtool{a} libtry-tiny-perl{a} libuchardet0{a} libunistring5{a} liburi-perl{a} libwebp7{a} libwebpdemux2{a} libwebpmux3{a} libwww-perl{a} libwww-robotrules-perl{a} libx11-6{a} libx11-data{a} libxau6{a} libxcb1{a} libxdmcp6{a} libxext6{a} libxml2{a} libxslt1.1{a} libyaml-0-2{a} m4{a} man-db{a} media-types{a} netbase{a} openssl{a} patchutils{a} perl-openssl-defaults{a} pinentry-curses{a} po-debconf{a} procps{a} publicsuffix{a} python3{a} python3-minimal{a} python3.13{a} python3.13-minimal{a} racc{a} rake{a} readline-common{a} ruby{a} ruby-actioncable{a} ruby-actionmailbox{a} ruby-actionmailer{a} ruby-actionpack{a} ruby-actionpack-action-caching{a} ruby-actionpack-xml-parser{a} ruby-actiontext{a} ruby-actionview{a} ruby-activejob{a} ruby-activemodel{a} ruby-activerecord{a} ruby-activestorage{a} ruby-activesupport{a} ruby-addressable{a} ruby-all-dev{a} ruby-builder{a} ruby-bundler{a} ruby-chunky-png{a} ruby-coderay{a} ruby-commonmarker{a} ruby-concurrent{a} ruby-crass{a} ruby-css-parser{a} ruby-did-you-mean{a} ruby-enum{a} ruby-erubi{a} ruby-globalid{a} ruby-hike{a} ruby-html-pipeline{a} ruby-htmlentities{a} ruby-i18n{a} ruby-jquery-rails{a} ruby-loofah{a} ruby-mail{a} ruby-marcel{a} ruby-metaclass{a} ruby-method-source{a} ruby-mini-magick{a} ruby-mini-mime{a} ruby-mini-portile2{a} ruby-minitest{a} ruby-mocha{a} ruby-multi-json{a} ruby-net-ldap{a} ruby-net-telnet{a} ruby-nio4r{a} ruby-nokogiri{a} ruby-pkg-config{a} ruby-posix-spawn{a} ruby-power-assert{a} ruby-public-suffix{a} ruby-rack{a} ruby-rack-test{a} ruby-rails{a} ruby-rails-dom-testing{a} ruby-rails-html-sanitizer{a} ruby-rails-observers{a} ruby-railties{a} ruby-rbpdf{a} ruby-rbpdf-font{a} ruby-redcarpet{a} ruby-request-store{a} ruby-rmagick{a} ruby-roadie{a} ruby-roadie-rails{a} ruby-rotp{a} ruby-rouge{a} ruby-rqrcode{a} ruby-rqrcode-core{a} ruby-rubygems{a} ruby-sanitize{a} ruby-sdbm{a} ruby-sprockets{a} ruby-sprockets-rails{a} ruby-sqlite3{a} ruby-task-list{a} ruby-test-unit{a} ruby-thor{a} ruby-tilt{a} ruby-tzinfo{a} ruby-webrick{a} ruby-websocket-driver{a} ruby-websocket-extensions{a} ruby-xmlrpc{a} ruby-zeitwerk{a} ruby-zip{a} ruby3.1{a} ruby3.1-dev{a} ruby3.3{a} ruby3.3-dev{a} rubygems-integration{a} sensible-utils{a} sopv-gpgv{a} tzdata{a} ucf{a} unzip{a} wdiff{a} x11-common{a} xfonts-encodings{a} xfonts-utils{a} zip{a} 
The following packages are RECOMMENDED but will NOT be installed:
  apt-file curl dctrl-tools debian-keyring dput dput-ng dupload equivs fonts-lato ghostscript gnupg-utils gpg-wks-client javascript-common libarchive-cpio-perl libdata-dump-perl libdistro-info-perl libgit-wrapper-perl libgitlab-api-v4-perl libglib2.0-data libgpg-error-l10n libgpm2 libheif-plugin-aomenc libheif-plugin-x265 libhtml-form-perl libhtml-format-perl libhttp-daemon-perl libio-compress-brotli-perl libjson-perl libldap-common liblist-compare-perl libltdl-dev libmagickcore-7.q16-10-extra libmail-sendmail-perl libmailtools-perl libnamespace-clean-perl libsasl2-modules libsoap-lite-perl libstring-shellquote-perl libxstring-perl licensecheck lintian linux-sysctl-defaults lynx netpbm pristine-tar psmisc python3-apt python3-argcomplete python3-debian python3-magic python3-requests python3-unidiff python3-xdg ruby-oj ruby-rack-session ruby-rackup ruby3.1-doc ruby3.3-doc shared-mime-info sqlite3 strace wget xdg-user-dirs 
0 packages upgraded, 271 newly installed, 0 to remove and 0 not upgraded.
Need to get 94.0 MB of archives. After unpacking 306 MB will be used.
Writing extended state information...
Get: 1 http://deb.debian.org/debian unstable/main armhf libfftw3-double3 armhf 3.3.10-2+b1 [330 kB]
Get: 2 http://deb.debian.org/debian unstable/main armhf libexpat1 armhf 2.6.4-1 [83.5 kB]
Get: 3 http://deb.debian.org/debian unstable/main armhf libbrotli1 armhf 1.1.0-2+b6 [282 kB]
Get: 4 http://deb.debian.org/debian unstable/main armhf libpng16-16t64 armhf 1.6.46-1 [265 kB]
Get: 5 http://deb.debian.org/debian unstable/main armhf libfreetype6 armhf 2.13.3+dfsg-1 [385 kB]
Get: 6 http://deb.debian.org/debian unstable/main armhf fonts-dejavu-mono all 2.37-8 [489 kB]
Get: 7 http://deb.debian.org/debian unstable/main armhf fonts-dejavu-core all 2.37-8 [840 kB]
Get: 8 http://deb.debian.org/debian unstable/main armhf libfontenc1 armhf 1:1.1.8-1+b2 [20.9 kB]
Get: 9 http://deb.debian.org/debian unstable/main armhf x11-common all 1:7.7+24 [217 kB]
Get: 10 http://deb.debian.org/debian unstable/main armhf xfonts-encodings all 1:1.0.4-2.2 [577 kB]
Get: 11 http://deb.debian.org/debian unstable/main armhf xfonts-utils armhf 1:7.7+7 [84.2 kB]
Get: 12 http://deb.debian.org/debian unstable/main armhf fonts-urw-base35 all 20200910-8 [10.8 MB]
Get: 13 http://deb.debian.org/debian unstable/main armhf fontconfig-config armhf 2.15.0-2 [317 kB]
Get: 14 http://deb.debian.org/debian unstable/main armhf libfontconfig1 armhf 2.15.0-2 [371 kB]
Get: 15 http://deb.debian.org/debian unstable/main armhf libsharpyuv0 armhf 1.5.0-0.1 [114 kB]
Get: 16 http://deb.debian.org/debian unstable/main armhf libdav1d7 armhf 1.5.1-1 [268 kB]
Get: 17 http://deb.debian.org/debian unstable/main armhf libheif-plugin-dav1d armhf 1.19.5-1+b1 [11.2 kB]
Get: 18 http://deb.debian.org/debian unstable/main armhf libde265-0 armhf 1.0.15-1+b2 [145 kB]
Get: 19 http://deb.debian.org/debian unstable/main armhf libheif-plugin-libde265 armhf 1.19.5-1+b1 [14.5 kB]
Get: 20 http://deb.debian.org/debian unstable/main armhf libheif1 armhf 1.19.5-1+b1 [432 kB]
Get: 21 http://deb.debian.org/debian unstable/main armhf libjbig0 armhf 2.1-6.1+b2 [27.3 kB]
Get: 22 http://deb.debian.org/debian unstable/main armhf libjpeg62-turbo armhf 1:2.1.5-3+b1 [145 kB]
Get: 23 http://deb.debian.org/debian unstable/main armhf liblcms2-2 armhf 2.16-2 [131 kB]
Get: 24 http://deb.debian.org/debian unstable/main armhf libffi8 armhf 3.4.6-1 [20.0 kB]
Get: 25 http://deb.debian.org/debian unstable/main armhf libglib2.0-0t64 armhf 2.82.4-2 [1328 kB]
Get: 26 http://deb.debian.org/debian unstable/main armhf liblqr-1-0 armhf 0.4.2-2.1+b2 [23.5 kB]
Get: 27 http://deb.debian.org/debian unstable/main armhf libltdl7 armhf 2.5.4-2.1 [413 kB]
Get: 28 http://deb.debian.org/debian unstable/main armhf libopenjp2-7 armhf 2.5.0-2+b4 [179 kB]
Get: 29 http://deb.debian.org/debian unstable/main armhf libraw23t64 armhf 0.21.3-1+b1 [370 kB]
Get: 30 http://deb.debian.org/debian unstable/main armhf libdeflate0 armhf 1.23-1+b1 [36.7 kB]
Get: 31 http://deb.debian.org/debian unstable/main armhf liblerc4 armhf 4.0.0+ds-5 [146 kB]
Get: 32 http://deb.debian.org/debian unstable/main armhf libwebp7 armhf 1.5.0-0.1 [273 kB]
Get: 33 http://deb.debian.org/debian unstable/main armhf libtiff6 armhf 4.5.1+git230720-5 [302 kB]
Get: 34 http://deb.debian.org/debian unstable/main armhf libwebpdemux2 armhf 1.5.0-0.1 [112 kB]
Get: 35 http://deb.debian.org/debian unstable/main armhf libwebpmux3 armhf 1.5.0-0.1 [123 kB]
Get: 36 http://deb.debian.org/debian unstable/main armhf libxau6 armhf 1:1.0.11-1 [19.7 kB]
Get: 37 http://deb.debian.org/debian unstable/main armhf libxdmcp6 armhf 1:1.1.5-1 [26.4 kB]
Get: 38 http://deb.debian.org/debian unstable/main armhf libxcb1 armhf 1.17.0-2+b1 [140 kB]
Get: 39 http://deb.debian.org/debian unstable/main armhf libx11-data all 2:1.8.10-2 [337 kB]
Get: 40 http://deb.debian.org/debian unstable/main armhf libx11-6 armhf 2:1.8.10-2 [750 kB]
Get: 41 http://deb.debian.org/debian unstable/main armhf libxext6 armhf 2:1.3.4-1+b3 [45.2 kB]
Get: 42 http://deb.debian.org/debian unstable/main armhf libicu72 armhf 72.1-6 [9086 kB]
Get: 43 http://deb.debian.org/debian unstable/main armhf libxml2 armhf 2.12.7+dfsg+really2.9.14-0.2+b1 [605 kB]
Get: 44 http://deb.debian.org/debian unstable/main armhf imagemagick-7-common all 8:7.1.1.43+dfsg1-1 [67.4 kB]
Get: 45 http://deb.debian.org/debian unstable/main armhf libmagickcore-7.q16-10 armhf 8:7.1.1.43+dfsg1-1 [1639 kB]
Get: 46 http://deb.debian.org/debian unstable/main armhf libmagickwand-7.q16-10 armhf 8:7.1.1.43+dfsg1-1 [300 kB]
Get: 47 http://deb.debian.org/debian unstable/main armhf libpython3.13-minimal armhf 3.13.1-3 [844 kB]
Get: 48 http://deb.debian.org/debian unstable/main armhf python3.13-minimal armhf 3.13.1-3 [1840 kB]
Get: 49 http://deb.debian.org/debian unstable/main armhf python3-minimal armhf 3.13.1-2 [27.0 kB]
Get: 50 http://deb.debian.org/debian unstable/main armhf media-types all 10.1.0 [26.9 kB]
Get: 51 http://deb.debian.org/debian unstable/main armhf netbase all 6.4 [12.8 kB]
Get: 52 http://deb.debian.org/debian unstable/main armhf tzdata all 2025a-1 [259 kB]
Get: 53 http://deb.debian.org/debian unstable/main armhf readline-common all 8.2-6 [69.4 kB]
Get: 54 http://deb.debian.org/debian unstable/main armhf libreadline8t64 armhf 8.2-6 [146 kB]
Get: 55 http://deb.debian.org/debian unstable/main armhf libpython3.13-stdlib armhf 3.13.1-3 [1850 kB]
Get: 56 http://deb.debian.org/debian unstable/main armhf python3.13 armhf 3.13.1-3 [740 kB]
Get: 57 http://deb.debian.org/debian unstable/main armhf libpython3-stdlib armhf 3.13.1-2 [9952 B]
Get: 58 http://deb.debian.org/debian unstable/main armhf python3 armhf 3.13.1-2 [28.0 kB]
Get: 59 http://deb.debian.org/debian unstable/main armhf libproc2-0 armhf 2:4.0.4-7 [56.3 kB]
Get: 60 http://deb.debian.org/debian unstable/main armhf procps armhf 2:4.0.4-7 [866 kB]
Get: 61 http://deb.debian.org/debian unstable/main armhf sensible-utils all 0.0.24 [24.8 kB]
Get: 62 http://deb.debian.org/debian unstable/main armhf openssl armhf 3.4.0-2 [1388 kB]
Get: 63 http://deb.debian.org/debian unstable/main armhf ca-certificates all 20241223 [164 kB]
Get: 64 http://deb.debian.org/debian unstable/main armhf libmagic-mgc armhf 1:5.45-3+b1 [314 kB]
Get: 65 http://deb.debian.org/debian unstable/main armhf libmagic1t64 armhf 1:5.45-3+b1 [98.5 kB]
Get: 66 http://deb.debian.org/debian unstable/main armhf file armhf 1:5.45-3+b1 [42.3 kB]
Get: 67 http://deb.debian.org/debian unstable/main armhf gettext-base armhf 0.23.1-1 [238 kB]
Get: 68 http://deb.debian.org/debian unstable/main armhf libuchardet0 armhf 0.0.8-1+b2 [65.6 kB]
Get: 69 http://deb.debian.org/debian unstable/main armhf groff-base armhf 1.23.0-7 [1095 kB]
Get: 70 http://deb.debian.org/debian unstable/main armhf bsdextrautils armhf 2.40.4-2 [84.6 kB]
Get: 71 http://deb.debian.org/debian unstable/main armhf libpipeline1 armhf 1.5.8-1 [35.0 kB]
Get: 72 http://deb.debian.org/debian unstable/main armhf man-db armhf 2.13.0-1 [1382 kB]
Get: 73 http://deb.debian.org/debian unstable/main armhf libtext-charwidth-perl armhf 0.04-11+b4 [9128 B]
Get: 74 http://deb.debian.org/debian unstable/main armhf libtext-wrapi18n-perl all 0.06-10 [8808 B]
Get: 75 http://deb.debian.org/debian unstable/main armhf ucf all 3.0049 [42.5 kB]
Get: 76 http://deb.debian.org/debian unstable/main armhf m4 armhf 1.4.19-5 [272 kB]
Get: 77 http://deb.debian.org/debian unstable/main armhf autoconf all 2.72-3 [493 kB]
Get: 78 http://deb.debian.org/debian unstable/main armhf autotools-dev all 20220109.1 [51.6 kB]
Get: 79 http://deb.debian.org/debian unstable/main armhf automake all 1:1.17-2 [861 kB]
Get: 80 http://deb.debian.org/debian unstable/main armhf autopoint all 0.23.1-1 [770 kB]
Get: 81 http://deb.debian.org/debian unstable/main armhf dbconfig-common all 2.0.24 [592 kB]
Get: 82 http://deb.debian.org/debian unstable/main armhf libdebhelper-perl all 13.24.1 [90.9 kB]
Get: 83 http://deb.debian.org/debian unstable/main armhf libtool all 2.5.4-2.1 [539 kB]
Get: 84 http://deb.debian.org/debian unstable/main armhf dh-autoreconf all 20 [17.1 kB]
Get: 85 http://deb.debian.org/debian unstable/main armhf libarchive-zip-perl all 1.68-1 [104 kB]
Get: 86 http://deb.debian.org/debian unstable/main armhf libfile-stripnondeterminism-perl all 1.14.1-1 [19.6 kB]
Get: 87 http://deb.debian.org/debian unstable/main armhf dh-strip-nondeterminism all 1.14.1-1 [8584 B]
Get: 88 http://deb.debian.org/debian unstable/main armhf libelf1t64 armhf 0.192-4 [184 kB]
Get: 89 http://deb.debian.org/debian unstable/main armhf dwz armhf 0.15-1+b2 [106 kB]
Get: 90 http://deb.debian.org/debian unstable/main armhf libunistring5 armhf 1.3-1 [444 kB]
Get: 91 http://deb.debian.org/debian unstable/main armhf gettext armhf 0.23.1-1 [1560 kB]
Get: 92 http://deb.debian.org/debian unstable/main armhf intltool-debian all 0.35.0+20060710.6 [22.9 kB]
Get: 93 http://deb.debian.org/debian unstable/main armhf po-debconf all 1.0.21+nmu1 [248 kB]
Get: 94 http://deb.debian.org/debian unstable/main armhf debhelper all 13.24.1 [920 kB]
Get: 95 http://deb.debian.org/debian unstable/main armhf libgpg-error0 armhf 1.51-3 [71.9 kB]
Get: 96 http://deb.debian.org/debian unstable/main armhf libassuan9 armhf 3.0.1-2 [53.7 kB]
Get: 97 http://deb.debian.org/debian unstable/main armhf libgcrypt20 armhf 1.11.0-7 [727 kB]
Get: 98 http://deb.debian.org/debian unstable/main armhf gpgconf armhf 2.2.46-1+b1 [105 kB]
Get: 99 http://deb.debian.org/debian unstable/main armhf libidn2-0 armhf 2.3.7-2+b1 [125 kB]
Get: 100 http://deb.debian.org/debian unstable/main armhf libp11-kit0 armhf 0.25.5-3 [385 kB]
Get: 101 http://deb.debian.org/debian unstable/main armhf libtasn1-6 armhf 4.19.0-3+b3 [43.9 kB]
Get: 102 http://deb.debian.org/debian unstable/main armhf libgnutls30t64 armhf 3.8.8-2 [1370 kB]
Get: 103 http://deb.debian.org/debian unstable/main armhf libksba8 armhf 1.6.7-2+b1 [115 kB]
Get: 104 http://deb.debian.org/debian unstable/main armhf libsasl2-modules-db armhf 2.1.28+dfsg1-8+b1 [18.6 kB]
Get: 105 http://deb.debian.org/debian unstable/main armhf libsasl2-2 armhf 2.1.28+dfsg1-8+b1 [50.6 kB]
Get: 106 http://deb.debian.org/debian unstable/main armhf libldap2 armhf 2.6.9+dfsg-1 [167 kB]
Get: 107 http://deb.debian.org/debian unstable/main armhf libnpth0t64 armhf 1.8-2 [21.8 kB]
Get: 108 http://deb.debian.org/debian unstable/main armhf dirmngr armhf 2.2.46-1+b1 [324 kB]
Get: 109 http://deb.debian.org/debian unstable/main armhf gnupg-l10n all 2.2.46-1 [702 kB]
Get: 110 http://deb.debian.org/debian unstable/main armhf gpg armhf 2.2.46-1+b1 [465 kB]
Get: 111 http://deb.debian.org/debian unstable/main armhf pinentry-curses armhf 1.3.1-2 [82.3 kB]
Get: 112 http://deb.debian.org/debian unstable/main armhf gpg-agent armhf 2.2.46-1+b1 [210 kB]
Get: 113 http://deb.debian.org/debian unstable/main armhf gpgsm armhf 2.2.46-1+b1 [219 kB]
Get: 114 http://deb.debian.org/debian unstable/main armhf gnupg all 2.2.46-1 [376 kB]
Get: 115 http://deb.debian.org/debian unstable/main armhf gpgv armhf 2.2.46-1+b1 [186 kB]
Get: 116 http://deb.debian.org/debian unstable/main armhf sopv-gpgv all 0.1.1-1 [10.7 kB]
Get: 117 http://deb.debian.org/debian unstable/main armhf libfile-dirlist-perl all 0.05-3 [7600 B]
Get: 118 http://deb.debian.org/debian unstable/main armhf libfile-which-perl all 1.27-2 [15.1 kB]
Get: 119 http://deb.debian.org/debian unstable/main armhf libfile-homedir-perl all 1.006-2 [42.4 kB]
Get: 120 http://deb.debian.org/debian unstable/main armhf libfile-touch-perl all 0.12-2 [8816 B]
Get: 121 http://deb.debian.org/debian unstable/main armhf libio-pty-perl armhf 1:1.20-1+b2 [33.8 kB]
Get: 122 http://deb.debian.org/debian unstable/main armhf libipc-run-perl all 20231003.0-2 [101 kB]
Get: 123 http://deb.debian.org/debian unstable/main armhf libclass-method-modifiers-perl all 2.15-1 [18.0 kB]
Get: 124 http://deb.debian.org/debian unstable/main armhf libclass-xsaccessor-perl armhf 1.19-4+b4 [35.1 kB]
Get: 125 http://deb.debian.org/debian unstable/main armhf libb-hooks-op-check-perl armhf 0.22-3+b2 [10.3 kB]
Get: 126 http://deb.debian.org/debian unstable/main armhf libdynaloader-functions-perl all 0.004-1 [12.1 kB]
Get: 127 http://deb.debian.org/debian unstable/main armhf libdevel-callchecker-perl armhf 0.009-1+b1 [16.0 kB]
Get: 128 http://deb.debian.org/debian unstable/main armhf libparams-classify-perl armhf 0.015-2+b4 [21.2 kB]
Get: 129 http://deb.debian.org/debian unstable/main armhf libmodule-runtime-perl all 0.016-2 [19.6 kB]
Get: 130 http://deb.debian.org/debian unstable/main armhf libimport-into-perl all 1.002005-2 [11.3 kB]
Get: 131 http://deb.debian.org/debian unstable/main armhf librole-tiny-perl all 2.002004-1 [21.4 kB]
Get: 132 http://deb.debian.org/debian unstable/main armhf libsub-quote-perl all 2.006008-1 [21.8 kB]
Get: 133 http://deb.debian.org/debian unstable/main armhf libmoo-perl all 2.005005-1 [58.0 kB]
Get: 134 http://deb.debian.org/debian unstable/main armhf libencode-locale-perl all 1.05-3 [12.9 kB]
Get: 135 http://deb.debian.org/debian unstable/main armhf libtimedate-perl all 2.3300-2 [39.3 kB]
Get: 136 http://deb.debian.org/debian unstable/main armhf libhttp-date-perl all 6.06-1 [10.7 kB]
Get: 137 http://deb.debian.org/debian unstable/main armhf libfile-listing-perl all 6.16-1 [12.4 kB]
Get: 138 http://deb.debian.org/debian unstable/main armhf libhtml-tagset-perl all 3.24-1 [14.7 kB]
Get: 139 http://deb.debian.org/debian unstable/main armhf liburi-perl all 5.30-1 [105 kB]
Get: 140 http://deb.debian.org/debian unstable/main armhf libhtml-parser-perl armhf 3.83-1+b2 [96.5 kB]
Get: 141 http://deb.debian.org/debian unstable/main armhf libhtml-tree-perl all 5.07-3 [211 kB]
Get: 142 http://deb.debian.org/debian unstable/main armhf libclone-perl armhf 0.47-1+b1 [13.3 kB]
Get: 143 http://deb.debian.org/debian unstable/main armhf libio-html-perl all 1.004-3 [16.2 kB]
Get: 144 http://deb.debian.org/debian unstable/main armhf liblwp-mediatypes-perl all 6.04-2 [20.2 kB]
Get: 145 http://deb.debian.org/debian unstable/main armhf libhttp-message-perl all 7.00-2 [79.8 kB]
Get: 146 http://deb.debian.org/debian unstable/main armhf libhttp-cookies-perl all 6.11-1 [19.1 kB]
Get: 147 http://deb.debian.org/debian unstable/main armhf libhttp-negotiate-perl all 6.01-2 [13.1 kB]
Get: 148 http://deb.debian.org/debian unstable/main armhf perl-openssl-defaults armhf 7+b2 [6708 B]
Get: 149 http://deb.debian.org/debian unstable/main armhf libnet-ssleay-perl armhf 1.94-2 [319 kB]
Get: 150 http://deb.debian.org/debian unstable/main armhf libio-socket-ssl-perl all 2.089-1 [223 kB]
Get: 151 http://deb.debian.org/debian unstable/main armhf libnet-http-perl all 6.23-1 [23.9 kB]
Get: 152 http://deb.debian.org/debian unstable/main armhf liblwp-protocol-https-perl all 6.14-1 [10.8 kB]
Get: 153 http://deb.debian.org/debian unstable/main armhf libtry-tiny-perl all 0.32-1 [22.9 kB]
Get: 154 http://deb.debian.org/debian unstable/main armhf libwww-robotrules-perl all 6.02-1 [12.9 kB]
Get: 155 http://deb.debian.org/debian unstable/main armhf libwww-perl all 6.77-1 [183 kB]
Get: 156 http://deb.debian.org/debian unstable/main armhf patchutils armhf 0.4.2-1 [72.5 kB]
Get: 157 http://deb.debian.org/debian unstable/main armhf wdiff armhf 1.2.2-7 [121 kB]
Get: 158 http://deb.debian.org/debian unstable/main armhf devscripts all 2.25.1 [1053 kB]
Get: 159 http://deb.debian.org/debian unstable/main armhf rubygems-integration all 1.19 [5488 B]
Get: 160 http://deb.debian.org/debian unstable/main armhf ruby-did-you-mean all 1.6.3-2 [20.9 kB]
Get: 161 http://deb.debian.org/debian unstable/main armhf ruby-net-telnet all 0.2.0-1 [13.1 kB]
Get: 162 http://deb.debian.org/debian unstable/main armhf ruby-webrick all 1.8.1-1 [51.4 kB]
Get: 163 http://deb.debian.org/debian unstable/main armhf ruby-xmlrpc all 0.3.3-2 [24.4 kB]
Get: 164 http://deb.debian.org/debian unstable/main armhf libruby armhf 1:3.3~3.1 [5012 B]
Get: 165 http://deb.debian.org/debian unstable/main armhf ruby-sdbm armhf 1.0.0-5+b6 [16.4 kB]
Get: 166 http://deb.debian.org/debian unstable/main armhf libedit2 armhf 3.1-20250104-1 [78.0 kB]
Get: 167 http://deb.debian.org/debian unstable/main armhf libncurses6 armhf 6.5-2+b1 [82.3 kB]
Get: 168 http://deb.debian.org/debian unstable/main armhf libyaml-0-2 armhf 0.2.5-2 [45.4 kB]
Get: 169 http://deb.debian.org/debian unstable/main armhf libruby3.1t64 armhf 3.1.2-8.5 [5134 kB]
Get: 170 http://deb.debian.org/debian unstable/main armhf ruby-minitest all 5.25.4-1 [66.2 kB]
Get: 171 http://deb.debian.org/debian unstable/main armhf ruby-power-assert all 2.0.3-1 [11.8 kB]
Get: 172 http://deb.debian.org/debian unstable/main armhf ruby-test-unit all 3.6.2-1 [79.1 kB]
Get: 173 http://deb.debian.org/debian unstable/main armhf libruby3.3 armhf 3.3.6-1.1 [5989 kB]
Get: 174 http://deb.debian.org/debian unstable/main armhf ruby3.3 armhf 3.3.6-1.1 [820 kB]
Get: 175 http://deb.debian.org/debian unstable/main armhf ruby-rubygems all 3.6.3-1 [406 kB]
Get: 176 http://deb.debian.org/debian unstable/main armhf ruby armhf 1:3.3~3.1 [6112 B]
Get: 177 http://deb.debian.org/debian unstable/main armhf rake all 13.2.1-1 [65.2 kB]
Get: 178 http://deb.debian.org/debian unstable/main armhf gem2deb-test-runner armhf 2.2.5 [17.9 kB]
Get: 179 http://deb.debian.org/debian unstable/main armhf libgmpxx4ldbl armhf 2:6.3.0+dfsg-3 [328 kB]
Get: 180 http://deb.debian.org/debian unstable/main armhf libgmp-dev armhf 2:6.3.0+dfsg-3 [592 kB]
Get: 181 http://deb.debian.org/debian unstable/main armhf ruby3.3-dev armhf 3.3.6-1.1 [1030 kB]
Get: 182 http://deb.debian.org/debian unstable/main armhf ruby3.1 armhf 3.1.2-8.5 [664 kB]
Get: 183 http://deb.debian.org/debian unstable/main armhf ruby3.1-dev armhf 3.1.2-8.5 [1004 kB]
Get: 184 http://deb.debian.org/debian unstable/main armhf ruby-all-dev armhf 1:3.3~3.1 [6108 B]
Get: 185 http://deb.debian.org/debian unstable/main armhf gem2deb armhf 2.2.5 [48.0 kB]
Get: 186 http://deb.debian.org/debian unstable/main armhf gsfonts all 2:20200910-8 [18.6 kB]
Get: 187 http://deb.debian.org/debian unstable/main armhf hicolor-icon-theme all 0.18-2 [11.8 kB]
Get: 188 http://deb.debian.org/debian unstable/main armhf imagemagick-7.q16 armhf 8:7.1.1.43+dfsg1-1 [726 kB]
Get: 189 http://deb.debian.org/debian unstable/main armhf imagemagick armhf 8:7.1.1.43+dfsg1-1 [20.0 kB]
Get: 190 http://deb.debian.org/debian unstable/main armhf libjs-jquery all 3.6.1+dfsg+~3.5.14-1 [326 kB]
Get: 191 http://deb.debian.org/debian unstable/main armhf libxslt1.1 armhf 1.1.35-1.1+b1 [212 kB]
Get: 192 http://deb.debian.org/debian unstable/main armhf publicsuffix all 20250108.1153-0.1 [292 kB]
Get: 193 http://deb.debian.org/debian unstable/main armhf racc all 1.8.1-1 [75.4 kB]
Get: 194 http://deb.debian.org/debian unstable/main armhf ruby-concurrent all 1.3.4-1~exp1 [291 kB]
Get: 195 http://deb.debian.org/debian unstable/main armhf ruby-i18n all 1.14.5-1 [41.4 kB]
Get: 196 http://deb.debian.org/debian unstable/main armhf ruby-tzinfo all 2.0.6-1 [66.7 kB]
Get: 197 http://deb.debian.org/debian unstable/main armhf ruby-zeitwerk all 2.6.8-1 [43.0 kB]
Get: 198 http://deb.debian.org/debian unstable/main armhf ruby-activesupport all 2:6.1.7.3+dfsg-7 [202 kB]
Get: 199 http://deb.debian.org/debian unstable/main armhf ruby-builder all 3.2.4-2 [19.7 kB]
Get: 200 http://deb.debian.org/debian unstable/main armhf ruby-erubi all 1.12.0-1 [10.6 kB]
Get: 201 http://deb.debian.org/debian unstable/main armhf ruby-mini-portile2 all 2.8.7-1 [21.3 kB]
Get: 202 http://deb.debian.org/debian unstable/main armhf ruby-pkg-config all 1.5.9-1 [8584 B]
Get: 203 http://deb.debian.org/debian unstable/main armhf ruby-nokogiri armhf 1.16.4+dfsg-1+b1 [266 kB]
Get: 204 http://deb.debian.org/debian unstable/main armhf ruby-rails-dom-testing all 2.2.0-1 [11.6 kB]
Get: 205 http://deb.debian.org/debian unstable/main armhf ruby-crass all 1.0.6-1 [17.1 kB]
Get: 206 http://deb.debian.org/debian unstable/main armhf ruby-loofah all 2.22.0-1 [31.6 kB]
Get: 207 http://deb.debian.org/debian unstable/main armhf ruby-rails-html-sanitizer all 1.4.4-1 [11.0 kB]
Get: 208 http://deb.debian.org/debian unstable/main armhf ruby-actionview all 2:6.1.7.3+dfsg-7 [153 kB]
Get: 209 http://deb.debian.org/debian unstable/main armhf ruby-rack all 3.0.8-2 [93.5 kB]
Get: 210 http://deb.debian.org/debian unstable/main armhf ruby-rack-test all 2.2.0-1 [20.4 kB]
Get: 211 http://deb.debian.org/debian unstable/main armhf ruby-actionpack all 2:6.1.7.3+dfsg-7 [204 kB]
Get: 212 http://deb.debian.org/debian unstable/main armhf ruby-nio4r armhf 2.7.3-1+b1 [115 kB]
Get: 213 http://deb.debian.org/debian unstable/main armhf ruby-websocket-extensions all 0.1.5-2 [9804 B]
Get: 214 http://deb.debian.org/debian unstable/main armhf ruby-websocket-driver armhf 0.6.3-3+b7 [23.2 kB]
Get: 215 http://deb.debian.org/debian unstable/main armhf ruby-actioncable all 2:6.1.7.3+dfsg-7 [57.5 kB]
Get: 216 http://deb.debian.org/debian unstable/main armhf ruby-globalid all 1.2.1-1 [15.1 kB]
Get: 217 http://deb.debian.org/debian unstable/main armhf ruby-activejob all 2:6.1.7.3+dfsg-7 [44.9 kB]
Get: 218 http://deb.debian.org/debian unstable/main armhf ruby-activemodel all 2:6.1.7.3+dfsg-7 [70.2 kB]
Get: 219 http://deb.debian.org/debian unstable/main armhf ruby-activerecord all 2:6.1.7.3+dfsg-7 [365 kB]
Get: 220 http://deb.debian.org/debian unstable/main armhf ruby-marcel all 1.0.4+dfsg-1 [35.9 kB]
Get: 221 http://deb.debian.org/debian unstable/main armhf ruby-mini-mime all 1.1.5-1 [19.7 kB]
Get: 222 http://deb.debian.org/debian unstable/main armhf ruby-activestorage all 2:6.1.7.3+dfsg-7 [63.1 kB]
Get: 223 http://deb.debian.org/debian unstable/main armhf ruby-mail all 2.8.1+dfsg1-2 [242 kB]
Get: 224 http://deb.debian.org/debian unstable/main armhf ruby-actionmailbox all 2:6.1.7.3+dfsg-7 [36.9 kB]
Get: 225 http://deb.debian.org/debian unstable/main armhf ruby-actionmailer all 2:6.1.7.3+dfsg-7 [42.7 kB]
Get: 226 http://deb.debian.org/debian unstable/main armhf ruby-actionpack-action-caching all 1.2.2-1 [10.1 kB]
Get: 227 http://deb.debian.org/debian unstable/main armhf ruby-method-source all 1.0.0-3 [8596 B]
Get: 228 http://deb.debian.org/debian unstable/main armhf ruby-thor all 1.3.2-1 [49.3 kB]
Get: 229 http://deb.debian.org/debian unstable/main armhf ruby-railties all 2:6.1.7.3+dfsg-7 [453 kB]
Get: 230 http://deb.debian.org/debian unstable/main armhf ruby-actionpack-xml-parser all 2.0.1-4 [4968 B]
Get: 231 http://deb.debian.org/debian unstable/main armhf ruby-actiontext all 2:6.1.7.3+dfsg-7 [33.0 kB]
Get: 232 http://deb.debian.org/debian unstable/main armhf ruby-public-suffix all 4.0.6+ds-2 [16.6 kB]
Get: 233 http://deb.debian.org/debian unstable/main armhf ruby-addressable all 2.8.5-1 [53.0 kB]
Get: 234 http://deb.debian.org/debian unstable/main armhf ruby-bundler all 2.6.3-1 [427 kB]
Get: 235 http://deb.debian.org/debian unstable/main armhf ruby-chunky-png all 1.4.0-1 [48.6 kB]
Get: 236 http://deb.debian.org/debian unstable/main armhf ruby-coderay all 1.1.3-8 [78.1 kB]
Get: 237 http://deb.debian.org/debian unstable/main armhf ruby-enum all 0.9.0+ds-1 [8936 B]
Get: 238 http://deb.debian.org/debian unstable/main armhf ruby-commonmarker armhf 0.23.10-1+b2 [125 kB]
Get: 239 http://deb.debian.org/debian unstable/main armhf ruby-css-parser all 1.19.0-1 [22.8 kB]
Get: 240 http://deb.debian.org/debian unstable/main armhf ruby-hike all 1.2.1-3.1 [7488 B]
Get: 241 http://deb.debian.org/debian unstable/main armhf ruby-html-pipeline all 2.14.3-2 [33.1 kB]
Get: 242 http://deb.debian.org/debian unstable/main armhf ruby-htmlentities all 4.3.3-1.1 [23.4 kB]
Get: 243 http://deb.debian.org/debian unstable/main armhf ruby-jquery-rails all 4.3.5-4 [204 kB]
Get: 244 http://deb.debian.org/debian unstable/main armhf ruby-metaclass all 0.0.4-1.1 [3852 B]
Get: 245 http://deb.debian.org/debian unstable/main armhf ruby-posix-spawn armhf 0.3.15-3+b1 [25.9 kB]
Get: 246 http://deb.debian.org/debian unstable/main armhf ruby-mini-magick all 4.13.1-2 [24.2 kB]
Get: 247 http://deb.debian.org/debian unstable/main armhf ruby-mocha all 1.16.1-3 [158 kB]
Get: 248 http://deb.debian.org/debian unstable/main armhf ruby-multi-json all 1.14.1-2 [20.4 kB]
Get: 249 http://deb.debian.org/debian unstable/main armhf ruby-net-ldap all 0.19.0-1 [59.5 kB]
Get: 250 http://deb.debian.org/debian unstable/main armhf ruby-tilt all 2.4.0-3 [32.2 kB]
Get: 251 http://deb.debian.org/debian unstable/main armhf ruby-sprockets all 4.2.1-3 [74.1 kB]
Get: 252 http://deb.debian.org/debian unstable/main armhf ruby-sprockets-rails all 3.5.2-1 [15.0 kB]
Get: 253 http://deb.debian.org/debian unstable/main armhf ruby-rails all 2:6.1.7.3+dfsg-7 [26.0 kB]
Get: 254 http://deb.debian.org/debian unstable/main armhf ruby-rails-observers all 0.1.5-1.1 [14.0 kB]
Get: 255 http://deb.debian.org/debian unstable/main armhf ruby-rbpdf-font all 1.21.3+dfsg-1 [8618 kB]
Get: 256 http://deb.debian.org/debian unstable/main armhf ruby-rbpdf all 1.21.3+dfsg-1 [126 kB]
Get: 257 http://deb.debian.org/debian unstable/main armhf ruby-redcarpet armhf 3.6.0-1+b4 [51.1 kB]
Get: 258 http://deb.debian.org/debian unstable/main armhf ruby-request-store all 1.5.1-1 [6620 B]
Get: 259 http://deb.debian.org/debian unstable/main armhf ruby-rmagick armhf 6.0.1-2+b2 [222 kB]
Get: 260 http://deb.debian.org/debian unstable/main armhf ruby-roadie all 5.2.1-2 [35.6 kB]
Get: 261 http://deb.debian.org/debian unstable/main armhf ruby-roadie-rails all 3.0.0-1 [13.3 kB]
Get: 262 http://deb.debian.org/debian unstable/main armhf ruby-rotp all 6.2.0-2 [38.8 kB]
Get: 263 http://deb.debian.org/debian unstable/main armhf ruby-rouge all 4.5.1-1 [475 kB]
Get: 264 http://deb.debian.org/debian unstable/main armhf ruby-rqrcode-core all 1.2.0-2 [14.8 kB]
Get: 265 http://deb.debian.org/debian unstable/main armhf ruby-rqrcode all 2.2.0-1 [101 kB]
Get: 266 http://deb.debian.org/debian unstable/main armhf ruby-sanitize all 6.0.2-2 [34.7 kB]
Get: 267 http://deb.debian.org/debian unstable/main armhf ruby-sqlite3 armhf 1.6.9-2+b1 [52.6 kB]
Get: 268 http://deb.debian.org/debian unstable/main armhf ruby-task-list all 2.3.2-2 [10.9 kB]
Get: 269 http://deb.debian.org/debian unstable/main armhf unzip armhf 6.0-28 [152 kB]
Get: 270 http://deb.debian.org/debian unstable/main armhf zip armhf 3.0-14 [221 kB]
Get: 271 http://deb.debian.org/debian unstable/main armhf ruby-zip all 2.3.2-1 [45.6 kB]
Fetched 94.0 MB in 2s (38.5 MB/s)
Preconfiguring packages ...
Selecting previously unselected package libfftw3-double3:armhf.
(Reading database ... 
(Reading database ... 5%
(Reading database ... 10%
(Reading database ... 15%
(Reading database ... 20%
(Reading database ... 25%
(Reading database ... 30%
(Reading database ... 35%
(Reading database ... 40%
(Reading database ... 45%
(Reading database ... 50%
(Reading database ... 55%
(Reading database ... 60%
(Reading database ... 65%
(Reading database ... 70%
(Reading database ... 75%
(Reading database ... 80%
(Reading database ... 85%
(Reading database ... 90%
(Reading database ... 95%
(Reading database ... 100%
(Reading database ... 19568 files and directories currently installed.)
Preparing to unpack .../00-libfftw3-double3_3.3.10-2+b1_armhf.deb ...
Unpacking libfftw3-double3:armhf (3.3.10-2+b1) ...
Selecting previously unselected package libexpat1:armhf.
Preparing to unpack .../01-libexpat1_2.6.4-1_armhf.deb ...
Unpacking libexpat1:armhf (2.6.4-1) ...
Selecting previously unselected package libbrotli1:armhf.
Preparing to unpack .../02-libbrotli1_1.1.0-2+b6_armhf.deb ...
Unpacking libbrotli1:armhf (1.1.0-2+b6) ...
Selecting previously unselected package libpng16-16t64:armhf.
Preparing to unpack .../03-libpng16-16t64_1.6.46-1_armhf.deb ...
Unpacking libpng16-16t64:armhf (1.6.46-1) ...
Selecting previously unselected package libfreetype6:armhf.
Preparing to unpack .../04-libfreetype6_2.13.3+dfsg-1_armhf.deb ...
Unpacking libfreetype6:armhf (2.13.3+dfsg-1) ...
Selecting previously unselected package fonts-dejavu-mono.
Preparing to unpack .../05-fonts-dejavu-mono_2.37-8_all.deb ...
Unpacking fonts-dejavu-mono (2.37-8) ...
Selecting previously unselected package fonts-dejavu-core.
Preparing to unpack .../06-fonts-dejavu-core_2.37-8_all.deb ...
Unpacking fonts-dejavu-core (2.37-8) ...
Selecting previously unselected package libfontenc1:armhf.
Preparing to unpack .../07-libfontenc1_1%3a1.1.8-1+b2_armhf.deb ...
Unpacking libfontenc1:armhf (1:1.1.8-1+b2) ...
Selecting previously unselected package x11-common.
Preparing to unpack .../08-x11-common_1%3a7.7+24_all.deb ...
Unpacking x11-common (1:7.7+24) ...
Selecting previously unselected package xfonts-encodings.
Preparing to unpack .../09-xfonts-encodings_1%3a1.0.4-2.2_all.deb ...
Unpacking xfonts-encodings (1:1.0.4-2.2) ...
Selecting previously unselected package xfonts-utils.
Preparing to unpack .../10-xfonts-utils_1%3a7.7+7_armhf.deb ...
Unpacking xfonts-utils (1:7.7+7) ...
Selecting previously unselected package fonts-urw-base35.
Preparing to unpack .../11-fonts-urw-base35_20200910-8_all.deb ...
Unpacking fonts-urw-base35 (20200910-8) ...
Selecting previously unselected package fontconfig-config.
Preparing to unpack .../12-fontconfig-config_2.15.0-2_armhf.deb ...
Unpacking fontconfig-config (2.15.0-2) ...
Selecting previously unselected package libfontconfig1:armhf.
Preparing to unpack .../13-libfontconfig1_2.15.0-2_armhf.deb ...
Unpacking libfontconfig1:armhf (2.15.0-2) ...
Selecting previously unselected package libsharpyuv0:armhf.
Preparing to unpack .../14-libsharpyuv0_1.5.0-0.1_armhf.deb ...
Unpacking libsharpyuv0:armhf (1.5.0-0.1) ...
Selecting previously unselected package libdav1d7:armhf.
Preparing to unpack .../15-libdav1d7_1.5.1-1_armhf.deb ...
Unpacking libdav1d7:armhf (1.5.1-1) ...
Selecting previously unselected package libheif-plugin-dav1d:armhf.
Preparing to unpack .../16-libheif-plugin-dav1d_1.19.5-1+b1_armhf.deb ...
Unpacking libheif-plugin-dav1d:armhf (1.19.5-1+b1) ...
Selecting previously unselected package libde265-0:armhf.
Preparing to unpack .../17-libde265-0_1.0.15-1+b2_armhf.deb ...
Unpacking libde265-0:armhf (1.0.15-1+b2) ...
Selecting previously unselected package libheif-plugin-libde265:armhf.
Preparing to unpack .../18-libheif-plugin-libde265_1.19.5-1+b1_armhf.deb ...
Unpacking libheif-plugin-libde265:armhf (1.19.5-1+b1) ...
Selecting previously unselected package libheif1:armhf.
Preparing to unpack .../19-libheif1_1.19.5-1+b1_armhf.deb ...
Unpacking libheif1:armhf (1.19.5-1+b1) ...
Selecting previously unselected package libjbig0:armhf.
Preparing to unpack .../20-libjbig0_2.1-6.1+b2_armhf.deb ...
Unpacking libjbig0:armhf (2.1-6.1+b2) ...
Selecting previously unselected package libjpeg62-turbo:armhf.
Preparing to unpack .../21-libjpeg62-turbo_1%3a2.1.5-3+b1_armhf.deb ...
Unpacking libjpeg62-turbo:armhf (1:2.1.5-3+b1) ...
Selecting previously unselected package liblcms2-2:armhf.
Preparing to unpack .../22-liblcms2-2_2.16-2_armhf.deb ...
Unpacking liblcms2-2:armhf (2.16-2) ...
Selecting previously unselected package libffi8:armhf.
Preparing to unpack .../23-libffi8_3.4.6-1_armhf.deb ...
Unpacking libffi8:armhf (3.4.6-1) ...
Selecting previously unselected package libglib2.0-0t64:armhf.
Preparing to unpack .../24-libglib2.0-0t64_2.82.4-2_armhf.deb ...
Unpacking libglib2.0-0t64:armhf (2.82.4-2) ...
Selecting previously unselected package liblqr-1-0:armhf.
Preparing to unpack .../25-liblqr-1-0_0.4.2-2.1+b2_armhf.deb ...
Unpacking liblqr-1-0:armhf (0.4.2-2.1+b2) ...
Selecting previously unselected package libltdl7:armhf.
Preparing to unpack .../26-libltdl7_2.5.4-2.1_armhf.deb ...
Unpacking libltdl7:armhf (2.5.4-2.1) ...
Selecting previously unselected package libopenjp2-7:armhf.
Preparing to unpack .../27-libopenjp2-7_2.5.0-2+b4_armhf.deb ...
Unpacking libopenjp2-7:armhf (2.5.0-2+b4) ...
Selecting previously unselected package libraw23t64:armhf.
Preparing to unpack .../28-libraw23t64_0.21.3-1+b1_armhf.deb ...
Unpacking libraw23t64:armhf (0.21.3-1+b1) ...
Selecting previously unselected package libdeflate0:armhf.
Preparing to unpack .../29-libdeflate0_1.23-1+b1_armhf.deb ...
Unpacking libdeflate0:armhf (1.23-1+b1) ...
Selecting previously unselected package liblerc4:armhf.
Preparing to unpack .../30-liblerc4_4.0.0+ds-5_armhf.deb ...
Unpacking liblerc4:armhf (4.0.0+ds-5) ...
Selecting previously unselected package libwebp7:armhf.
Preparing to unpack .../31-libwebp7_1.5.0-0.1_armhf.deb ...
Unpacking libwebp7:armhf (1.5.0-0.1) ...
Selecting previously unselected package libtiff6:armhf.
Preparing to unpack .../32-libtiff6_4.5.1+git230720-5_armhf.deb ...
Unpacking libtiff6:armhf (4.5.1+git230720-5) ...
Selecting previously unselected package libwebpdemux2:armhf.
Preparing to unpack .../33-libwebpdemux2_1.5.0-0.1_armhf.deb ...
Unpacking libwebpdemux2:armhf (1.5.0-0.1) ...
Selecting previously unselected package libwebpmux3:armhf.
Preparing to unpack .../34-libwebpmux3_1.5.0-0.1_armhf.deb ...
Unpacking libwebpmux3:armhf (1.5.0-0.1) ...
Selecting previously unselected package libxau6:armhf.
Preparing to unpack .../35-libxau6_1%3a1.0.11-1_armhf.deb ...
Unpacking libxau6:armhf (1:1.0.11-1) ...
Selecting previously unselected package libxdmcp6:armhf.
Preparing to unpack .../36-libxdmcp6_1%3a1.1.5-1_armhf.deb ...
Unpacking libxdmcp6:armhf (1:1.1.5-1) ...
Selecting previously unselected package libxcb1:armhf.
Preparing to unpack .../37-libxcb1_1.17.0-2+b1_armhf.deb ...
Unpacking libxcb1:armhf (1.17.0-2+b1) ...
Selecting previously unselected package libx11-data.
Preparing to unpack .../38-libx11-data_2%3a1.8.10-2_all.deb ...
Unpacking libx11-data (2:1.8.10-2) ...
Selecting previously unselected package libx11-6:armhf.
Preparing to unpack .../39-libx11-6_2%3a1.8.10-2_armhf.deb ...
Unpacking libx11-6:armhf (2:1.8.10-2) ...
Selecting previously unselected package libxext6:armhf.
Preparing to unpack .../40-libxext6_2%3a1.3.4-1+b3_armhf.deb ...
Unpacking libxext6:armhf (2:1.3.4-1+b3) ...
Selecting previously unselected package libicu72:armhf.
Preparing to unpack .../41-libicu72_72.1-6_armhf.deb ...
Unpacking libicu72:armhf (72.1-6) ...
Selecting previously unselected package libxml2:armhf.
Preparing to unpack .../42-libxml2_2.12.7+dfsg+really2.9.14-0.2+b1_armhf.deb ...
Unpacking libxml2:armhf (2.12.7+dfsg+really2.9.14-0.2+b1) ...
Selecting previously unselected package imagemagick-7-common.
Preparing to unpack .../43-imagemagick-7-common_8%3a7.1.1.43+dfsg1-1_all.deb ...
Unpacking imagemagick-7-common (8:7.1.1.43+dfsg1-1) ...
Selecting previously unselected package libmagickcore-7.q16-10:armhf.
Preparing to unpack .../44-libmagickcore-7.q16-10_8%3a7.1.1.43+dfsg1-1_armhf.deb ...
Unpacking libmagickcore-7.q16-10:armhf (8:7.1.1.43+dfsg1-1) ...
Selecting previously unselected package libmagickwand-7.q16-10:armhf.
Preparing to unpack .../45-libmagickwand-7.q16-10_8%3a7.1.1.43+dfsg1-1_armhf.deb ...
Unpacking libmagickwand-7.q16-10:armhf (8:7.1.1.43+dfsg1-1) ...
Selecting previously unselected package libpython3.13-minimal:armhf.
Preparing to unpack .../46-libpython3.13-minimal_3.13.1-3_armhf.deb ...
Unpacking libpython3.13-minimal:armhf (3.13.1-3) ...
Selecting previously unselected package python3.13-minimal.
Preparing to unpack .../47-python3.13-minimal_3.13.1-3_armhf.deb ...
Unpacking python3.13-minimal (3.13.1-3) ...
Setting up libpython3.13-minimal:armhf (3.13.1-3) ...
Setting up libexpat1:armhf (2.6.4-1) ...
Setting up python3.13-minimal (3.13.1-3) ...
Selecting previously unselected package python3-minimal.
(Reading database ... 
(Reading database ... 5%
(Reading database ... 10%
(Reading database ... 15%
(Reading database ... 20%
(Reading database ... 25%
(Reading database ... 30%
(Reading database ... 35%
(Reading database ... 40%
(Reading database ... 45%
(Reading database ... 50%
(Reading database ... 55%
(Reading database ... 60%
(Reading database ... 65%
(Reading database ... 70%
(Reading database ... 75%
(Reading database ... 80%
(Reading database ... 85%
(Reading database ... 90%
(Reading database ... 95%
(Reading database ... 100%
(Reading database ... 21188 files and directories currently installed.)
Preparing to unpack .../0-python3-minimal_3.13.1-2_armhf.deb ...
Unpacking python3-minimal (3.13.1-2) ...
Selecting previously unselected package media-types.
Preparing to unpack .../1-media-types_10.1.0_all.deb ...
Unpacking media-types (10.1.0) ...
Selecting previously unselected package netbase.
Preparing to unpack .../2-netbase_6.4_all.deb ...
Unpacking netbase (6.4) ...
Selecting previously unselected package tzdata.
Preparing to unpack .../3-tzdata_2025a-1_all.deb ...
Unpacking tzdata (2025a-1) ...
Selecting previously unselected package readline-common.
Preparing to unpack .../4-readline-common_8.2-6_all.deb ...
Unpacking readline-common (8.2-6) ...
Selecting previously unselected package libreadline8t64:armhf.
Preparing to unpack .../5-libreadline8t64_8.2-6_armhf.deb ...
Adding 'diversion of /lib/arm-linux-gnueabihf/libhistory.so.8 to /lib/arm-linux-gnueabihf/libhistory.so.8.usr-is-merged by libreadline8t64'
Adding 'diversion of /lib/arm-linux-gnueabihf/libhistory.so.8.2 to /lib/arm-linux-gnueabihf/libhistory.so.8.2.usr-is-merged by libreadline8t64'
Adding 'diversion of /lib/arm-linux-gnueabihf/libreadline.so.8 to /lib/arm-linux-gnueabihf/libreadline.so.8.usr-is-merged by libreadline8t64'
Adding 'diversion of /lib/arm-linux-gnueabihf/libreadline.so.8.2 to /lib/arm-linux-gnueabihf/libreadline.so.8.2.usr-is-merged by libreadline8t64'
Unpacking libreadline8t64:armhf (8.2-6) ...
Selecting previously unselected package libpython3.13-stdlib:armhf.
Preparing to unpack .../6-libpython3.13-stdlib_3.13.1-3_armhf.deb ...
Unpacking libpython3.13-stdlib:armhf (3.13.1-3) ...
Selecting previously unselected package python3.13.
Preparing to unpack .../7-python3.13_3.13.1-3_armhf.deb ...
Unpacking python3.13 (3.13.1-3) ...
Selecting previously unselected package libpython3-stdlib:armhf.
Preparing to unpack .../8-libpython3-stdlib_3.13.1-2_armhf.deb ...
Unpacking libpython3-stdlib:armhf (3.13.1-2) ...
Setting up python3-minimal (3.13.1-2) ...
Selecting previously unselected package python3.
(Reading database ... 
(Reading database ... 5%
(Reading database ... 10%
(Reading database ... 15%
(Reading database ... 20%
(Reading database ... 25%
(Reading database ... 30%
(Reading database ... 35%
(Reading database ... 40%
(Reading database ... 45%
(Reading database ... 50%
(Reading database ... 55%
(Reading database ... 60%
(Reading database ... 65%
(Reading database ... 70%
(Reading database ... 75%
(Reading database ... 80%
(Reading database ... 85%
(Reading database ... 90%
(Reading database ... 95%
(Reading database ... 100%
(Reading database ... 22193 files and directories currently installed.)
Preparing to unpack .../000-python3_3.13.1-2_armhf.deb ...
Unpacking python3 (3.13.1-2) ...
Selecting previously unselected package libproc2-0:armhf.
Preparing to unpack .../001-libproc2-0_2%3a4.0.4-7_armhf.deb ...
Unpacking libproc2-0:armhf (2:4.0.4-7) ...
Selecting previously unselected package procps.
Preparing to unpack .../002-procps_2%3a4.0.4-7_armhf.deb ...
Unpacking procps (2:4.0.4-7) ...
Selecting previously unselected package sensible-utils.
Preparing to unpack .../003-sensible-utils_0.0.24_all.deb ...
Unpacking sensible-utils (0.0.24) ...
Selecting previously unselected package openssl.
Preparing to unpack .../004-openssl_3.4.0-2_armhf.deb ...
Unpacking openssl (3.4.0-2) ...
Selecting previously unselected package ca-certificates.
Preparing to unpack .../005-ca-certificates_20241223_all.deb ...
Unpacking ca-certificates (20241223) ...
Selecting previously unselected package libmagic-mgc.
Preparing to unpack .../006-libmagic-mgc_1%3a5.45-3+b1_armhf.deb ...
Unpacking libmagic-mgc (1:5.45-3+b1) ...
Selecting previously unselected package libmagic1t64:armhf.
Preparing to unpack .../007-libmagic1t64_1%3a5.45-3+b1_armhf.deb ...
Unpacking libmagic1t64:armhf (1:5.45-3+b1) ...
Selecting previously unselected package file.
Preparing to unpack .../008-file_1%3a5.45-3+b1_armhf.deb ...
Unpacking file (1:5.45-3+b1) ...
Selecting previously unselected package gettext-base.
Preparing to unpack .../009-gettext-base_0.23.1-1_armhf.deb ...
Unpacking gettext-base (0.23.1-1) ...
Selecting previously unselected package libuchardet0:armhf.
Preparing to unpack .../010-libuchardet0_0.0.8-1+b2_armhf.deb ...
Unpacking libuchardet0:armhf (0.0.8-1+b2) ...
Selecting previously unselected package groff-base.
Preparing to unpack .../011-groff-base_1.23.0-7_armhf.deb ...
Unpacking groff-base (1.23.0-7) ...
Selecting previously unselected package bsdextrautils.
Preparing to unpack .../012-bsdextrautils_2.40.4-2_armhf.deb ...
Unpacking bsdextrautils (2.40.4-2) ...
Selecting previously unselected package libpipeline1:armhf.
Preparing to unpack .../013-libpipeline1_1.5.8-1_armhf.deb ...
Unpacking libpipeline1:armhf (1.5.8-1) ...
Selecting previously unselected package man-db.
Preparing to unpack .../014-man-db_2.13.0-1_armhf.deb ...
Unpacking man-db (2.13.0-1) ...
Selecting previously unselected package libtext-charwidth-perl:armhf.
Preparing to unpack .../015-libtext-charwidth-perl_0.04-11+b4_armhf.deb ...
Unpacking libtext-charwidth-perl:armhf (0.04-11+b4) ...
Selecting previously unselected package libtext-wrapi18n-perl.
Preparing to unpack .../016-libtext-wrapi18n-perl_0.06-10_all.deb ...
Unpacking libtext-wrapi18n-perl (0.06-10) ...
Selecting previously unselected package ucf.
Preparing to unpack .../017-ucf_3.0049_all.deb ...
Moving old data out of the way
Unpacking ucf (3.0049) ...
Selecting previously unselected package m4.
Preparing to unpack .../018-m4_1.4.19-5_armhf.deb ...
Unpacking m4 (1.4.19-5) ...
Selecting previously unselected package autoconf.
Preparing to unpack .../019-autoconf_2.72-3_all.deb ...
Unpacking autoconf (2.72-3) ...
Selecting previously unselected package autotools-dev.
Preparing to unpack .../020-autotools-dev_20220109.1_all.deb ...
Unpacking autotools-dev (20220109.1) ...
Selecting previously unselected package automake.
Preparing to unpack .../021-automake_1%3a1.17-2_all.deb ...
Unpacking automake (1:1.17-2) ...
Selecting previously unselected package autopoint.
Preparing to unpack .../022-autopoint_0.23.1-1_all.deb ...
Unpacking autopoint (0.23.1-1) ...
Selecting previously unselected package dbconfig-common.
Preparing to unpack .../023-dbconfig-common_2.0.24_all.deb ...
Unpacking dbconfig-common (2.0.24) ...
Selecting previously unselected package libdebhelper-perl.
Preparing to unpack .../024-libdebhelper-perl_13.24.1_all.deb ...
Unpacking libdebhelper-perl (13.24.1) ...
Selecting previously unselected package libtool.
Preparing to unpack .../025-libtool_2.5.4-2.1_all.deb ...
Unpacking libtool (2.5.4-2.1) ...
Selecting previously unselected package dh-autoreconf.
Preparing to unpack .../026-dh-autoreconf_20_all.deb ...
Unpacking dh-autoreconf (20) ...
Selecting previously unselected package libarchive-zip-perl.
Preparing to unpack .../027-libarchive-zip-perl_1.68-1_all.deb ...
Unpacking libarchive-zip-perl (1.68-1) ...
Selecting previously unselected package libfile-stripnondeterminism-perl.
Preparing to unpack .../028-libfile-stripnondeterminism-perl_1.14.1-1_all.deb ...
Unpacking libfile-stripnondeterminism-perl (1.14.1-1) ...
Selecting previously unselected package dh-strip-nondeterminism.
Preparing to unpack .../029-dh-strip-nondeterminism_1.14.1-1_all.deb ...
Unpacking dh-strip-nondeterminism (1.14.1-1) ...
Selecting previously unselected package libelf1t64:armhf.
Preparing to unpack .../030-libelf1t64_0.192-4_armhf.deb ...
Unpacking libelf1t64:armhf (0.192-4) ...
Selecting previously unselected package dwz.
Preparing to unpack .../031-dwz_0.15-1+b2_armhf.deb ...
Unpacking dwz (0.15-1+b2) ...
Selecting previously unselected package libunistring5:armhf.
Preparing to unpack .../032-libunistring5_1.3-1_armhf.deb ...
Unpacking libunistring5:armhf (1.3-1) ...
Selecting previously unselected package gettext.
Preparing to unpack .../033-gettext_0.23.1-1_armhf.deb ...
Unpacking gettext (0.23.1-1) ...
Selecting previously unselected package intltool-debian.
Preparing to unpack .../034-intltool-debian_0.35.0+20060710.6_all.deb ...
Unpacking intltool-debian (0.35.0+20060710.6) ...
Selecting previously unselected package po-debconf.
Preparing to unpack .../035-po-debconf_1.0.21+nmu1_all.deb ...
Unpacking po-debconf (1.0.21+nmu1) ...
Selecting previously unselected package debhelper.
Preparing to unpack .../036-debhelper_13.24.1_all.deb ...
Unpacking debhelper (13.24.1) ...
Selecting previously unselected package libgpg-error0:armhf.
Preparing to unpack .../037-libgpg-error0_1.51-3_armhf.deb ...
Unpacking libgpg-error0:armhf (1.51-3) ...
Selecting previously unselected package libassuan9:armhf.
Preparing to unpack .../038-libassuan9_3.0.1-2_armhf.deb ...
Unpacking libassuan9:armhf (3.0.1-2) ...
Selecting previously unselected package libgcrypt20:armhf.
Preparing to unpack .../039-libgcrypt20_1.11.0-7_armhf.deb ...
Unpacking libgcrypt20:armhf (1.11.0-7) ...
Selecting previously unselected package gpgconf.
Preparing to unpack .../040-gpgconf_2.2.46-1+b1_armhf.deb ...
Unpacking gpgconf (2.2.46-1+b1) ...
Selecting previously unselected package libidn2-0:armhf.
Preparing to unpack .../041-libidn2-0_2.3.7-2+b1_armhf.deb ...
Unpacking libidn2-0:armhf (2.3.7-2+b1) ...
Selecting previously unselected package libp11-kit0:armhf.
Preparing to unpack .../042-libp11-kit0_0.25.5-3_armhf.deb ...
Unpacking libp11-kit0:armhf (0.25.5-3) ...
Selecting previously unselected package libtasn1-6:armhf.
Preparing to unpack .../043-libtasn1-6_4.19.0-3+b3_armhf.deb ...
Unpacking libtasn1-6:armhf (4.19.0-3+b3) ...
Selecting previously unselected package libgnutls30t64:armhf.
Preparing to unpack .../044-libgnutls30t64_3.8.8-2_armhf.deb ...
Unpacking libgnutls30t64:armhf (3.8.8-2) ...
Selecting previously unselected package libksba8:armhf.
Preparing to unpack .../045-libksba8_1.6.7-2+b1_armhf.deb ...
Unpacking libksba8:armhf (1.6.7-2+b1) ...
Selecting previously unselected package libsasl2-modules-db:armhf.
Preparing to unpack .../046-libsasl2-modules-db_2.1.28+dfsg1-8+b1_armhf.deb ...
Unpacking libsasl2-modules-db:armhf (2.1.28+dfsg1-8+b1) ...
Selecting previously unselected package libsasl2-2:armhf.
Preparing to unpack .../047-libsasl2-2_2.1.28+dfsg1-8+b1_armhf.deb ...
Unpacking libsasl2-2:armhf (2.1.28+dfsg1-8+b1) ...
Selecting previously unselected package libldap2:armhf.
Preparing to unpack .../048-libldap2_2.6.9+dfsg-1_armhf.deb ...
Unpacking libldap2:armhf (2.6.9+dfsg-1) ...
Selecting previously unselected package libnpth0t64:armhf.
Preparing to unpack .../049-libnpth0t64_1.8-2_armhf.deb ...
Unpacking libnpth0t64:armhf (1.8-2) ...
Selecting previously unselected package dirmngr.
Preparing to unpack .../050-dirmngr_2.2.46-1+b1_armhf.deb ...
Unpacking dirmngr (2.2.46-1+b1) ...
Selecting previously unselected package gnupg-l10n.
Preparing to unpack .../051-gnupg-l10n_2.2.46-1_all.deb ...
Unpacking gnupg-l10n (2.2.46-1) ...
Selecting previously unselected package gpg.
Preparing to unpack .../052-gpg_2.2.46-1+b1_armhf.deb ...
Unpacking gpg (2.2.46-1+b1) ...
Selecting previously unselected package pinentry-curses.
Preparing to unpack .../053-pinentry-curses_1.3.1-2_armhf.deb ...
Unpacking pinentry-curses (1.3.1-2) ...
Selecting previously unselected package gpg-agent.
Preparing to unpack .../054-gpg-agent_2.2.46-1+b1_armhf.deb ...
Unpacking gpg-agent (2.2.46-1+b1) ...
Selecting previously unselected package gpgsm.
Preparing to unpack .../055-gpgsm_2.2.46-1+b1_armhf.deb ...
Unpacking gpgsm (2.2.46-1+b1) ...
Selecting previously unselected package gnupg.
Preparing to unpack .../056-gnupg_2.2.46-1_all.deb ...
Unpacking gnupg (2.2.46-1) ...
Selecting previously unselected package gpgv.
Preparing to unpack .../057-gpgv_2.2.46-1+b1_armhf.deb ...
Unpacking gpgv (2.2.46-1+b1) ...
Selecting previously unselected package sopv-gpgv.
Preparing to unpack .../058-sopv-gpgv_0.1.1-1_all.deb ...
Unpacking sopv-gpgv (0.1.1-1) ...
Selecting previously unselected package libfile-dirlist-perl.
Preparing to unpack .../059-libfile-dirlist-perl_0.05-3_all.deb ...
Unpacking libfile-dirlist-perl (0.05-3) ...
Selecting previously unselected package libfile-which-perl.
Preparing to unpack .../060-libfile-which-perl_1.27-2_all.deb ...
Unpacking libfile-which-perl (1.27-2) ...
Selecting previously unselected package libfile-homedir-perl.
Preparing to unpack .../061-libfile-homedir-perl_1.006-2_all.deb ...
Unpacking libfile-homedir-perl (1.006-2) ...
Selecting previously unselected package libfile-touch-perl.
Preparing to unpack .../062-libfile-touch-perl_0.12-2_all.deb ...
Unpacking libfile-touch-perl (0.12-2) ...
Selecting previously unselected package libio-pty-perl.
Preparing to unpack .../063-libio-pty-perl_1%3a1.20-1+b2_armhf.deb ...
Unpacking libio-pty-perl (1:1.20-1+b2) ...
Selecting previously unselected package libipc-run-perl.
Preparing to unpack .../064-libipc-run-perl_20231003.0-2_all.deb ...
Unpacking libipc-run-perl (20231003.0-2) ...
Selecting previously unselected package libclass-method-modifiers-perl.
Preparing to unpack .../065-libclass-method-modifiers-perl_2.15-1_all.deb ...
Unpacking libclass-method-modifiers-perl (2.15-1) ...
Selecting previously unselected package libclass-xsaccessor-perl.
Preparing to unpack .../066-libclass-xsaccessor-perl_1.19-4+b4_armhf.deb ...
Unpacking libclass-xsaccessor-perl (1.19-4+b4) ...
Selecting previously unselected package libb-hooks-op-check-perl:armhf.
Preparing to unpack .../067-libb-hooks-op-check-perl_0.22-3+b2_armhf.deb ...
Unpacking libb-hooks-op-check-perl:armhf (0.22-3+b2) ...
Selecting previously unselected package libdynaloader-functions-perl.
Preparing to unpack .../068-libdynaloader-functions-perl_0.004-1_all.deb ...
Unpacking libdynaloader-functions-perl (0.004-1) ...
Selecting previously unselected package libdevel-callchecker-perl:armhf.
Preparing to unpack .../069-libdevel-callchecker-perl_0.009-1+b1_armhf.deb ...
Unpacking libdevel-callchecker-perl:armhf (0.009-1+b1) ...
Selecting previously unselected package libparams-classify-perl:armhf.
Preparing to unpack .../070-libparams-classify-perl_0.015-2+b4_armhf.deb ...
Unpacking libparams-classify-perl:armhf (0.015-2+b4) ...
Selecting previously unselected package libmodule-runtime-perl.
Preparing to unpack .../071-libmodule-runtime-perl_0.016-2_all.deb ...
Unpacking libmodule-runtime-perl (0.016-2) ...
Selecting previously unselected package libimport-into-perl.
Preparing to unpack .../072-libimport-into-perl_1.002005-2_all.deb ...
Unpacking libimport-into-perl (1.002005-2) ...
Selecting previously unselected package librole-tiny-perl.
Preparing to unpack .../073-librole-tiny-perl_2.002004-1_all.deb ...
Unpacking librole-tiny-perl (2.002004-1) ...
Selecting previously unselected package libsub-quote-perl.
Preparing to unpack .../074-libsub-quote-perl_2.006008-1_all.deb ...
Unpacking libsub-quote-perl (2.006008-1) ...
Selecting previously unselected package libmoo-perl.
Preparing to unpack .../075-libmoo-perl_2.005005-1_all.deb ...
Unpacking libmoo-perl (2.005005-1) ...
Selecting previously unselected package libencode-locale-perl.
Preparing to unpack .../076-libencode-locale-perl_1.05-3_all.deb ...
Unpacking libencode-locale-perl (1.05-3) ...
Selecting previously unselected package libtimedate-perl.
Preparing to unpack .../077-libtimedate-perl_2.3300-2_all.deb ...
Unpacking libtimedate-perl (2.3300-2) ...
Selecting previously unselected package libhttp-date-perl.
Preparing to unpack .../078-libhttp-date-perl_6.06-1_all.deb ...
Unpacking libhttp-date-perl (6.06-1) ...
Selecting previously unselected package libfile-listing-perl.
Preparing to unpack .../079-libfile-listing-perl_6.16-1_all.deb ...
Unpacking libfile-listing-perl (6.16-1) ...
Selecting previously unselected package libhtml-tagset-perl.
Preparing to unpack .../080-libhtml-tagset-perl_3.24-1_all.deb ...
Unpacking libhtml-tagset-perl (3.24-1) ...
Selecting previously unselected package liburi-perl.
Preparing to unpack .../081-liburi-perl_5.30-1_all.deb ...
Unpacking liburi-perl (5.30-1) ...
Selecting previously unselected package libhtml-parser-perl:armhf.
Preparing to unpack .../082-libhtml-parser-perl_3.83-1+b2_armhf.deb ...
Unpacking libhtml-parser-perl:armhf (3.83-1+b2) ...
Selecting previously unselected package libhtml-tree-perl.
Preparing to unpack .../083-libhtml-tree-perl_5.07-3_all.deb ...
Unpacking libhtml-tree-perl (5.07-3) ...
Selecting previously unselected package libclone-perl:armhf.
Preparing to unpack .../084-libclone-perl_0.47-1+b1_armhf.deb ...
Unpacking libclone-perl:armhf (0.47-1+b1) ...
Selecting previously unselected package libio-html-perl.
Preparing to unpack .../085-libio-html-perl_1.004-3_all.deb ...
Unpacking libio-html-perl (1.004-3) ...
Selecting previously unselected package liblwp-mediatypes-perl.
Preparing to unpack .../086-liblwp-mediatypes-perl_6.04-2_all.deb ...
Unpacking liblwp-mediatypes-perl (6.04-2) ...
Selecting previously unselected package libhttp-message-perl.
Preparing to unpack .../087-libhttp-message-perl_7.00-2_all.deb ...
Unpacking libhttp-message-perl (7.00-2) ...
Selecting previously unselected package libhttp-cookies-perl.
Preparing to unpack .../088-libhttp-cookies-perl_6.11-1_all.deb ...
Unpacking libhttp-cookies-perl (6.11-1) ...
Selecting previously unselected package libhttp-negotiate-perl.
Preparing to unpack .../089-libhttp-negotiate-perl_6.01-2_all.deb ...
Unpacking libhttp-negotiate-perl (6.01-2) ...
Selecting previously unselected package perl-openssl-defaults:armhf.
Preparing to unpack .../090-perl-openssl-defaults_7+b2_armhf.deb ...
Unpacking perl-openssl-defaults:armhf (7+b2) ...
Selecting previously unselected package libnet-ssleay-perl:armhf.
Preparing to unpack .../091-libnet-ssleay-perl_1.94-2_armhf.deb ...
Unpacking libnet-ssleay-perl:armhf (1.94-2) ...
Selecting previously unselected package libio-socket-ssl-perl.
Preparing to unpack .../092-libio-socket-ssl-perl_2.089-1_all.deb ...
Unpacking libio-socket-ssl-perl (2.089-1) ...
Selecting previously unselected package libnet-http-perl.
Preparing to unpack .../093-libnet-http-perl_6.23-1_all.deb ...
Unpacking libnet-http-perl (6.23-1) ...
Selecting previously unselected package liblwp-protocol-https-perl.
Preparing to unpack .../094-liblwp-protocol-https-perl_6.14-1_all.deb ...
Unpacking liblwp-protocol-https-perl (6.14-1) ...
Selecting previously unselected package libtry-tiny-perl.
Preparing to unpack .../095-libtry-tiny-perl_0.32-1_all.deb ...
Unpacking libtry-tiny-perl (0.32-1) ...
Selecting previously unselected package libwww-robotrules-perl.
Preparing to unpack .../096-libwww-robotrules-perl_6.02-1_all.deb ...
Unpacking libwww-robotrules-perl (6.02-1) ...
Selecting previously unselected package libwww-perl.
Preparing to unpack .../097-libwww-perl_6.77-1_all.deb ...
Unpacking libwww-perl (6.77-1) ...
Selecting previously unselected package patchutils.
Preparing to unpack .../098-patchutils_0.4.2-1_armhf.deb ...
Unpacking patchutils (0.4.2-1) ...
Selecting previously unselected package wdiff.
Preparing to unpack .../099-wdiff_1.2.2-7_armhf.deb ...
Unpacking wdiff (1.2.2-7) ...
Selecting previously unselected package devscripts.
Preparing to unpack .../100-devscripts_2.25.1_all.deb ...
Unpacking devscripts (2.25.1) ...
Selecting previously unselected package rubygems-integration.
Preparing to unpack .../101-rubygems-integration_1.19_all.deb ...
Unpacking rubygems-integration (1.19) ...
Selecting previously unselected package ruby-did-you-mean.
Preparing to unpack .../102-ruby-did-you-mean_1.6.3-2_all.deb ...
Unpacking ruby-did-you-mean (1.6.3-2) ...
Selecting previously unselected package ruby-net-telnet.
Preparing to unpack .../103-ruby-net-telnet_0.2.0-1_all.deb ...
Unpacking ruby-net-telnet (0.2.0-1) ...
Selecting previously unselected package ruby-webrick.
Preparing to unpack .../104-ruby-webrick_1.8.1-1_all.deb ...
Unpacking ruby-webrick (1.8.1-1) ...
Selecting previously unselected package ruby-xmlrpc.
Preparing to unpack .../105-ruby-xmlrpc_0.3.3-2_all.deb ...
Unpacking ruby-xmlrpc (0.3.3-2) ...
Selecting previously unselected package libruby:armhf.
Preparing to unpack .../106-libruby_1%3a3.3~3.1_armhf.deb ...
Unpacking libruby:armhf (1:3.3~3.1) ...
Selecting previously unselected package ruby-sdbm:armhf.
Preparing to unpack .../107-ruby-sdbm_1.0.0-5+b6_armhf.deb ...
Unpacking ruby-sdbm:armhf (1.0.0-5+b6) ...
Selecting previously unselected package libedit2:armhf.
Preparing to unpack .../108-libedit2_3.1-20250104-1_armhf.deb ...
Unpacking libedit2:armhf (3.1-20250104-1) ...
Selecting previously unselected package libncurses6:armhf.
Preparing to unpack .../109-libncurses6_6.5-2+b1_armhf.deb ...
Unpacking libncurses6:armhf (6.5-2+b1) ...
Selecting previously unselected package libyaml-0-2:armhf.
Preparing to unpack .../110-libyaml-0-2_0.2.5-2_armhf.deb ...
Unpacking libyaml-0-2:armhf (0.2.5-2) ...
Selecting previously unselected package libruby3.1t64:armhf.
Preparing to unpack .../111-libruby3.1t64_3.1.2-8.5_armhf.deb ...
Unpacking libruby3.1t64:armhf (3.1.2-8.5) ...
Selecting previously unselected package ruby-minitest.
Preparing to unpack .../112-ruby-minitest_5.25.4-1_all.deb ...
Unpacking ruby-minitest (5.25.4-1) ...
Selecting previously unselected package ruby-power-assert.
Preparing to unpack .../113-ruby-power-assert_2.0.3-1_all.deb ...
Unpacking ruby-power-assert (2.0.3-1) ...
Selecting previously unselected package ruby-test-unit.
Preparing to unpack .../114-ruby-test-unit_3.6.2-1_all.deb ...
Unpacking ruby-test-unit (3.6.2-1) ...
Selecting previously unselected package libruby3.3:armhf.
Preparing to unpack .../115-libruby3.3_3.3.6-1.1_armhf.deb ...
Unpacking libruby3.3:armhf (3.3.6-1.1) ...
Selecting previously unselected package ruby3.3.
Preparing to unpack .../116-ruby3.3_3.3.6-1.1_armhf.deb ...
Unpacking ruby3.3 (3.3.6-1.1) ...
Selecting previously unselected package ruby-rubygems.
Preparing to unpack .../117-ruby-rubygems_3.6.3-1_all.deb ...
Unpacking ruby-rubygems (3.6.3-1) ...
Selecting previously unselected package ruby.
Preparing to unpack .../118-ruby_1%3a3.3~3.1_armhf.deb ...
Unpacking ruby (1:3.3~3.1) ...
Selecting previously unselected package rake.
Preparing to unpack .../119-rake_13.2.1-1_all.deb ...
Unpacking rake (13.2.1-1) ...
Selecting previously unselected package gem2deb-test-runner.
Preparing to unpack .../120-gem2deb-test-runner_2.2.5_armhf.deb ...
Unpacking gem2deb-test-runner (2.2.5) ...
Selecting previously unselected package libgmpxx4ldbl:armhf.
Preparing to unpack .../121-libgmpxx4ldbl_2%3a6.3.0+dfsg-3_armhf.deb ...
Unpacking libgmpxx4ldbl:armhf (2:6.3.0+dfsg-3) ...
Selecting previously unselected package libgmp-dev:armhf.
Preparing to unpack .../122-libgmp-dev_2%3a6.3.0+dfsg-3_armhf.deb ...
Unpacking libgmp-dev:armhf (2:6.3.0+dfsg-3) ...
Selecting previously unselected package ruby3.3-dev:armhf.
Preparing to unpack .../123-ruby3.3-dev_3.3.6-1.1_armhf.deb ...
Unpacking ruby3.3-dev:armhf (3.3.6-1.1) ...
Selecting previously unselected package ruby3.1.
Preparing to unpack .../124-ruby3.1_3.1.2-8.5_armhf.deb ...
Unpacking ruby3.1 (3.1.2-8.5) ...
Selecting previously unselected package ruby3.1-dev:armhf.
Preparing to unpack .../125-ruby3.1-dev_3.1.2-8.5_armhf.deb ...
Unpacking ruby3.1-dev:armhf (3.1.2-8.5) ...
Selecting previously unselected package ruby-all-dev:armhf.
Preparing to unpack .../126-ruby-all-dev_1%3a3.3~3.1_armhf.deb ...
Unpacking ruby-all-dev:armhf (1:3.3~3.1) ...
Selecting previously unselected package gem2deb.
Preparing to unpack .../127-gem2deb_2.2.5_armhf.deb ...
Unpacking gem2deb (2.2.5) ...
Selecting previously unselected package gsfonts.
Preparing to unpack .../128-gsfonts_2%3a20200910-8_all.deb ...
Unpacking gsfonts (2:20200910-8) ...
Selecting previously unselected package hicolor-icon-theme.
Preparing to unpack .../129-hicolor-icon-theme_0.18-2_all.deb ...
Unpacking hicolor-icon-theme (0.18-2) ...
Selecting previously unselected package imagemagick-7.q16.
Preparing to unpack .../130-imagemagick-7.q16_8%3a7.1.1.43+dfsg1-1_armhf.deb ...
Unpacking imagemagick-7.q16 (8:7.1.1.43+dfsg1-1) ...
Selecting previously unselected package imagemagick.
Preparing to unpack .../131-imagemagick_8%3a7.1.1.43+dfsg1-1_armhf.deb ...
Unpacking imagemagick (8:7.1.1.43+dfsg1-1) ...
Selecting previously unselected package libjs-jquery.
Preparing to unpack .../132-libjs-jquery_3.6.1+dfsg+~3.5.14-1_all.deb ...
Unpacking libjs-jquery (3.6.1+dfsg+~3.5.14-1) ...
Selecting previously unselected package libxslt1.1:armhf.
Preparing to unpack .../133-libxslt1.1_1.1.35-1.1+b1_armhf.deb ...
Unpacking libxslt1.1:armhf (1.1.35-1.1+b1) ...
Selecting previously unselected package publicsuffix.
Preparing to unpack .../134-publicsuffix_20250108.1153-0.1_all.deb ...
Unpacking publicsuffix (20250108.1153-0.1) ...
Selecting previously unselected package racc.
Preparing to unpack .../135-racc_1.8.1-1_all.deb ...
Unpacking racc (1.8.1-1) ...
Selecting previously unselected package ruby-concurrent.
Preparing to unpack .../136-ruby-concurrent_1.3.4-1~exp1_all.deb ...
Unpacking ruby-concurrent (1.3.4-1~exp1) ...
Selecting previously unselected package ruby-i18n.
Preparing to unpack .../137-ruby-i18n_1.14.5-1_all.deb ...
Unpacking ruby-i18n (1.14.5-1) ...
Selecting previously unselected package ruby-tzinfo.
Preparing to unpack .../138-ruby-tzinfo_2.0.6-1_all.deb ...
Unpacking ruby-tzinfo (2.0.6-1) ...
Selecting previously unselected package ruby-zeitwerk.
Preparing to unpack .../139-ruby-zeitwerk_2.6.8-1_all.deb ...
Unpacking ruby-zeitwerk (2.6.8-1) ...
Selecting previously unselected package ruby-activesupport.
Preparing to unpack .../140-ruby-activesupport_2%3a6.1.7.3+dfsg-7_all.deb ...
Unpacking ruby-activesupport (2:6.1.7.3+dfsg-7) ...
Selecting previously unselected package ruby-builder.
Preparing to unpack .../141-ruby-builder_3.2.4-2_all.deb ...
Unpacking ruby-builder (3.2.4-2) ...
Selecting previously unselected package ruby-erubi.
Preparing to unpack .../142-ruby-erubi_1.12.0-1_all.deb ...
Unpacking ruby-erubi (1.12.0-1) ...
Selecting previously unselected package ruby-mini-portile2.
Preparing to unpack .../143-ruby-mini-portile2_2.8.7-1_all.deb ...
Unpacking ruby-mini-portile2 (2.8.7-1) ...
Selecting previously unselected package ruby-pkg-config.
Preparing to unpack .../144-ruby-pkg-config_1.5.9-1_all.deb ...
Unpacking ruby-pkg-config (1.5.9-1) ...
Selecting previously unselected package ruby-nokogiri.
Preparing to unpack .../145-ruby-nokogiri_1.16.4+dfsg-1+b1_armhf.deb ...
Unpacking ruby-nokogiri (1.16.4+dfsg-1+b1) ...
Selecting previously unselected package ruby-rails-dom-testing.
Preparing to unpack .../146-ruby-rails-dom-testing_2.2.0-1_all.deb ...
Unpacking ruby-rails-dom-testing (2.2.0-1) ...
Selecting previously unselected package ruby-crass.
Preparing to unpack .../147-ruby-crass_1.0.6-1_all.deb ...
Unpacking ruby-crass (1.0.6-1) ...
Selecting previously unselected package ruby-loofah.
Preparing to unpack .../148-ruby-loofah_2.22.0-1_all.deb ...
Unpacking ruby-loofah (2.22.0-1) ...
Selecting previously unselected package ruby-rails-html-sanitizer.
Preparing to unpack .../149-ruby-rails-html-sanitizer_1.4.4-1_all.deb ...
Unpacking ruby-rails-html-sanitizer (1.4.4-1) ...
Selecting previously unselected package ruby-actionview.
Preparing to unpack .../150-ruby-actionview_2%3a6.1.7.3+dfsg-7_all.deb ...
Unpacking ruby-actionview (2:6.1.7.3+dfsg-7) ...
Selecting previously unselected package ruby-rack.
Preparing to unpack .../151-ruby-rack_3.0.8-2_all.deb ...
Unpacking ruby-rack (3.0.8-2) ...
Selecting previously unselected package ruby-rack-test.
Preparing to unpack .../152-ruby-rack-test_2.2.0-1_all.deb ...
Unpacking ruby-rack-test (2.2.0-1) ...
Selecting previously unselected package ruby-actionpack.
Preparing to unpack .../153-ruby-actionpack_2%3a6.1.7.3+dfsg-7_all.deb ...
Unpacking ruby-actionpack (2:6.1.7.3+dfsg-7) ...
Selecting previously unselected package ruby-nio4r.
Preparing to unpack .../154-ruby-nio4r_2.7.3-1+b1_armhf.deb ...
Unpacking ruby-nio4r (2.7.3-1+b1) ...
Selecting previously unselected package ruby-websocket-extensions.
Preparing to unpack .../155-ruby-websocket-extensions_0.1.5-2_all.deb ...
Unpacking ruby-websocket-extensions (0.1.5-2) ...
Selecting previously unselected package ruby-websocket-driver.
Preparing to unpack .../156-ruby-websocket-driver_0.6.3-3+b7_armhf.deb ...
Unpacking ruby-websocket-driver (0.6.3-3+b7) ...
Selecting previously unselected package ruby-actioncable.
Preparing to unpack .../157-ruby-actioncable_2%3a6.1.7.3+dfsg-7_all.deb ...
Unpacking ruby-actioncable (2:6.1.7.3+dfsg-7) ...
Selecting previously unselected package ruby-globalid.
Preparing to unpack .../158-ruby-globalid_1.2.1-1_all.deb ...
Unpacking ruby-globalid (1.2.1-1) ...
Selecting previously unselected package ruby-activejob.
Preparing to unpack .../159-ruby-activejob_2%3a6.1.7.3+dfsg-7_all.deb ...
Unpacking ruby-activejob (2:6.1.7.3+dfsg-7) ...
Selecting previously unselected package ruby-activemodel.
Preparing to unpack .../160-ruby-activemodel_2%3a6.1.7.3+dfsg-7_all.deb ...
Unpacking ruby-activemodel (2:6.1.7.3+dfsg-7) ...
Selecting previously unselected package ruby-activerecord.
Preparing to unpack .../161-ruby-activerecord_2%3a6.1.7.3+dfsg-7_all.deb ...
Unpacking ruby-activerecord (2:6.1.7.3+dfsg-7) ...
Selecting previously unselected package ruby-marcel.
Preparing to unpack .../162-ruby-marcel_1.0.4+dfsg-1_all.deb ...
Unpacking ruby-marcel (1.0.4+dfsg-1) ...
Selecting previously unselected package ruby-mini-mime.
Preparing to unpack .../163-ruby-mini-mime_1.1.5-1_all.deb ...
Unpacking ruby-mini-mime (1.1.5-1) ...
Selecting previously unselected package ruby-activestorage.
Preparing to unpack .../164-ruby-activestorage_2%3a6.1.7.3+dfsg-7_all.deb ...
Unpacking ruby-activestorage (2:6.1.7.3+dfsg-7) ...
Selecting previously unselected package ruby-mail.
Preparing to unpack .../165-ruby-mail_2.8.1+dfsg1-2_all.deb ...
Unpacking ruby-mail (2.8.1+dfsg1-2) ...
Selecting previously unselected package ruby-actionmailbox.
Preparing to unpack .../166-ruby-actionmailbox_2%3a6.1.7.3+dfsg-7_all.deb ...
Unpacking ruby-actionmailbox (2:6.1.7.3+dfsg-7) ...
Selecting previously unselected package ruby-actionmailer.
Preparing to unpack .../167-ruby-actionmailer_2%3a6.1.7.3+dfsg-7_all.deb ...
Unpacking ruby-actionmailer (2:6.1.7.3+dfsg-7) ...
Selecting previously unselected package ruby-actionpack-action-caching.
Preparing to unpack .../168-ruby-actionpack-action-caching_1.2.2-1_all.deb ...
Unpacking ruby-actionpack-action-caching (1.2.2-1) ...
Selecting previously unselected package ruby-method-source.
Preparing to unpack .../169-ruby-method-source_1.0.0-3_all.deb ...
Unpacking ruby-method-source (1.0.0-3) ...
Selecting previously unselected package ruby-thor.
Preparing to unpack .../170-ruby-thor_1.3.2-1_all.deb ...
Unpacking ruby-thor (1.3.2-1) ...
Selecting previously unselected package ruby-railties.
Preparing to unpack .../171-ruby-railties_2%3a6.1.7.3+dfsg-7_all.deb ...
Unpacking ruby-railties (2:6.1.7.3+dfsg-7) ...
Selecting previously unselected package ruby-actionpack-xml-parser.
Preparing to unpack .../172-ruby-actionpack-xml-parser_2.0.1-4_all.deb ...
Unpacking ruby-actionpack-xml-parser (2.0.1-4) ...
Selecting previously unselected package ruby-actiontext.
Preparing to unpack .../173-ruby-actiontext_2%3a6.1.7.3+dfsg-7_all.deb ...
Unpacking ruby-actiontext (2:6.1.7.3+dfsg-7) ...
Selecting previously unselected package ruby-public-suffix.
Preparing to unpack .../174-ruby-public-suffix_4.0.6+ds-2_all.deb ...
Unpacking ruby-public-suffix (4.0.6+ds-2) ...
Selecting previously unselected package ruby-addressable.
Preparing to unpack .../175-ruby-addressable_2.8.5-1_all.deb ...
Unpacking ruby-addressable (2.8.5-1) ...
Selecting previously unselected package ruby-bundler.
Preparing to unpack .../176-ruby-bundler_2.6.3-1_all.deb ...
Unpacking ruby-bundler (2.6.3-1) ...
Selecting previously unselected package ruby-chunky-png.
Preparing to unpack .../177-ruby-chunky-png_1.4.0-1_all.deb ...
Unpacking ruby-chunky-png (1.4.0-1) ...
Selecting previously unselected package ruby-coderay.
Preparing to unpack .../178-ruby-coderay_1.1.3-8_all.deb ...
Unpacking ruby-coderay (1.1.3-8) ...
Selecting previously unselected package ruby-enum.
Preparing to unpack .../179-ruby-enum_0.9.0+ds-1_all.deb ...
Unpacking ruby-enum (0.9.0+ds-1) ...
Selecting previously unselected package ruby-commonmarker.
Preparing to unpack .../180-ruby-commonmarker_0.23.10-1+b2_armhf.deb ...
Unpacking ruby-commonmarker (0.23.10-1+b2) ...
Selecting previously unselected package ruby-css-parser.
Preparing to unpack .../181-ruby-css-parser_1.19.0-1_all.deb ...
Unpacking ruby-css-parser (1.19.0-1) ...
Selecting previously unselected package ruby-hike.
Preparing to unpack .../182-ruby-hike_1.2.1-3.1_all.deb ...
Unpacking ruby-hike (1.2.1-3.1) ...
Selecting previously unselected package ruby-html-pipeline.
Preparing to unpack .../183-ruby-html-pipeline_2.14.3-2_all.deb ...
Unpacking ruby-html-pipeline (2.14.3-2) ...
Selecting previously unselected package ruby-htmlentities.
Preparing to unpack .../184-ruby-htmlentities_4.3.3-1.1_all.deb ...
Unpacking ruby-htmlentities (4.3.3-1.1) ...
Selecting previously unselected package ruby-jquery-rails.
Preparing to unpack .../185-ruby-jquery-rails_4.3.5-4_all.deb ...
Unpacking ruby-jquery-rails (4.3.5-4) ...
Selecting previously unselected package ruby-metaclass.
Preparing to unpack .../186-ruby-metaclass_0.0.4-1.1_all.deb ...
Unpacking ruby-metaclass (0.0.4-1.1) ...
Selecting previously unselected package ruby-posix-spawn.
Preparing to unpack .../187-ruby-posix-spawn_0.3.15-3+b1_armhf.deb ...
Unpacking ruby-posix-spawn (0.3.15-3+b1) ...
Selecting previously unselected package ruby-mini-magick.
Preparing to unpack .../188-ruby-mini-magick_4.13.1-2_all.deb ...
Unpacking ruby-mini-magick (4.13.1-2) ...
Selecting previously unselected package ruby-mocha.
Preparing to unpack .../189-ruby-mocha_1.16.1-3_all.deb ...
Unpacking ruby-mocha (1.16.1-3) ...
Selecting previously unselected package ruby-multi-json.
Preparing to unpack .../190-ruby-multi-json_1.14.1-2_all.deb ...
Unpacking ruby-multi-json (1.14.1-2) ...
Selecting previously unselected package ruby-net-ldap.
Preparing to unpack .../191-ruby-net-ldap_0.19.0-1_all.deb ...
Unpacking ruby-net-ldap (0.19.0-1) ...
Selecting previously unselected package ruby-tilt.
Preparing to unpack .../192-ruby-tilt_2.4.0-3_all.deb ...
Unpacking ruby-tilt (2.4.0-3) ...
Selecting previously unselected package ruby-sprockets.
Preparing to unpack .../193-ruby-sprockets_4.2.1-3_all.deb ...
Unpacking ruby-sprockets (4.2.1-3) ...
Selecting previously unselected package ruby-sprockets-rails.
Preparing to unpack .../194-ruby-sprockets-rails_3.5.2-1_all.deb ...
Unpacking ruby-sprockets-rails (3.5.2-1) ...
Selecting previously unselected package ruby-rails.
Preparing to unpack .../195-ruby-rails_2%3a6.1.7.3+dfsg-7_all.deb ...
Unpacking ruby-rails (2:6.1.7.3+dfsg-7) ...
Selecting previously unselected package ruby-rails-observers.
Preparing to unpack .../196-ruby-rails-observers_0.1.5-1.1_all.deb ...
Unpacking ruby-rails-observers (0.1.5-1.1) ...
Selecting previously unselected package ruby-rbpdf-font.
Preparing to unpack .../197-ruby-rbpdf-font_1.21.3+dfsg-1_all.deb ...
Unpacking ruby-rbpdf-font (1.21.3+dfsg-1) ...
Selecting previously unselected package ruby-rbpdf.
Preparing to unpack .../198-ruby-rbpdf_1.21.3+dfsg-1_all.deb ...
Unpacking ruby-rbpdf (1.21.3+dfsg-1) ...
Selecting previously unselected package ruby-redcarpet:armhf.
Preparing to unpack .../199-ruby-redcarpet_3.6.0-1+b4_armhf.deb ...
Unpacking ruby-redcarpet:armhf (3.6.0-1+b4) ...
Selecting previously unselected package ruby-request-store.
Preparing to unpack .../200-ruby-request-store_1.5.1-1_all.deb ...
Unpacking ruby-request-store (1.5.1-1) ...
Selecting previously unselected package ruby-rmagick:armhf.
Preparing to unpack .../201-ruby-rmagick_6.0.1-2+b2_armhf.deb ...
Unpacking ruby-rmagick:armhf (6.0.1-2+b2) ...
Selecting previously unselected package ruby-roadie.
Preparing to unpack .../202-ruby-roadie_5.2.1-2_all.deb ...
Unpacking ruby-roadie (5.2.1-2) ...
Selecting previously unselected package ruby-roadie-rails.
Preparing to unpack .../203-ruby-roadie-rails_3.0.0-1_all.deb ...
Unpacking ruby-roadie-rails (3.0.0-1) ...
Selecting previously unselected package ruby-rotp.
Preparing to unpack .../204-ruby-rotp_6.2.0-2_all.deb ...
Unpacking ruby-rotp (6.2.0-2) ...
Selecting previously unselected package ruby-rouge.
Preparing to unpack .../205-ruby-rouge_4.5.1-1_all.deb ...
Unpacking ruby-rouge (4.5.1-1) ...
Selecting previously unselected package ruby-rqrcode-core.
Preparing to unpack .../206-ruby-rqrcode-core_1.2.0-2_all.deb ...
Unpacking ruby-rqrcode-core (1.2.0-2) ...
Selecting previously unselected package ruby-rqrcode.
Preparing to unpack .../207-ruby-rqrcode_2.2.0-1_all.deb ...
Unpacking ruby-rqrcode (2.2.0-1) ...
Selecting previously unselected package ruby-sanitize.
Preparing to unpack .../208-ruby-sanitize_6.0.2-2_all.deb ...
Unpacking ruby-sanitize (6.0.2-2) ...
Selecting previously unselected package ruby-sqlite3.
Preparing to unpack .../209-ruby-sqlite3_1.6.9-2+b1_armhf.deb ...
Unpacking ruby-sqlite3 (1.6.9-2+b1) ...
Selecting previously unselected package ruby-task-list.
Preparing to unpack .../210-ruby-task-list_2.3.2-2_all.deb ...
Unpacking ruby-task-list (2.3.2-2) ...
Selecting previously unselected package unzip.
Preparing to unpack .../211-unzip_6.0-28_armhf.deb ...
Unpacking unzip (6.0-28) ...
Selecting previously unselected package zip.
Preparing to unpack .../212-zip_3.0-14_armhf.deb ...
Unpacking zip (3.0-14) ...
Selecting previously unselected package ruby-zip.
Preparing to unpack .../213-ruby-zip_2.3.2-1_all.deb ...
Unpacking ruby-zip (2.3.2-1) ...
Setting up media-types (10.1.0) ...
Setting up libpipeline1:armhf (1.5.8-1) ...
Setting up liblcms2-2:armhf (2.16-2) ...
Setting up libtext-charwidth-perl:armhf (0.04-11+b4) ...
Setting up wdiff (1.2.2-7) ...
Setting up libsharpyuv0:armhf (1.5.0-0.1) ...
Setting up ruby-rqrcode-core (1.2.0-2) ...
Setting up libfile-which-perl (1.27-2) ...
Setting up ruby-rbpdf-font (1.21.3+dfsg-1) ...
Setting up libxau6:armhf (1:1.0.11-1) ...
Setting up libxdmcp6:armhf (1:1.1.5-1) ...
Setting up libnpth0t64:armhf (1.8-2) ...
Setting up libxcb1:armhf (1.17.0-2+b1) ...
Setting up libicu72:armhf (72.1-6) ...
Setting up liblerc4:armhf (4.0.0+ds-5) ...
Setting up bsdextrautils (2.40.4-2) ...
Setting up hicolor-icon-theme (0.18-2) ...
Setting up libgpg-error0:armhf (1.51-3) ...
Setting up libdynaloader-functions-perl (0.004-1) ...
Setting up libclass-method-modifiers-perl (2.15-1) ...
Setting up ruby-power-assert (2.0.3-1) ...
Setting up libio-pty-perl (1:1.20-1+b2) ...
Setting up ruby-marcel (1.0.4+dfsg-1) ...
Setting up libmagic-mgc (1:5.45-3+b1) ...
Setting up libclone-perl:armhf (0.47-1+b1) ...
Setting up libarchive-zip-perl (1.68-1) ...
Setting up libyaml-0-2:armhf (0.2.5-2) ...
Setting up imagemagick-7-common (8:7.1.1.43+dfsg1-1) ...
Setting up libhtml-tagset-perl (3.24-1) ...
Setting up unzip (6.0-28) ...
Setting up libdebhelper-perl (13.24.1) ...
Setting up libbrotli1:armhf (1.1.0-2+b6) ...
Setting up libedit2:armhf (3.1-20250104-1) ...
Setting up liblwp-mediatypes-perl (6.04-2) ...
Setting up libmagic1t64:armhf (1:5.45-3+b1) ...
Setting up ruby-crass (1.0.6-1) ...
Setting up x11-common (1:7.7+24) ...
invoke-rc.d: could not determine current runlevel
Setting up X socket directories... /tmp/.X11-unix /tmp/.ICE-unix.
Setting up libtry-tiny-perl (0.32-1) ...
Setting up libdeflate0:armhf (1.23-1+b1) ...
Setting up perl-openssl-defaults:armhf (7+b2) ...
Setting up gettext-base (0.23.1-1) ...
Setting up m4 (1.4.19-5) ...
Setting up libgcrypt20:armhf (1.11.0-7) ...
Setting up ruby-mini-portile2 (2.8.7-1) ...
Setting up libencode-locale-perl (1.05-3) ...
Setting up file (1:5.45-3+b1) ...
Setting up ruby-concurrent (1.3.4-1~exp1) ...
Setting up libtext-wrapi18n-perl (0.06-10) ...
Setting up libjbig0:armhf (2.1-6.1+b2) ...
Setting up ruby-erubi (1.12.0-1) ...
Setting up libelf1t64:armhf (0.192-4) ...
Setting up libsasl2-modules-db:armhf (2.1.28+dfsg1-8+b1) ...
Setting up tzdata (2025a-1) ...

Current default time zone: 'Etc/UTC'
Local time is now:      Thu Jan 30 05:15:36 UTC 2025.
Universal Time is now:  Thu Jan 30 05:15:36 UTC 2025.
Run 'dpkg-reconfigure tzdata' if you wish to change it.

Setting up ruby-websocket-extensions (0.1.5-2) ...
Setting up ruby-minitest (5.25.4-1) ...
Setting up ruby-method-source (1.0.0-3) ...
Setting up zip (3.0-14) ...
Setting up libfontenc1:armhf (1:1.1.8-1+b2) ...
Setting up autotools-dev (20220109.1) ...
Setting up libgmpxx4ldbl:armhf (2:6.3.0+dfsg-3) ...
Setting up libjpeg62-turbo:armhf (1:2.1.5-3+b1) ...
Setting up ruby-test-unit (3.6.2-1) ...
Setting up libx11-data (2:1.8.10-2) ...
Setting up gnupg-l10n (2.2.46-1) ...
Setting up libncurses6:armhf (6.5-2+b1) ...
Setting up ruby-net-telnet (0.2.0-1) ...
Setting up xfonts-encodings (1:1.0.4-2.2) ...
Setting up libproc2-0:armhf (2:4.0.4-7) ...
Setting up libunistring5:armhf (1.3-1) ...
Setting up fonts-dejavu-mono (2.37-8) ...
Setting up libpng16-16t64:armhf (1.6.46-1) ...
Setting up libio-html-perl (1.004-3) ...
Setting up autopoint (0.23.1-1) ...
Setting up libb-hooks-op-check-perl:armhf (0.22-3+b2) ...
Setting up fonts-dejavu-core (2.37-8) ...
Setting up ruby-i18n (1.14.5-1) ...
Setting up libipc-run-perl (20231003.0-2) ...
Setting up libltdl7:armhf (2.5.4-2.1) ...
Setting up libfftw3-double3:armhf (3.3.10-2+b1) ...
Setting up libsasl2-2:armhf (2.1.28+dfsg1-8+b1) ...
Setting up libraw23t64:armhf (0.21.3-1+b1) ...
Setting up autoconf (2.72-3) ...
Setting up libwebp7:armhf (1.5.0-0.1) ...
Setting up libtimedate-perl (2.3300-2) ...
Setting up ruby-webrick (1.8.1-1) ...
Setting up ruby-zip (2.3.2-1) ...
Setting up libffi8:armhf (3.4.6-1) ...
Setting up dwz (0.15-1+b2) ...
Setting up libdav1d7:armhf (1.5.1-1) ...
Setting up sensible-utils (0.0.24) ...
Setting up gpgv (2.2.46-1+b1) ...
Setting up libtiff6:armhf (4.5.1+git230720-5) ...
Setting up ruby-chunky-png (1.4.0-1) ...
Setting up ruby-builder (3.2.4-2) ...
Setting up libuchardet0:armhf (0.0.8-1+b2) ...
Setting up libassuan9:armhf (3.0.1-2) ...
Setting up procps (2:4.0.4-7) ...
Setting up librole-tiny-perl (2.002004-1) ...
Setting up libtasn1-6:armhf (4.19.0-3+b3) ...
Setting up libopenjp2-7:armhf (2.5.0-2+b4) ...
Setting up libx11-6:armhf (2:1.8.10-2) ...
Setting up netbase (6.4) ...
Setting up libsub-quote-perl (2.006008-1) ...
Setting up libclass-xsaccessor-perl (1.19-4+b4) ...
Setting up ruby-net-ldap (0.19.0-1) ...
Setting up libjs-jquery (3.6.1+dfsg+~3.5.14-1) ...
Setting up ruby-did-you-mean (1.6.3-2) ...
Setting up libfile-dirlist-perl (0.05-3) ...
Setting up libde265-0:armhf (1.0.15-1+b2) ...
Setting up libfile-homedir-perl (1.006-2) ...
Setting up ruby-enum (0.9.0+ds-1) ...
Setting up openssl (3.4.0-2) ...
Setting up libwebpmux3:armhf (1.5.0-0.1) ...
Setting up readline-common (8.2-6) ...
Setting up ruby-xmlrpc (0.3.3-2) ...
Setting up publicsuffix (20250108.1153-0.1) ...
Setting up libxml2:armhf (2.12.7+dfsg+really2.9.14-0.2+b1) ...
Setting up ruby-zeitwerk (2.6.8-1) ...
Setting up libldap2:armhf (2.6.9+dfsg-1) ...
Setting up liburi-perl (5.30-1) ...
Setting up libfile-touch-perl (0.12-2) ...
Setting up libnet-ssleay-perl:armhf (1.94-2) ...
Setting up automake (1:1.17-2) ...
update-alternatives: using /usr/bin/automake-1.17 to provide /usr/bin/automake (automake) in auto mode
Setting up libksba8:armhf (1.6.7-2+b1) ...
Setting up pinentry-curses (1.3.1-2) ...
Setting up libfile-stripnondeterminism-perl (1.14.1-1) ...
Setting up libhttp-date-perl (6.06-1) ...
Setting up gettext (0.23.1-1) ...
Setting up libgmp-dev:armhf (2:6.3.0+dfsg-3) ...
Setting up libfile-listing-perl (6.16-1) ...
Setting up libtool (2.5.4-2.1) ...
Setting up ruby-tzinfo (2.0.6-1) ...
Setting up fontconfig-config (2.15.0-2) ...
Setting up ruby-public-suffix (4.0.6+ds-2) ...
Setting up libwebpdemux2:armhf (1.5.0-0.1) ...
Setting up libxext6:armhf (2:1.3.4-1+b3) ...
Setting up libnet-http-perl (6.23-1) ...
Setting up libidn2-0:armhf (2.3.7-2+b1) ...
Setting up libdevel-callchecker-perl:armhf (0.009-1+b1) ...
Setting up intltool-debian (0.35.0+20060710.6) ...
Setting up dh-autoreconf (20) ...
Setting up patchutils (0.4.2-1) ...
Setting up ca-certificates (20241223) ...
Updating certificates in /etc/ssl/certs...
152 added, 0 removed; done.
Setting up libglib2.0-0t64:armhf (2.82.4-2) ...
No schema files found: doing nothing.
Setting up libfreetype6:armhf (2.13.3+dfsg-1) ...
Setting up libp11-kit0:armhf (0.25.5-3) ...
Setting up ucf (3.0049) ...
Setting up libreadline8t64:armhf (8.2-6) ...
Setting up dh-strip-nondeterminism (1.14.1-1) ...
Setting up libwww-robotrules-perl (6.02-1) ...
Setting up liblqr-1-0:armhf (0.4.2-2.1+b2) ...
Setting up ruby-rqrcode (2.2.0-1) ...
Setting up groff-base (1.23.0-7) ...
Setting up libhtml-parser-perl:armhf (3.83-1+b2) ...
Setting up libxslt1.1:armhf (1.1.35-1.1+b1) ...
Setting up gpgconf (2.2.46-1+b1) ...
Setting up libfontconfig1:armhf (2.15.0-2) ...
Setting up libpython3.13-stdlib:armhf (3.13.1-3) ...
Setting up libio-socket-ssl-perl (2.089-1) ...
Setting up gpg (2.2.46-1+b1) ...
Setting up libpython3-stdlib:armhf (3.13.1-2) ...
Setting up libhttp-message-perl (7.00-2) ...
Setting up libgnutls30t64:armhf (3.8.8-2) ...
Setting up ruby-addressable (2.8.5-1) ...
Setting up libhttp-negotiate-perl (6.01-2) ...
Setting up gpg-agent (2.2.46-1+b1) ...
Setting up libhttp-cookies-perl (6.11-1) ...
Setting up python3.13 (3.13.1-3) ...
Setting up po-debconf (1.0.21+nmu1) ...
Setting up libhtml-tree-perl (5.07-3) ...
Setting up libparams-classify-perl:armhf (0.015-2+b4) ...
Setting up gpgsm (2.2.46-1+b1) ...
Setting up python3 (3.13.1-2) ...
Setting up rubygems-integration (1.19) ...
Setting up dbconfig-common (2.0.24) ...
Creating config file /etc/dbconfig-common/config with new version
Setting up sopv-gpgv (0.1.1-1) ...
update-alternatives: using /usr/bin/sopv-gpgv to provide /usr/bin/sopv (sopv) in auto mode
Setting up xfonts-utils (1:7.7+7) ...
Setting up man-db (2.13.0-1) ...
Not building database; man-db/auto-update is not 'true'.
Setting up dirmngr (2.2.46-1+b1) ...
Setting up ruby-css-parser (1.19.0-1) ...
Setting up libmodule-runtime-perl (0.016-2) ...
Setting up gnupg (2.2.46-1) ...
Setting up libimport-into-perl (1.002005-2) ...
Setting up libmoo-perl (2.005005-1) ...
Setting up debhelper (13.24.1) ...
Setting up fonts-urw-base35 (20200910-8) ...
Setting up gsfonts (2:20200910-8) ...
Setting up rake (13.2.1-1) ...
Setting up libheif-plugin-dav1d:armhf (1.19.5-1+b1) ...
Setting up libheif-plugin-libde265:armhf (1.19.5-1+b1) ...
Setting up libruby:armhf (1:3.3~3.1) ...
Setting up libwww-perl (6.77-1) ...
Setting up libheif1:armhf (1.19.5-1+b1) ...
Setting up ruby-rubygems (3.6.3-1) ...
Setting up devscripts (2.25.1) ...
Setting up libmagickcore-7.q16-10:armhf (8:7.1.1.43+dfsg1-1) ...
Setting up ruby-sdbm:armhf (1.0.0-5+b6) ...
Setting up liblwp-protocol-https-perl (6.14-1) ...
Setting up libmagickwand-7.q16-10:armhf (8:7.1.1.43+dfsg1-1) ...
Setting up libruby3.3:armhf (3.3.6-1.1) ...
Setting up ruby-nio4r (2.7.3-1+b1) ...
Setting up libruby3.1t64:armhf (3.1.2-8.5) ...
Setting up ruby-sqlite3 (1.6.9-2+b1) ...
Setting up ruby3.1 (3.1.2-8.5) ...
Setting up ruby3.3-dev:armhf (3.3.6-1.1) ...
Setting up ruby3.1-dev:armhf (3.1.2-8.5) ...
Setting up ruby3.3 (3.3.6-1.1) ...
Setting up imagemagick-7.q16 (8:7.1.1.43+dfsg1-1) ...
update-alternatives: using /usr/bin/compare-im7.q16 to provide /usr/bin/compare (compare) in auto mode
update-alternatives: using /usr/bin/compare-im7.q16 to provide /usr/bin/compare-im7 (compare-im7) in auto mode
update-alternatives: using /usr/bin/animate-im7.q16 to provide /usr/bin/animate (animate) in auto mode
update-alternatives: using /usr/bin/animate-im7.q16 to provide /usr/bin/animate-im7 (animate-im7) in auto mode
update-alternatives: using /usr/bin/convert-im7.q16 to provide /usr/bin/convert (convert) in auto mode
update-alternatives: using /usr/bin/convert-im7.q16 to provide /usr/bin/convert-im7 (convert-im7) in auto mode
update-alternatives: using /usr/bin/composite-im7.q16 to provide /usr/bin/composite (composite) in auto mode
update-alternatives: using /usr/bin/composite-im7.q16 to provide /usr/bin/composite-im7 (composite-im7) in auto mode
update-alternatives: using /usr/bin/conjure-im7.q16 to provide /usr/bin/conjure (conjure) in auto mode
update-alternatives: using /usr/bin/conjure-im7.q16 to provide /usr/bin/conjure-im7 (conjure-im7) in auto mode
update-alternatives: using /usr/bin/import-im7.q16 to provide /usr/bin/import (import) in auto mode
update-alternatives: using /usr/bin/import-im7.q16 to provide /usr/bin/import-im7 (import-im7) in auto mode
update-alternatives: using /usr/bin/identify-im7.q16 to provide /usr/bin/identify (identify) in auto mode
update-alternatives: using /usr/bin/identify-im7.q16 to provide /usr/bin/identify-im7 (identify-im7) in auto mode
update-alternatives: using /usr/bin/stream-im7.q16 to provide /usr/bin/stream (stream) in auto mode
update-alternatives: using /usr/bin/stream-im7.q16 to provide /usr/bin/stream-im7 (stream-im7) in auto mode
update-alternatives: using /usr/bin/display-im7.q16 to provide /usr/bin/display (display) in auto mode
update-alternatives: using /usr/bin/display-im7.q16 to provide /usr/bin/display-im7 (display-im7) in auto mode
update-alternatives: using /usr/bin/montage-im7.q16 to provide /usr/bin/montage (montage) in auto mode
update-alternatives: using /usr/bin/montage-im7.q16 to provide /usr/bin/montage-im7 (montage-im7) in auto mode
update-alternatives: using /usr/bin/mogrify-im7.q16 to provide /usr/bin/mogrify (mogrify) in auto mode
update-alternatives: using /usr/bin/mogrify-im7.q16 to provide /usr/bin/mogrify-im7 (mogrify-im7) in auto mode
update-alternatives: using /usr/bin/magick-im7.q16 to provide /usr/bin/magick (magick) in auto mode
update-alternatives: warning: skip creation of /usr/share/man/man1/magick.1.gz because associated file /usr/share/man/man1/magick-im7.q16.1.gz (of link group magick) doesn't exist
update-alternatives: using /usr/bin/magick-im7.q16 to provide /usr/bin/magick-im7 (magick-im7) in auto mode
update-alternatives: warning: skip creation of /usr/share/man/man1/magick-im7.1.gz because associated file /usr/share/man/man1/magick-im7.q16.1.gz (of link group magick-im7) doesn't exist
update-alternatives: using /usr/bin/magick-script-im7.q16 to provide /usr/bin/magick-script (magick-script) in auto mode
update-alternatives: warning: skip creation of /usr/share/man/man1/magick-script.1.gz because associated file /usr/share/man/man1/magick-script-im7.q16.1.gz (of link group magick-script) doesn't exist
update-alternatives: using /usr/bin/magick-script-im7.q16 to provide /usr/bin/magick-script-im7 (magick-script-im7) in auto mode
update-alternatives: warning: skip creation of /usr/share/man/man1/magick-script-im7.1.gz because associated file /usr/share/man/man1/magick-script-im7.q16.1.gz (of link group magick-script-im7) doesn't exist
Setting up ruby-all-dev:armhf (1:3.3~3.1) ...
Setting up ruby (1:3.3~3.1) ...
Setting up racc (1.8.1-1) ...
Setting up ruby-thor (1.3.2-1) ...
Setting up ruby-pkg-config (1.5.9-1) ...
Setting up ruby-coderay (1.1.3-8) ...
Setting up ruby-mini-mime (1.1.5-1) ...
Setting up imagemagick (8:7.1.1.43+dfsg1-1) ...
Setting up ruby-htmlentities (4.3.3-1.1) ...
Setting up ruby-rouge (4.5.1-1) ...
Setting up ruby-hike (1.2.1-3.1) ...
Setting up ruby-posix-spawn (0.3.15-3+b1) ...
Setting up ruby-tilt (2.4.0-3) ...
Setting up ruby-websocket-driver (0.6.3-3+b7) ...
Setting up ruby-redcarpet:armhf (3.6.0-1+b4) ...
Setting up ruby-multi-json (1.14.1-2) ...
Setting up ruby-rotp (6.2.0-2) ...
Setting up ruby-nokogiri (1.16.4+dfsg-1+b1) ...
Setting up ruby-rack (3.0.8-2) ...
Setting up ruby-rmagick:armhf (6.0.1-2+b2) ...
Setting up ruby-sanitize (6.0.2-2) ...
Setting up ruby-metaclass (0.0.4-1.1) ...
Setting up ruby-activesupport (2:6.1.7.3+dfsg-7) ...
Setting up ruby-bundler (2.6.3-1) ...
Setting up ruby-roadie (5.2.1-2) ...
Setting up ruby-commonmarker (0.23.10-1+b2) ...
Setting up gem2deb-test-runner (2.2.5) ...
Setting up ruby-rack-test (2.2.0-1) ...
Setting up ruby-mail (2.8.1+dfsg1-2) ...
Setting up ruby-rbpdf (1.21.3+dfsg-1) ...
Setting up ruby-activemodel (2:6.1.7.3+dfsg-7) ...
Setting up ruby-html-pipeline (2.14.3-2) ...
Setting up ruby-rails-observers (0.1.5-1.1) ...
Setting up ruby-loofah (2.22.0-1) ...
Setting up ruby-request-store (1.5.1-1) ...
Setting up ruby-mini-magick (4.13.1-2) ...
Setting up ruby-mocha (1.16.1-3) ...
Setting up ruby-rails-dom-testing (2.2.0-1) ...
Setting up gem2deb (2.2.5) ...
Setting up ruby-task-list (2.3.2-2) ...
Setting up ruby-sprockets (4.2.1-3) ...
Setting up ruby-globalid (1.2.1-1) ...
Setting up ruby-activerecord (2:6.1.7.3+dfsg-7) ...
Setting up ruby-rails-html-sanitizer (1.4.4-1) ...
Setting up ruby-actionview (2:6.1.7.3+dfsg-7) ...
Setting up ruby-activejob (2:6.1.7.3+dfsg-7) ...
Setting up ruby-actionpack (2:6.1.7.3+dfsg-7) ...
Setting up ruby-sprockets-rails (3.5.2-1) ...
Setting up ruby-actioncable (2:6.1.7.3+dfsg-7) ...
Setting up ruby-actionmailer (2:6.1.7.3+dfsg-7) ...
Setting up ruby-actionpack-action-caching (1.2.2-1) ...
Setting up ruby-activestorage (2:6.1.7.3+dfsg-7) ...
Setting up ruby-actiontext (2:6.1.7.3+dfsg-7) ...
Setting up ruby-actionmailbox (2:6.1.7.3+dfsg-7) ...
Setting up ruby-railties (2:6.1.7.3+dfsg-7) ...
Setting up ruby-jquery-rails (4.3.5-4) ...
Setting up ruby-actionpack-xml-parser (2.0.1-4) ...
Setting up ruby-roadie-rails (3.0.0-1) ...
Setting up ruby-rails (2:6.1.7.3+dfsg-7) ...
Processing triggers for libc-bin (2.40-6) ...
Processing triggers for ca-certificates (20241223) ...
Updating certificates in /etc/ssl/certs...
0 added, 0 removed; done.
Running hooks in /etc/ca-certificates/update.d...
done.
Reading package lists...
Building dependency tree...
Reading state information...
Reading extended state information...
Initializing package states...
Writing extended state information...
Building tag database...
 -> Finished parsing the build-deps
I: Building the package
I: Running cd /build/reproducible-path/redmine-5.1.3+ds/ && env PATH="/usr/sbin:/usr/bin:/sbin:/bin:/usr/games" HOME="/nonexistent/first-build" dpkg-buildpackage -us -uc -b && env PATH="/usr/sbin:/usr/bin:/sbin:/bin:/usr/games" HOME="/nonexistent/first-build" dpkg-genchanges -S  > ../redmine_5.1.3+ds-6_source.changes
dpkg-buildpackage: info: source package redmine
dpkg-buildpackage: info: source version 5.1.3+ds-6
dpkg-buildpackage: info: source distribution unstable
dpkg-buildpackage: info: source changed by Cédric Boutillier <boutil@debian.org>
 dpkg-source --before-build .
dpkg-buildpackage: info: host architecture armhf
 debian/rules clean
dh clean --with ruby
   debian/rules override_dh_auto_clean
make[1]: Entering directory '/build/reproducible-path/redmine-5.1.3+ds'
# tests
# db/schema.rb is being removed again as this
# remains if build time tests fail
rm -rf instances Gemfile.local tmp Gemfile.lock db/schema.rb
dh_auto_clean
make[1]: Leaving directory '/build/reproducible-path/redmine-5.1.3+ds'
   dh_clean
 debian/rules binary
dh binary --with ruby
   dh_update_autotools_config
   dh_autoreconf
   debian/rules override_dh_auto_configure
make[1]: Entering directory '/build/reproducible-path/redmine-5.1.3+ds'
./debian/check-locales
bundle install --local --quiet
`/nonexistent/first-build` is not a directory.
Bundler will use `/tmp/bundler20250129-32712-bmlj7i32712' as your home directory temporarily.
rm -f Gemfile.lock
make[1]: Leaving directory '/build/reproducible-path/redmine-5.1.3+ds'
   debian/rules override_dh_auto_test
make[1]: Entering directory '/build/reproducible-path/redmine-5.1.3+ds'
mkdir -p instances/default/config/
cp debian/Gemfile.test.local Gemfile.local
cp debian/database.test.yml instances/default/config/database.yml
bin/rake db:migrate RAILS_ENV=test
/usr/share/rubygems-integration/all/gems/railties-6.1.7.3/lib/rails/application.rb:7: warning: base64 was loaded from the standard library, but will no longer be part of the default gems starting from Ruby 3.4.0.
You can add base64 to your Gemfile or gemspec to silence this warning.
/usr/share/rubygems-integration/all/gems/activesupport-6.1.7.3/lib/active_support/dependencies.rb:299: warning: bigdecimal was loaded from the standard library, but will no longer be part of the default gems starting from Ruby 3.4.0.
You can add bigdecimal to your Gemfile or gemspec to silence this warning.
Also please contact the author of activesupport-6.1.7.3 to request adding bigdecimal into its gemspec.
/usr/share/rubygems-integration/all/gems/activesupport-6.1.7.3/lib/active_support/dependencies.rb:299: warning: mutex_m was loaded from the standard library, but will no longer be part of the default gems starting from Ruby 3.4.0.
You can add mutex_m to your Gemfile or gemspec to silence this warning.
Also please contact the author of activesupport-6.1.7.3 to request adding mutex_m into its gemspec.
`/nonexistent/first-build` is not a directory.
Bundler will use `/tmp/bundler20250129-32723-schaj732723' as your home directory temporarily.
rake aborted!
LoadError: cannot load such file -- rack/session/abstract/id (LoadError)
/usr/share/rubygems-integration/all/gems/zeitwerk-2.6.8/lib/zeitwerk/kernel.rb:38:in `require'
/usr/share/rubygems-integration/all/gems/activesupport-6.1.7.3/lib/active_support/dependencies.rb:332:in `block in require'
/usr/share/rubygems-integration/all/gems/activesupport-6.1.7.3/lib/active_support/dependencies.rb:299:in `load_dependency'
/usr/share/rubygems-integration/all/gems/activesupport-6.1.7.3/lib/active_support/dependencies.rb:332:in `require'
/usr/share/rubygems-integration/all/gems/actionpack-6.1.7.3/lib/action_controller/metal/request_forgery_protection.rb:3:in `<top (required)>'
/usr/share/rubygems-integration/all/gems/zeitwerk-2.6.8/lib/zeitwerk/kernel.rb:38:in `require'
/usr/share/rubygems-integration/all/gems/activesupport-6.1.7.3/lib/active_support/dependencies.rb:332:in `block in require'
/usr/share/rubygems-integration/all/gems/activesupport-6.1.7.3/lib/active_support/dependencies.rb:299:in `load_dependency'
/usr/share/rubygems-integration/all/gems/activesupport-6.1.7.3/lib/active_support/dependencies.rb:332:in `require'
/usr/share/rubygems-integration/all/gems/actionpack-6.1.7.3/lib/action_controller/base.rb:227:in `<class:Base>'
/usr/share/rubygems-integration/all/gems/actionpack-6.1.7.3/lib/action_controller/base.rb:166:in `<module:ActionController>'
/usr/share/rubygems-integration/all/gems/actionpack-6.1.7.3/lib/action_controller/base.rb:7:in `<top (required)>'
/usr/share/rubygems-integration/all/gems/zeitwerk-2.6.8/lib/zeitwerk/kernel.rb:38:in `require'
/usr/share/rubygems-integration/all/gems/activesupport-6.1.7.3/lib/active_support/dependencies.rb:332:in `block in require'
/usr/share/rubygems-integration/all/gems/activesupport-6.1.7.3/lib/active_support/dependencies.rb:299:in `load_dependency'
/usr/share/rubygems-integration/all/gems/activesupport-6.1.7.3/lib/active_support/dependencies.rb:332:in `require'
/build/reproducible-path/redmine-5.1.3+ds/config/initializers/10-patches.rb:161:in `<module:ActionController>'
/build/reproducible-path/redmine-5.1.3+ds/config/initializers/10-patches.rb:160:in `<top (required)>'
/usr/share/rubygems-integration/all/gems/activesupport-6.1.7.3/lib/active_support/dependencies.rb:326:in `load'
/usr/share/rubygems-integration/all/gems/activesupport-6.1.7.3/lib/active_support/dependencies.rb:326:in `block in load'
/usr/share/rubygems-integration/all/gems/activesupport-6.1.7.3/lib/active_support/dependencies.rb:299:in `load_dependency'
/usr/share/rubygems-integration/all/gems/activesupport-6.1.7.3/lib/active_support/dependencies.rb:326:in `load'
/usr/share/rubygems-integration/all/gems/railties-6.1.7.3/lib/rails/engine.rb:681:in `block in load_config_initializer'
/usr/share/rubygems-integration/all/gems/activesupport-6.1.7.3/lib/active_support/notifications.rb:205:in `instrument'
/usr/share/rubygems-integration/all/gems/railties-6.1.7.3/lib/rails/engine.rb:680:in `load_config_initializer'
/usr/share/rubygems-integration/all/gems/railties-6.1.7.3/lib/rails/engine.rb:634:in `block (2 levels) in <class:Engine>'
/usr/share/rubygems-integration/all/gems/railties-6.1.7.3/lib/rails/engine.rb:633:in `each'
/usr/share/rubygems-integration/all/gems/railties-6.1.7.3/lib/rails/engine.rb:633:in `block in <class:Engine>'
/usr/share/rubygems-integration/all/gems/railties-6.1.7.3/lib/rails/initializable.rb:32:in `instance_exec'
/usr/share/rubygems-integration/all/gems/railties-6.1.7.3/lib/rails/initializable.rb:32:in `run'
/usr/share/rubygems-integration/all/gems/railties-6.1.7.3/lib/rails/initializable.rb:61:in `block in run_initializers'
/usr/share/rubygems-integration/all/gems/railties-6.1.7.3/lib/rails/initializable.rb:50:in `each'
/usr/share/rubygems-integration/all/gems/railties-6.1.7.3/lib/rails/initializable.rb:50:in `tsort_each_child'
/usr/share/rubygems-integration/all/gems/railties-6.1.7.3/lib/rails/initializable.rb:60:in `run_initializers'
/usr/share/rubygems-integration/all/gems/railties-6.1.7.3/lib/rails/application.rb:391:in `initialize!'
/build/reproducible-path/redmine-5.1.3+ds/config/environment.rb:16:in `<top (required)>'
/usr/share/rubygems-integration/all/gems/zeitwerk-2.6.8/lib/zeitwerk/kernel.rb:38:in `require'
/usr/share/rubygems-integration/all/gems/activesupport-6.1.7.3/lib/active_support/dependencies.rb:332:in `block in require'
/usr/share/rubygems-integration/all/gems/activesupport-6.1.7.3/lib/active_support/dependencies.rb:299:in `load_dependency'
/usr/share/rubygems-integration/all/gems/activesupport-6.1.7.3/lib/active_support/dependencies.rb:332:in `require'
/usr/share/rubygems-integration/all/gems/railties-6.1.7.3/lib/rails/application.rb:367:in `require_environment!'
/usr/share/rubygems-integration/all/gems/railties-6.1.7.3/lib/rails/application.rb:533:in `block in run_tasks_blocks'
Tasks: TOP => db:migrate => db:load_config => environment
(See full trace by running task with --trace)
make[1]: *** [debian/rules:28: override_dh_auto_test] Error 1
make[1]: Leaving directory '/build/reproducible-path/redmine-5.1.3+ds'
make: *** [debian/rules:9: binary] Error 2
dpkg-buildpackage: error: debian/rules binary subprocess returned exit status 2
I: copying local configuration
E: Failed autobuilding of package
I: unmounting dev/ptmx filesystem
I: unmounting dev/pts filesystem
I: unmounting dev/shm filesystem
I: unmounting proc filesystem
I: unmounting sys filesystem
I: cleaning the build env 
I: removing directory /srv/workspace/pbuilder/25253 and its subdirectories
Thu Jan 30 05:16:52 UTC 2025  W: No second build log, what happened?