Mon Mar 17 06:56:57 UTC 2025  I: starting to build numpy/unstable/armhf on jenkins on '2025-03-17 06:56'
Mon Mar 17 06:56:57 UTC 2025  I: The jenkins build log is/was available at https://jenkins.debian.net/userContent/reproducible/debian/build_service/armhf_8/14471/console.log
Mon Mar 17 06:56:57 UTC 2025  I: Downloading source for unstable/numpy=1:2.2.3+ds-5
--2025-03-17 06:56:58--  http://deb.debian.org/debian/pool/main/n/numpy/numpy_2.2.3%2bds-5.dsc
Connecting to 46.16.76.132:3128... connected.
Proxy request sent, awaiting response... 200 OK
Length: 3615 (3.5K) [text/prs.lines.tag]
Saving to: ‘numpy_2.2.3+ds-5.dsc’

     0K ...                                                   100%  387M=0s

2025-03-17 06:56:58 (387 MB/s) - ‘numpy_2.2.3+ds-5.dsc’ saved [3615/3615]

Mon Mar 17 06:56:58 UTC 2025  I: numpy_2.2.3+ds-5.dsc
-----BEGIN PGP SIGNED MESSAGE-----
Hash: SHA512

Format: 3.0 (quilt)
Source: numpy
Binary: python3-numpy, python-numpy-doc, python3-numpy-dev
Architecture: any all
Version: 1:2.2.3+ds-5
Maintainer: Debian Python Team <team+python@tracker.debian.org>
Uploaders: Christian Kastner <ckk@debian.org>, Timo Röhling <roehling@debian.org>,
Homepage: http://www.numpy.org/
Description: Python library for numerical computations
 NumPy contains a powerful N-dimensional array object, sophisticated
 (broadcasting) functions, tools for integrating C/C++ and Fortran
 code, and useful linear algebra, Fourier transform, and random number
 capabilities.
Standards-Version: 4.7.2
Vcs-Browser: https://salsa.debian.org/python-team/packages/numpy
Vcs-Git: https://salsa.debian.org/python-team/packages/numpy.git
Testsuite: autopkgtest-pkg-pybuild
Build-Depends: debhelper-compat (= 13), dh-sequence-python3, cython3:native (>= 3.0), gfortran [amd64 arm64 ppc64el] <!nocheck>, libblas-dev [!arm !m68k], liblapack-dev [!arm !m68k], libpython3-all-dev, mypy <!nocheck>, ninja-build, pkgconf <!nocheck>, pybuild-plugin-pyproject, python3-all-dev:any, python3-charset-normalizer <!nocheck>, python3-hypothesis <!nocheck>, python3-mesonpy:native, python3-pyproject-metadata:native, python3-pytest <!nocheck>, python3-pytest-xdist <!nocheck>, python3-setuptools <!nocheck>, python3-typing-extensions (>= 4.2.0) <!nocheck>, python3-tz <!nocheck>, tzdata-legacy <!nocheck>
Build-Depends-Indep: dh-sequence-sphinxdoc <!nodoc>, doxygen <!nodoc>, python-imageio-doc <!nodoc>, python-pandas-doc <!nodoc>, python-pytest-doc <!nodoc>, python-scipy-doc <!nodoc>, python-skimage-doc <!nodoc>, python3-breathe <!nodoc>, python3-doc <!nodoc>, python3-ipython <!nodoc>, python3-numpydoc <!nodoc>, python3-pickleshare <!nodoc>, python3-pydata-sphinx-theme <!nodoc>, python3-sphinx <!nodoc>, python3-sphinx-copybutton <!nodoc>, python3-sphinx-design <!nodoc>
Package-List:
 python-numpy-doc deb doc optional arch=all profile=!nodoc
 python3-numpy deb python optional arch=any
 python3-numpy-dev deb python optional arch=any
Checksums-Sha1:
 681ded4ffa2cf4412cbbe9a812110a2888e11cd4 15188812 numpy_2.2.3+ds.orig.tar.xz
 066f5915ed6f9925e17c285f0ff05cb9254a20c5 159228 numpy_2.2.3+ds-5.debian.tar.xz
Checksums-Sha256:
 7e8b7f36d9540f9d62dde84201e2f0a430bbb09419dcd69a7a285d7015ba6505 15188812 numpy_2.2.3+ds.orig.tar.xz
 c0e7e5b2284898f8fc820360cb322fe2d06cb498839910f30b982f756c50a358 159228 numpy_2.2.3+ds-5.debian.tar.xz
Files:
 fe01847594c52c9b1eb7ff7c9b7f13ed 15188812 numpy_2.2.3+ds.orig.tar.xz
 f44e0021c154d12a7bae9d2dea551fc0 159228 numpy_2.2.3+ds-5.debian.tar.xz
Dgit: fe2281a554dc74131bfb5822df1211810be18fab debian archive/debian/1%2.2.3+ds-5 https://git.dgit.debian.org/numpy


-----BEGIN PGP SIGNATURE-----

iQJIBAEBCgAyFiEEmwPruYMA35fCsSO/zIxr3RQD9MoFAmfN+dQUHHJvZWhsaW5n
QGRlYmlhbi5vcmcACgkQzIxr3RQD9MqtDg//W+9EC7jK01yKnP1nG12w/W4Rti7B
coOILPezxSuWCSziSzCIO00iO4rHu7FHBbsi3Pp7W6xUYCFQcwyTtq88KcuhXDdg
vU8u9/UkwMYHBYSdyyfqc7GpFltX+XKkJ2tOrLzad46fvlekdToQAXcQQpZ27Ngv
8hpNQGDAvARkPjuWHhCvhFkrfjRrq4oawlV/mpA76JQP3rv0Rv4q37pSvx6I5Alo
RT6d4A9m1ELfVManqqFhfkwW55Ni5T2r+DFGqp4mcnJ/gzqzKKEONjX6TWz+g1iH
12Gbi5vS3jHe1yg2pYF9YyDvvD3v/QFCBIRdQgK4Ru21q0pFVWVKD2H3tS8dq4PI
BOoibIz8qiquKzlXgK9BiKY/0xX6JkAtQeap2zNmguza1qlmrXNTTChJCeMdcbt/
x1N8d+MF5NI36xdnwEumE0vUNmzsWYIxPqPdlgfiYFSMMQ2rnEv843lbMH8Ee3t9
RZLulyYb6C4+qju8YacBzZEpj4utDkfs6POpDVj8tYUzZ9yvZHDx1GgIWNs+DDD+
YStDdMMop8aQ2i3K3d2Ou7qgOF/+uuvb/E0P+UCbNIxWNBNFSnfxHeernIw771uM
jUQY8xV3acr4ZIaIfH7STCXbpuOdCTLX1VklrKYVLLS4+G9An3Rensw+10qWYiUb
W8lwuxBH2Dxe09A=
=cfzL
-----END PGP SIGNATURE-----
Mon Mar 17 06:56:58 UTC 2025  I: Checking whether the package is not for us
Mon Mar 17 06:56:58 UTC 2025  I: Starting 1st build on remote node virt64a-armhf-rb.debian.net.
Mon Mar 17 06:56:58 UTC 2025  I: Preparing to do remote build '1' on virt64a-armhf-rb.debian.net.
Mon Mar 17 07:01:54 UTC 2025  I: Deleting $TMPDIR on virt64a-armhf-rb.debian.net.
I: pbuilder: network access will be disabled during build
I: Current time: Sun Mar 16 18:57:42 -12 2025
I: pbuilder-time-stamp: 1742194662
I: Building the build Environment
I: extracting base tarball [/var/cache/pbuilder/unstable-reproducible-base.tgz]
I: copying local configuration
W: --override-config is not set; not updating apt.conf Read the manpage for details.
I: mounting /proc filesystem
I: mounting /sys filesystem
I: creating /{dev,run}/shm
I: mounting /dev/pts filesystem
I: redirecting /dev/ptmx to /dev/pts/ptmx
I: policy-rc.d already exists
I: Copying source file
I: copying [numpy_2.2.3+ds-5.dsc]
I: copying [./numpy_2.2.3+ds.orig.tar.xz]
I: copying [./numpy_2.2.3+ds-5.debian.tar.xz]
I: Extracting source
dpkg-source: warning: cannot verify inline signature for ./numpy_2.2.3+ds-5.dsc: unsupported subcommand
dpkg-source: info: extracting numpy in numpy-2.2.3+ds
dpkg-source: info: unpacking numpy_2.2.3+ds.orig.tar.xz
dpkg-source: info: unpacking numpy_2.2.3+ds-5.debian.tar.xz
dpkg-source: info: using patch list from debian/patches/series
dpkg-source: info: applying 0001-Disable-asserts-on-ppc-with-broken-malloc.patch
dpkg-source: info: applying 0002-usr-include-is-a-viable-include-dir.patch
dpkg-source: info: applying 0003-Ignore-invalid-value-runtime-warnings-in-tests.patch
dpkg-source: info: applying 0004-Use-a-local-copy-of-object.inv-from-doc.python.org.patch
dpkg-source: info: applying 0005-Adapt-SWIG-documentation-to-Debian.patch
dpkg-source: info: applying 0006-Disable-unsupported-add-ons-in-documentation.patch
dpkg-source: info: applying 0007-Disable-plots-to-avoid-circular-NumPy-dependency.patch
dpkg-source: info: applying 0008-Fix-numpy.get_include-for-cross-builds.patch
dpkg-source: info: applying 0009-Fix-random-object-filenames-for-reproducibility.patch
I: using fakeroot in build.
I: Installing the build-deps
I: user script /srv/workspace/pbuilder/7192/tmp/hooks/D02_print_environment starting
I: set
  BUILDDIR='/build/reproducible-path'
  BUILDUSERGECOS='first user,first room,first work-phone,first home-phone,first other'
  BUILDUSERNAME='pbuilder1'
  BUILD_ARCH='armhf'
  DEBIAN_FRONTEND='noninteractive'
  DEB_BUILD_OPTIONS='buildinfo=+all reproducible=+all parallel=3 '
  DISTRIBUTION='unstable'
  HOME='/root'
  HOST_ARCH='armhf'
  IFS=' 	
  '
  INVOCATION_ID='f829e8ae0b294021b4aa36ebab43ca29'
  LANG='C'
  LANGUAGE='en_US:en'
  LC_ALL='C'
  MAIL='/var/mail/root'
  OPTIND='1'
  PATH='/usr/sbin:/usr/bin:/sbin:/bin:/usr/games'
  PBCURRENTCOMMANDLINEOPERATION='build'
  PBUILDER_OPERATION='build'
  PBUILDER_PKGDATADIR='/usr/share/pbuilder'
  PBUILDER_PKGLIBDIR='/usr/lib/pbuilder'
  PBUILDER_SYSCONFDIR='/etc'
  PPID='7192'
  PS1='# '
  PS2='> '
  PS4='+ '
  PWD='/'
  SHELL='/bin/bash'
  SHLVL='2'
  SUDO_COMMAND='/usr/bin/timeout -k 18.1h 18h /usr/bin/ionice -c 3 /usr/bin/nice /usr/sbin/pbuilder --build --configfile /srv/reproducible-results/rbuild-debian/r-b-build.Z6P2FMGG/pbuilderrc_ySUY --distribution unstable --hookdir /etc/pbuilder/first-build-hooks --debbuildopts -b --basetgz /var/cache/pbuilder/unstable-reproducible-base.tgz --buildresult /srv/reproducible-results/rbuild-debian/r-b-build.Z6P2FMGG/b1 --logfile b1/build.log numpy_2.2.3+ds-5.dsc'
  SUDO_GID='114'
  SUDO_UID='108'
  SUDO_USER='jenkins'
  TERM='unknown'
  TZ='/usr/share/zoneinfo/Etc/GMT+12'
  USER='root'
  _='/usr/bin/systemd-run'
  http_proxy='http://10.0.0.15:3142/'
I: uname -a
  Linux virt64a 6.1.0-32-arm64 #1 SMP Debian 6.1.129-1 (2025-03-06) aarch64 GNU/Linux
I: ls -l /bin
  lrwxrwxrwx 1 root root 7 Mar  4 11:20 /bin -> usr/bin
I: user script /srv/workspace/pbuilder/7192/tmp/hooks/D02_print_environment finished
 -> Attempting to satisfy build-dependencies
 -> Creating pbuilder-satisfydepends-dummy package
Package: pbuilder-satisfydepends-dummy
Version: 0.invalid.0
Architecture: armhf
Maintainer: Debian Pbuilder Team <pbuilder-maint@lists.alioth.debian.org>
Description: Dummy package to satisfy dependencies with aptitude - created by pbuilder
 This package was created automatically by pbuilder to satisfy the
 build-dependencies of the package being currently built.
Depends: debhelper-compat (= 13), dh-sequence-python3, cython3:native (>= 3.0), libblas-dev, liblapack-dev, libpython3-all-dev, mypy, ninja-build, pkgconf, pybuild-plugin-pyproject, python3-all-dev:any, python3-charset-normalizer, python3-hypothesis, python3-mesonpy:native, python3-pyproject-metadata:native, python3-pytest, python3-pytest-xdist, python3-setuptools, python3-typing-extensions (>= 4.2.0), python3-tz, tzdata-legacy, dh-sequence-sphinxdoc, doxygen, python-imageio-doc, python-pandas-doc, python-pytest-doc, python-scipy-doc, python-skimage-doc, python3-breathe, python3-doc, python3-ipython, python3-numpydoc, python3-pickleshare, python3-pydata-sphinx-theme, python3-sphinx, python3-sphinx-copybutton, python3-sphinx-design
dpkg-deb: building package 'pbuilder-satisfydepends-dummy' in '/tmp/satisfydepends-aptitude/pbuilder-satisfydepends-dummy.deb'.
Selecting previously unselected package pbuilder-satisfydepends-dummy.
(Reading database ... 19509 files and directories currently installed.)
Preparing to unpack .../pbuilder-satisfydepends-dummy.deb ...
Unpacking pbuilder-satisfydepends-dummy (0.invalid.0) ...
dpkg: pbuilder-satisfydepends-dummy: dependency problems, but configuring anyway as you requested:
 pbuilder-satisfydepends-dummy depends on debhelper-compat (= 13); however:
  Package debhelper-compat is not installed.
 pbuilder-satisfydepends-dummy depends on dh-sequence-python3; however:
  Package dh-sequence-python3 is not installed.
 pbuilder-satisfydepends-dummy depends on cython3:native (>= 3.0).
 pbuilder-satisfydepends-dummy depends on libblas-dev; however:
  Package libblas-dev is not installed.
 pbuilder-satisfydepends-dummy depends on liblapack-dev; however:
  Package liblapack-dev is not installed.
 pbuilder-satisfydepends-dummy depends on libpython3-all-dev; however:
  Package libpython3-all-dev is not installed.
 pbuilder-satisfydepends-dummy depends on mypy; however:
  Package mypy is not installed.
 pbuilder-satisfydepends-dummy depends on ninja-build; however:
  Package ninja-build is not installed.
 pbuilder-satisfydepends-dummy depends on pkgconf; however:
  Package pkgconf is not installed.
 pbuilder-satisfydepends-dummy depends on pybuild-plugin-pyproject; however:
  Package pybuild-plugin-pyproject is not installed.
 pbuilder-satisfydepends-dummy depends on python3-all-dev:any.
 pbuilder-satisfydepends-dummy depends on python3-charset-normalizer; however:
  Package python3-charset-normalizer is not installed.
 pbuilder-satisfydepends-dummy depends on python3-hypothesis; however:
  Package python3-hypothesis is not installed.
 pbuilder-satisfydepends-dummy depends on python3-mesonpy:native.
 pbuilder-satisfydepends-dummy depends on python3-pyproject-metadata:native.
 pbuilder-satisfydepends-dummy depends on python3-pytest; however:
  Package python3-pytest is not installed.
 pbuilder-satisfydepends-dummy depends on python3-pytest-xdist; however:
  Package python3-pytest-xdist is not installed.
 pbuilder-satisfydepends-dummy depends on python3-setuptools; however:
  Package python3-setuptools is not installed.
 pbuilder-satisfydepends-dummy depends on python3-typing-extensions (>= 4.2.0); however:
  Package python3-typing-extensions is not installed.
 pbuilder-satisfydepends-dummy depends on python3-tz; however:
  Package python3-tz is not installed.
 pbuilder-satisfydepends-dummy depends on tzdata-legacy; however:
  Package tzdata-legacy is not installed.
 pbuilder-satisfydepends-dummy depends on dh-sequence-sphinxdoc; however:
  Package dh-sequence-sphinxdoc is not installed.
 pbuilder-satisfydepends-dummy depends on doxygen; however:
  Package doxygen is not installed.
 pbuilder-satisfydepends-dummy depends on python-imageio-doc; however:
  Package python-imageio-doc is not installed.
 pbuilder-satisfydepends-dummy depends on python-pandas-doc; however:
  Package python-pandas-doc is not installed.
 pbuilder-satisfydepends-dummy depends on python-pytest-doc; however:
  Package python-pytest-doc is not installed.
 pbuilder-satisfydepends-dummy depends on python-scipy-doc; however:
  Package python-scipy-doc is not installed.
 pbuilder-satisfydepends-dummy depends on python-skimage-doc; however:
  Package python-skimage-doc is not installed.
 pbuilder-satisfydepends-dummy depends on python3-breathe; however:
  Package python3-breathe is not installed.
 pbuilder-satisfydepends-dummy depends on python3-doc; however:
  Package python3-doc is not installed.
 pbuilder-satisfydepends-dummy depends on python3-ipython; however:
  Package python3-ipython is not installed.
 pbuilder-satisfydepends-dummy depends on python3-numpydoc; however:
  Package python3-numpydoc is not installed.
 pbuilder-satisfydepends-dummy depends on python3-pickleshare; however:
  Package python3-pickleshare is not installed.
 pbuilder-satisfydepends-dummy depends on python3-pydata-sphinx-theme; however:
  Package python3-pydata-sphinx-theme is not installed.
 pbuilder-satisfydepends-dummy depends on python3-sphinx; however:
  Package python3-sphinx is not installed.
 pbuilder-satisfydepends-dummy depends on python3-sphinx-copybutton; however:
  Package python3-sphinx-copybutton is not installed.
 pbuilder-satisfydepends-dummy depends on python3-sphinx-design; however:
  Package python3-sphinx-design is not installed.

Setting up pbuilder-satisfydepends-dummy (0.invalid.0) ...
Reading package lists...
Building dependency tree...
Reading state information...
Initializing package states...
Writing extended state information...
Building tag database...
pbuilder-satisfydepends-dummy is already installed at the requested version (0.invalid.0)
pbuilder-satisfydepends-dummy is already installed at the requested version (0.invalid.0)
The following NEW packages will be installed:
  autoconf{a} automake{a} autopoint{a} autotools-dev{a} bsdextrautils{a} ca-certificates{a} cython3{a} debhelper{a} dh-autoreconf{a} dh-python{a} dh-strip-nondeterminism{a} docutils-common{a} doxygen{a} dwz{a} file{a} fontconfig{a} fontconfig-config{a} fonts-dejavu-core{a} fonts-dejavu-mono{a} fonts-glyphicons-halflings{a} fonts-mathjax{a} fonts-open-sans{a} gettext{a} gettext-base{a} graphviz{a} groff-base{a} intltool-debian{a} libabsl20240722{a} libaom3{a} libarchive-zip-perl{a} libavif16{a} libblas-dev{a} libblas3{a} libbrotli1{a} libcairo2{a} libcdt5{a} libcgraph6{a} libclang-cpp19{a} libclang1-19{a} libdatrie1{a} libdav1d7{a} libde265-0{a} libdebhelper-perl{a} libdeflate0{a} libedit2{a} libelf1t64{a} libexpat1{a} libexpat1-dev{a} libffi8{a} libfile-stripnondeterminism-perl{a} libfmt10{a} libfontconfig1{a} libfreetype6{a} libfribidi0{a} libgav1-1{a} libgd3{a} libgfortran5{a} libglib2.0-0t64{a} libgraphite2-3{a} libgts-0.7-5t64{a} libgvc6{a} libgvpr2{a} libharfbuzz0b{a} libheif-plugin-dav1d{a} libheif-plugin-libde265{a} libheif1{a} libice6{a} libicu76{a} libimagequant0{a} libjbig0{a} libjpeg62-turbo{a} libjs-bootstrap{a} libjs-jquery{a} libjs-mathjax{a} libjs-sphinxdoc{a} libjs-underscore{a} libjson-perl{a} liblab-gamut1{a} liblapack-dev{a} liblapack3{a} liblerc4{a} libllvm19{a} libltdl7{a} libmagic-mgc{a} libmagic1t64{a} libpango-1.0-0{a} libpangocairo-1.0-0{a} libpangoft2-1.0-0{a} libpathplan4{a} libpipeline1{a} libpixman-1-0{a} libpkgconf3{a} libpng16-16t64{a} libpython3-all-dev{a} libpython3-dev{a} libpython3-stdlib{a} libpython3.13{a} libpython3.13-dev{a} libpython3.13-minimal{a} libpython3.13-stdlib{a} libraqm0{a} librav1e0.7{a} libreadline8t64{a} libsharpyuv0{a} libsm6{a} libsvtav1enc2{a} libthai-data{a} libthai0{a} libtiff6{a} libtool{a} libuchardet0{a} libunistring5{a} libwebp7{a} libx11-6{a} libx11-data{a} libxau6{a} libxaw7{a} libxcb-render0{a} libxcb-shm0{a} libxcb1{a} libxdmcp6{a} libxext6{a} libxml2{a} libxmu6{a} libxpm4{a} libxrender1{a} libxt6t64{a} libyuv0{a} libz3-4{a} m4{a} man-db{a} media-types{a} meson{a} mypy{a} netbase{a} ninja-build{a} node-fortawesome-fontawesome-free{a} openssl{a} pkgconf{a} pkgconf-bin{a} po-debconf{a} pybuild-plugin-pyproject{a} python-babel-localedata{a} python-imageio-doc{a} python-pandas-doc{a} python-pytest-doc{a} python-scipy-doc{a} python-skimage-doc{a} python3{a} python3-accessible-pygments{a} python3-alabaster{a} python3-all{a} python3-all-dev{a} python3-asttokens{a} python3-attr{a} python3-autocommand{a} python3-babel{a} python3-breathe{a} python3-bs4{a} python3-build{a} python3-certifi{a} python3-chardet{a} python3-charset-normalizer{a} python3-dateutil{a} python3-decorator{a} python3-defusedxml{a} python3-dev{a} python3-doc{a} python3-docutils{a} python3-execnet{a} python3-executing{a} python3-hypothesis{a} python3-idna{a} python3-imagesize{a} python3-inflect{a} python3-iniconfig{a} python3-installer{a} python3-ipython{a} python3-jaraco.context{a} python3-jaraco.functools{a} python3-jaraco.text{a} python3-jedi{a} python3-jinja2{a} python3-markupsafe{a} python3-matplotlib-inline{a} python3-mesonpy{a} python3-minimal{a} python3-more-itertools{a} python3-mypy{a} python3-mypy-extensions{a} python3-numpydoc{a} python3-packaging{a} python3-parso{a} python3-pexpect{a} python3-pickleshare{a} python3-pkg-resources{a} python3-pluggy{a} python3-prompt-toolkit{a} python3-psutil{a} python3-ptyprocess{a} python3-pure-eval{a} python3-pydata-sphinx-theme{a} python3-pygments{a} python3-pyproject-hooks{a} python3-pyproject-metadata{a} python3-pytest{a} python3-pytest-xdist{a} python3-pytz{a} python3-requests{a} python3-roman{a} python3-setuptools{a} python3-snowballstemmer{a} python3-sortedcontainers{a} python3-soupsieve{a} python3-sphinx{a} python3-sphinx-copybutton{a} python3-sphinx-design{a} python3-stack-data{a} python3-tabulate{a} python3-toml{a} python3-traitlets{a} python3-typeguard{a} python3-typeshed{a} python3-typing-extensions{a} python3-tz{a} python3-urllib3{a} python3-wcwidth{a} python3-wheel{a} python3-zipp{a} python3.13{a} python3.13-dev{a} python3.13-doc{a} python3.13-minimal{a} readline-common{a} sensible-utils{a} sgml-base{a} sphinx-common{a} tzdata{a} tzdata-legacy{a} x11-common{a} xml-core{a} zlib1g-dev{a} 
The following packages are RECOMMENDED but will NOT be installed:
  curl fonts-liberation javascript-common libarchive-cpio-perl libglib2.0-data libgts-bin libheif-plugin-aomenc libheif-plugin-x265 libjson-xs-perl libltdl-dev libmail-sendmail-perl libpaper-utils lynx patchelf python3-click python3-lxml python3-matplotlib python3-orjson python3-pil shared-mime-info wget xdg-user-dirs 
0 packages upgraded, 242 newly installed, 0 to remove and 0 not upgraded.
Need to get 206 MB of archives. After unpacking 1164 MB will be used.
Writing extended state information...
Get: 1 http://deb.debian.org/debian unstable/main armhf libpython3.13-minimal armhf 3.13.2-2 [846 kB]
Get: 2 http://deb.debian.org/debian unstable/main armhf libexpat1 armhf 2.7.0-1 [85.2 kB]
Get: 3 http://deb.debian.org/debian unstable/main armhf python3.13-minimal armhf 3.13.2-2 [1840 kB]
Get: 4 http://deb.debian.org/debian unstable/main armhf python3-minimal armhf 3.13.2-2 [27.1 kB]
Get: 5 http://deb.debian.org/debian unstable/main armhf media-types all 13.0.0 [29.3 kB]
Get: 6 http://deb.debian.org/debian unstable/main armhf netbase all 6.5 [12.4 kB]
Get: 7 http://deb.debian.org/debian unstable/main armhf tzdata all 2025a-2 [259 kB]
Get: 8 http://deb.debian.org/debian unstable/main armhf libffi8 armhf 3.4.7-1 [20.3 kB]
Get: 9 http://deb.debian.org/debian unstable/main armhf readline-common all 8.2-6 [69.4 kB]
Get: 10 http://deb.debian.org/debian unstable/main armhf libreadline8t64 armhf 8.2-6 [146 kB]
Get: 11 http://deb.debian.org/debian unstable/main armhf libpython3.13-stdlib armhf 3.13.2-2 [1826 kB]
Get: 12 http://deb.debian.org/debian unstable/main armhf python3.13 armhf 3.13.2-2 [746 kB]
Get: 13 http://deb.debian.org/debian unstable/main armhf libpython3-stdlib armhf 3.13.2-2 [10.1 kB]
Get: 14 http://deb.debian.org/debian unstable/main armhf python3 armhf 3.13.2-2 [28.1 kB]
Get: 15 http://deb.debian.org/debian unstable/main armhf sgml-base all 1.31 [15.4 kB]
Get: 16 http://deb.debian.org/debian unstable/main armhf sensible-utils all 0.0.24 [24.8 kB]
Get: 17 http://deb.debian.org/debian unstable/main armhf openssl armhf 3.4.1-1 [1393 kB]
Get: 18 http://deb.debian.org/debian unstable/main armhf ca-certificates all 20241223 [164 kB]
Get: 19 http://deb.debian.org/debian unstable/main armhf libmagic-mgc armhf 1:5.46-2 [337 kB]
Get: 20 http://deb.debian.org/debian unstable/main armhf libmagic1t64 armhf 1:5.46-2 [99.9 kB]
Get: 21 http://deb.debian.org/debian unstable/main armhf file armhf 1:5.46-2 [42.6 kB]
Get: 22 http://deb.debian.org/debian unstable/main armhf gettext-base armhf 0.23.1-1 [238 kB]
Get: 23 http://deb.debian.org/debian unstable/main armhf libuchardet0 armhf 0.0.8-1+b2 [65.6 kB]
Get: 24 http://deb.debian.org/debian unstable/main armhf groff-base armhf 1.23.0-7 [1095 kB]
Get: 25 http://deb.debian.org/debian unstable/main armhf bsdextrautils armhf 2.40.4-5 [84.9 kB]
Get: 26 http://deb.debian.org/debian unstable/main armhf libpipeline1 armhf 1.5.8-1 [35.0 kB]
Get: 27 http://deb.debian.org/debian unstable/main armhf man-db armhf 2.13.0-1 [1382 kB]
Get: 28 http://deb.debian.org/debian unstable/main armhf m4 armhf 1.4.19-7 [272 kB]
Get: 29 http://deb.debian.org/debian unstable/main armhf autoconf all 2.72-3 [493 kB]
Get: 30 http://deb.debian.org/debian unstable/main armhf autotools-dev all 20220109.1 [51.6 kB]
Get: 31 http://deb.debian.org/debian unstable/main armhf automake all 1:1.17-3 [862 kB]
Get: 32 http://deb.debian.org/debian unstable/main armhf autopoint all 0.23.1-1 [770 kB]
Get: 33 http://deb.debian.org/debian unstable/main armhf cython3 armhf 3.0.11+dfsg-2+b1 [2329 kB]
Get: 34 http://deb.debian.org/debian unstable/main armhf libdebhelper-perl all 13.24.1 [90.9 kB]
Get: 35 http://deb.debian.org/debian unstable/main armhf libtool all 2.5.4-4 [539 kB]
Get: 36 http://deb.debian.org/debian unstable/main armhf dh-autoreconf all 20 [17.1 kB]
Get: 37 http://deb.debian.org/debian unstable/main armhf libarchive-zip-perl all 1.68-1 [104 kB]
Get: 38 http://deb.debian.org/debian unstable/main armhf libfile-stripnondeterminism-perl all 1.14.1-2 [19.7 kB]
Get: 39 http://deb.debian.org/debian unstable/main armhf dh-strip-nondeterminism all 1.14.1-2 [8620 B]
Get: 40 http://deb.debian.org/debian unstable/main armhf libelf1t64 armhf 0.192-4 [184 kB]
Get: 41 http://deb.debian.org/debian unstable/main armhf dwz armhf 0.15-1+b2 [106 kB]
Get: 42 http://deb.debian.org/debian unstable/main armhf libunistring5 armhf 1.3-1 [444 kB]
Get: 43 http://deb.debian.org/debian unstable/main armhf libicu76 armhf 76.1-3 [9368 kB]
Get: 44 http://deb.debian.org/debian unstable/main armhf libxml2 armhf 2.12.7+dfsg+really2.9.14-0.3+b1 [605 kB]
Get: 45 http://deb.debian.org/debian unstable/main armhf gettext armhf 0.23.1-1 [1560 kB]
Get: 46 http://deb.debian.org/debian unstable/main armhf intltool-debian all 0.35.0+20060710.6 [22.9 kB]
Get: 47 http://deb.debian.org/debian unstable/main armhf po-debconf all 1.0.21+nmu1 [248 kB]
Get: 48 http://deb.debian.org/debian unstable/main armhf debhelper all 13.24.1 [920 kB]
Get: 49 http://deb.debian.org/debian unstable/main armhf dh-python all 6.20250308 [115 kB]
Get: 50 http://deb.debian.org/debian unstable/main armhf xml-core all 0.19 [20.1 kB]
Get: 51 http://deb.debian.org/debian unstable/main armhf docutils-common all 0.21.2+dfsg-2 [128 kB]
Get: 52 http://deb.debian.org/debian unstable/main armhf libedit2 armhf 3.1-20250104-1 [78.0 kB]
Get: 53 http://deb.debian.org/debian unstable/main armhf libz3-4 armhf 4.13.3-1 [7252 kB]
Get: 54 http://deb.debian.org/debian unstable/main armhf libllvm19 armhf 1:19.1.7-3 [23.8 MB]
Get: 55 http://deb.debian.org/debian unstable/main armhf libclang-cpp19 armhf 1:19.1.7-3 [11.6 MB]
Get: 56 http://deb.debian.org/debian unstable/main armhf libclang1-19 armhf 1:19.1.7-3 [6612 kB]
Get: 57 http://deb.debian.org/debian unstable/main armhf libfmt10 armhf 10.1.1+ds1-4 [118 kB]
Get: 58 http://deb.debian.org/debian unstable/main armhf doxygen armhf 1.9.8+ds-2.1 [4508 kB]
Get: 59 http://deb.debian.org/debian unstable/main armhf libbrotli1 armhf 1.1.0-2+b7 [284 kB]
Get: 60 http://deb.debian.org/debian unstable/main armhf libpng16-16t64 armhf 1.6.47-1.1 [264 kB]
Get: 61 http://deb.debian.org/debian unstable/main armhf libfreetype6 armhf 2.13.3+dfsg-1 [385 kB]
Get: 62 http://deb.debian.org/debian unstable/main armhf fonts-dejavu-mono all 2.37-8 [489 kB]
Get: 63 http://deb.debian.org/debian unstable/main armhf fonts-dejavu-core all 2.37-8 [840 kB]
Get: 64 http://deb.debian.org/debian unstable/main armhf fontconfig-config armhf 2.15.0-2.1 [318 kB]
Get: 65 http://deb.debian.org/debian unstable/main armhf libfontconfig1 armhf 2.15.0-2.1 [371 kB]
Get: 66 http://deb.debian.org/debian unstable/main armhf fontconfig armhf 2.15.0-2.1 [462 kB]
Get: 67 http://deb.debian.org/debian unstable/main armhf fonts-glyphicons-halflings all 1.009~3.4.1+dfsg-3 [162 kB]
Get: 68 http://deb.debian.org/debian unstable/main armhf fonts-mathjax all 2.7.9+dfsg-1 [2210 kB]
Get: 69 http://deb.debian.org/debian unstable/main armhf fonts-open-sans all 1.11-2 [574 kB]
Get: 70 http://deb.debian.org/debian unstable/main armhf libcdt5 armhf 2.42.4-3 [37.8 kB]
Get: 71 http://deb.debian.org/debian unstable/main armhf libcgraph6 armhf 2.42.4-3 [56.7 kB]
Get: 72 http://deb.debian.org/debian unstable/main armhf libaom3 armhf 3.12.0-1 [1147 kB]
Get: 73 http://deb.debian.org/debian unstable/main armhf libdav1d7 armhf 1.5.1-1 [268 kB]
Get: 74 http://deb.debian.org/debian unstable/main armhf libabsl20240722 armhf 20240722.0-1.5 [458 kB]
Get: 75 http://deb.debian.org/debian unstable/main armhf libgav1-1 armhf 0.19.0-3+b1 [295 kB]
Get: 76 http://deb.debian.org/debian unstable/main armhf librav1e0.7 armhf 0.7.1-9+b1 [596 kB]
Get: 77 http://deb.debian.org/debian unstable/main armhf libsvtav1enc2 armhf 2.3.0+dfsg-1 [970 kB]
Get: 78 http://deb.debian.org/debian unstable/main armhf libjpeg62-turbo armhf 1:2.1.5-3.1 [145 kB]
Get: 79 http://deb.debian.org/debian unstable/main armhf libyuv0 armhf 0.0.1904.20250204-1 [87.3 kB]
Get: 80 http://deb.debian.org/debian unstable/main armhf libavif16 armhf 1.2.0-1 [117 kB]
Get: 81 http://deb.debian.org/debian unstable/main armhf libsharpyuv0 armhf 1.5.0-0.1 [114 kB]
Get: 82 http://deb.debian.org/debian unstable/main armhf libheif-plugin-dav1d armhf 1.19.7-1 [11.1 kB]
Get: 83 http://deb.debian.org/debian unstable/main armhf libde265-0 armhf 1.0.15-1+b3 [145 kB]
Get: 84 http://deb.debian.org/debian unstable/main armhf libheif-plugin-libde265 armhf 1.19.7-1 [14.3 kB]
Get: 85 http://deb.debian.org/debian unstable/main armhf libheif1 armhf 1.19.7-1 [435 kB]
Get: 86 http://deb.debian.org/debian unstable/main armhf libimagequant0 armhf 2.18.0-1+b2 [30.5 kB]
Get: 87 http://deb.debian.org/debian unstable/main armhf libfribidi0 armhf 1.0.16-1 [24.6 kB]
Get: 88 http://deb.debian.org/debian unstable/main armhf libglib2.0-0t64 armhf 2.84.0-2 [1338 kB]
Get: 89 http://deb.debian.org/debian unstable/main armhf libgraphite2-3 armhf 1.3.14-2+b1 [63.1 kB]
Get: 90 http://deb.debian.org/debian unstable/main armhf libharfbuzz0b armhf 10.2.0-1+b1 [419 kB]
Get: 91 http://deb.debian.org/debian unstable/main armhf libraqm0 armhf 0.10.2-1 [11.6 kB]
Get: 92 http://deb.debian.org/debian unstable/main armhf libdeflate0 armhf 1.23-1+b1 [36.7 kB]
Get: 93 http://deb.debian.org/debian unstable/main armhf libjbig0 armhf 2.1-6.1+b2 [27.3 kB]
Get: 94 http://deb.debian.org/debian unstable/main armhf liblerc4 armhf 4.0.0+ds-5 [146 kB]
Get: 95 http://deb.debian.org/debian unstable/main armhf libwebp7 armhf 1.5.0-0.1 [273 kB]
Get: 96 http://deb.debian.org/debian unstable/main armhf libtiff6 armhf 4.5.1+git230720-5 [302 kB]
Get: 97 http://deb.debian.org/debian unstable/main armhf libxau6 armhf 1:1.0.11-1 [19.7 kB]
Get: 98 http://deb.debian.org/debian unstable/main armhf libxdmcp6 armhf 1:1.1.5-1 [26.4 kB]
Get: 99 http://deb.debian.org/debian unstable/main armhf libxcb1 armhf 1.17.0-2+b1 [140 kB]
Get: 100 http://deb.debian.org/debian unstable/main armhf libx11-data all 2:1.8.10-2 [337 kB]
Get: 101 http://deb.debian.org/debian unstable/main armhf libx11-6 armhf 2:1.8.10-2 [750 kB]
Get: 102 http://deb.debian.org/debian unstable/main armhf libxpm4 armhf 1:3.5.17-1+b3 [50.3 kB]
Get: 103 http://deb.debian.org/debian unstable/main armhf libgd3 armhf 2.3.3-12+b1 [105 kB]
Get: 104 http://deb.debian.org/debian unstable/main armhf libgts-0.7-5t64 armhf 0.7.6+darcs121130-5.2+b1 [133 kB]
Get: 105 http://deb.debian.org/debian unstable/main armhf libpixman-1-0 armhf 0.44.0-3 [164 kB]
Get: 106 http://deb.debian.org/debian unstable/main armhf libxcb-render0 armhf 1.17.0-2+b1 [114 kB]
Get: 107 http://deb.debian.org/debian unstable/main armhf libxcb-shm0 armhf 1.17.0-2+b1 [105 kB]
Get: 108 http://deb.debian.org/debian unstable/main armhf libxext6 armhf 2:1.3.4-1+b3 [45.2 kB]
Get: 109 http://deb.debian.org/debian unstable/main armhf libxrender1 armhf 1:0.9.10-1.1+b4 [25.0 kB]
Get: 110 http://deb.debian.org/debian unstable/main armhf libcairo2 armhf 1.18.4-1+b1 [443 kB]
Get: 111 http://deb.debian.org/debian unstable/main armhf libltdl7 armhf 2.5.4-4 [413 kB]
Get: 112 http://deb.debian.org/debian unstable/main armhf libthai-data all 0.1.29-2 [168 kB]
Get: 113 http://deb.debian.org/debian unstable/main armhf libdatrie1 armhf 0.2.13-3+b1 [34.7 kB]
Get: 114 http://deb.debian.org/debian unstable/main armhf libthai0 armhf 0.1.29-2+b1 [46.0 kB]
Get: 115 http://deb.debian.org/debian unstable/main armhf libpango-1.0-0 armhf 1.56.2-1 [201 kB]
Get: 116 http://deb.debian.org/debian unstable/main armhf libpangoft2-1.0-0 armhf 1.56.2-1 [48.7 kB]
Get: 117 http://deb.debian.org/debian unstable/main armhf libpangocairo-1.0-0 armhf 1.56.2-1 [31.8 kB]
Get: 118 http://deb.debian.org/debian unstable/main armhf libpathplan4 armhf 2.42.4-3 [39.7 kB]
Get: 119 http://deb.debian.org/debian unstable/main armhf libgvc6 armhf 2.42.4-3 [582 kB]
Get: 120 http://deb.debian.org/debian unstable/main armhf libgvpr2 armhf 2.42.4-3 [168 kB]
Get: 121 http://deb.debian.org/debian unstable/main armhf liblab-gamut1 armhf 2.42.4-3 [198 kB]
Get: 122 http://deb.debian.org/debian unstable/main armhf x11-common all 1:7.7+24 [217 kB]
Get: 123 http://deb.debian.org/debian unstable/main armhf libice6 armhf 2:1.1.1-1 [58.5 kB]
Get: 124 http://deb.debian.org/debian unstable/main armhf libsm6 armhf 2:1.2.4-1 [33.5 kB]
Get: 125 http://deb.debian.org/debian unstable/main armhf libxt6t64 armhf 1:1.2.1-1.2+b2 [160 kB]
Get: 126 http://deb.debian.org/debian unstable/main armhf libxmu6 armhf 2:1.1.3-3+b4 [51.2 kB]
Get: 127 http://deb.debian.org/debian unstable/main armhf libxaw7 armhf 2:1.0.16-1 [177 kB]
Get: 128 http://deb.debian.org/debian unstable/main armhf graphviz armhf 2.42.4-3 [505 kB]
Get: 129 http://deb.debian.org/debian unstable/main armhf libblas3 armhf 3.12.1-2 [116 kB]
Get: 130 http://deb.debian.org/debian unstable/main armhf libblas-dev armhf 3.12.1-2 [127 kB]
Get: 131 http://deb.debian.org/debian unstable/main armhf libexpat1-dev armhf 2.7.0-1 [142 kB]
Get: 132 http://deb.debian.org/debian unstable/main armhf libgfortran5 armhf 14.2.0-19 [263 kB]
Get: 133 http://deb.debian.org/debian unstable/main armhf libjs-bootstrap all 3.4.1+dfsg-3 [172 kB]
Get: 134 http://deb.debian.org/debian unstable/main armhf libjs-jquery all 3.6.1+dfsg+~3.5.14-1 [326 kB]
Get: 135 http://deb.debian.org/debian unstable/main armhf libjs-mathjax all 2.7.9+dfsg-1 [5667 kB]
Get: 136 http://deb.debian.org/debian unstable/main armhf libjs-underscore all 1.13.4~dfsg+~1.11.4-3 [116 kB]
Get: 137 http://deb.debian.org/debian unstable/main armhf libjs-sphinxdoc all 8.1.3-5 [30.5 kB]
Get: 138 http://deb.debian.org/debian unstable/main armhf libjson-perl all 4.10000-1 [87.5 kB]
Get: 139 http://deb.debian.org/debian unstable/main armhf liblapack3 armhf 3.12.1-2 [1835 kB]
Get: 140 http://deb.debian.org/debian unstable/main armhf liblapack-dev armhf 3.12.1-2 [1935 kB]
Get: 141 http://deb.debian.org/debian unstable/main armhf libpkgconf3 armhf 1.8.1-4 [31.8 kB]
Get: 142 http://deb.debian.org/debian unstable/main armhf libpython3.13 armhf 3.13.2-2 [1873 kB]
Get: 143 http://deb.debian.org/debian unstable/main armhf zlib1g-dev armhf 1:1.3.dfsg+really1.3.1-1+b1 [905 kB]
Get: 144 http://deb.debian.org/debian unstable/main armhf libpython3.13-dev armhf 3.13.2-2 [3791 kB]
Get: 145 http://deb.debian.org/debian unstable/main armhf libpython3-dev armhf 3.13.2-2 [10.3 kB]
Get: 146 http://deb.debian.org/debian unstable/main armhf libpython3-all-dev armhf 3.13.2-2 [1068 B]
Get: 147 http://deb.debian.org/debian unstable/main armhf ninja-build armhf 1.12.1-1 [125 kB]
Get: 148 http://deb.debian.org/debian unstable/main armhf python3-autocommand all 2.2.2-3 [13.6 kB]
Get: 149 http://deb.debian.org/debian unstable/main armhf python3-more-itertools all 10.6.0-1 [65.3 kB]
Get: 150 http://deb.debian.org/debian unstable/main armhf python3-typing-extensions all 4.12.2-2 [73.0 kB]
Get: 151 http://deb.debian.org/debian unstable/main armhf python3-typeguard all 4.4.2-1 [37.3 kB]
Get: 152 http://deb.debian.org/debian unstable/main armhf python3-inflect all 7.3.1-2 [32.4 kB]
Get: 153 http://deb.debian.org/debian unstable/main armhf python3-jaraco.context all 6.0.1-1 [8276 B]
Get: 154 http://deb.debian.org/debian unstable/main armhf python3-jaraco.functools all 4.1.0-1 [12.0 kB]
Get: 155 http://deb.debian.org/debian unstable/main armhf python3-pkg-resources all 75.8.0-1 [222 kB]
Get: 156 http://deb.debian.org/debian unstable/main armhf python3-jaraco.text all 4.0.0-1 [11.4 kB]
Get: 157 http://deb.debian.org/debian unstable/main armhf python3-zipp all 3.21.0-1 [10.6 kB]
Get: 158 http://deb.debian.org/debian unstable/main armhf python3-setuptools all 75.8.0-1 [724 kB]
Get: 159 http://deb.debian.org/debian unstable/main armhf meson all 1.7.0-1 [639 kB]
Get: 160 http://deb.debian.org/debian unstable/main armhf python3-mypy-extensions all 1.0.0-1 [6064 B]
Get: 161 http://deb.debian.org/debian unstable/main armhf python3-psutil armhf 5.9.8-2 [225 kB]
Get: 162 http://deb.debian.org/debian unstable/main armhf python3-mypy armhf 1.15.0-4+b1 [8465 kB]
Get: 163 http://deb.debian.org/debian unstable/main armhf mypy all 1.15.0-4 [76.1 kB]
Get: 164 http://deb.debian.org/debian unstable/main armhf node-fortawesome-fontawesome-free all 6.7.2+ds1-1 [1521 kB]
Get: 165 http://deb.debian.org/debian unstable/main armhf pkgconf-bin armhf 1.8.1-4 [29.2 kB]
Get: 166 http://deb.debian.org/debian unstable/main armhf pkgconf armhf 1.8.1-4 [26.1 kB]
Get: 167 http://deb.debian.org/debian unstable/main armhf python3-packaging all 24.2-1 [55.3 kB]
Get: 168 http://deb.debian.org/debian unstable/main armhf python3-pyproject-hooks all 1.2.0-1 [11.7 kB]
Get: 169 http://deb.debian.org/debian unstable/main armhf python3-toml all 0.10.2-1 [16.2 kB]
Get: 170 http://deb.debian.org/debian unstable/main armhf python3-wheel all 0.45.1-1 [56.7 kB]
Get: 171 http://deb.debian.org/debian unstable/main armhf python3-build all 1.2.2-1 [36.0 kB]
Get: 172 http://deb.debian.org/debian unstable/main armhf python3-installer all 0.7.0+dfsg1-3 [18.6 kB]
Get: 173 http://deb.debian.org/debian unstable/main armhf pybuild-plugin-pyproject all 6.20250308 [11.7 kB]
Get: 174 http://deb.debian.org/debian unstable/main armhf python-babel-localedata all 2.17.0-1 [6050 kB]
Get: 175 http://deb.debian.org/debian unstable/main armhf python-imageio-doc all 2.37.0-1 [150 kB]
Get: 176 http://deb.debian.org/debian unstable/main armhf python-pandas-doc all 2.2.3+dfsg-8 [10.8 MB]
Get: 177 http://deb.debian.org/debian unstable/main armhf python-pytest-doc all 8.3.5-1 [1247 kB]
Get: 178 http://deb.debian.org/debian unstable/main armhf python-scipy-doc all 1.15.2-5 [24.3 MB]
Get: 179 http://deb.debian.org/debian unstable/main armhf python-skimage-doc all 0.25.2-1 [2478 kB]
Get: 180 http://deb.debian.org/debian unstable/main armhf python3-pygments all 2.18.0+dfsg-2 [836 kB]
Get: 181 http://deb.debian.org/debian unstable/main armhf python3-accessible-pygments all 0.0.5-2 [1306 kB]
Get: 182 http://deb.debian.org/debian unstable/main armhf python3-alabaster all 0.7.16-0.1 [27.9 kB]
Get: 183 http://deb.debian.org/debian unstable/main armhf python3-all armhf 3.13.2-2 [1044 B]
Get: 184 http://deb.debian.org/debian unstable/main armhf python3.13-dev armhf 3.13.2-2 [507 kB]
Get: 185 http://deb.debian.org/debian unstable/main armhf python3-dev armhf 3.13.2-2 [26.1 kB]
Get: 186 http://deb.debian.org/debian unstable/main armhf python3-all-dev armhf 3.13.2-2 [1064 B]
Get: 187 http://deb.debian.org/debian unstable/main armhf python3-asttokens all 3.0.0-1 [20.1 kB]
Get: 188 http://deb.debian.org/debian unstable/main armhf python3-attr all 25.1.0-1 [68.7 kB]
Get: 189 http://deb.debian.org/debian unstable/main armhf python3-babel all 2.17.0-1 [117 kB]
Get: 190 http://deb.debian.org/debian unstable/main armhf python3-roman all 5.0-1 [10.6 kB]
Get: 191 http://deb.debian.org/debian unstable/main armhf python3-docutils all 0.21.2+dfsg-2 [403 kB]
Get: 192 http://deb.debian.org/debian unstable/main armhf python3-defusedxml all 0.7.1-3 [43.4 kB]
Get: 193 http://deb.debian.org/debian unstable/main armhf sphinx-common all 8.1.3-5 [617 kB]
Get: 194 http://deb.debian.org/debian unstable/main armhf python3-imagesize all 1.4.1-1 [6688 B]
Get: 195 http://deb.debian.org/debian unstable/main armhf python3-markupsafe armhf 2.1.5-1+b3 [13.6 kB]
Get: 196 http://deb.debian.org/debian unstable/main armhf python3-jinja2 all 3.1.5-2 [107 kB]
Get: 197 http://deb.debian.org/debian unstable/main armhf python3-certifi all 2025.1.31+ds-1 [9652 B]
Get: 198 http://deb.debian.org/debian unstable/main armhf python3-charset-normalizer armhf 3.4.1-1+b1 [118 kB]
Get: 199 http://deb.debian.org/debian unstable/main armhf python3-idna all 3.10-1 [42.0 kB]
Get: 200 http://deb.debian.org/debian unstable/main armhf python3-urllib3 all 2.3.0-2 [114 kB]
Get: 201 http://deb.debian.org/debian unstable/main armhf python3-chardet all 5.2.0+dfsg-2 [108 kB]
Get: 202 http://deb.debian.org/debian unstable/main armhf python3-requests all 2.32.3+dfsg-4 [72.1 kB]
Get: 203 http://deb.debian.org/debian unstable/main armhf python3-snowballstemmer all 2.2.0-4 [58.0 kB]
Get: 204 http://deb.debian.org/debian unstable/main armhf python3-sphinx all 8.1.3-5 [468 kB]
Get: 205 http://deb.debian.org/debian unstable/main armhf python3-breathe all 4.35.0-3 [78.2 kB]
Get: 206 http://deb.debian.org/debian unstable/main armhf python3-soupsieve all 2.6-1 [38.3 kB]
Get: 207 http://deb.debian.org/debian unstable/main armhf python3-bs4 all 4.13.3-2 [166 kB]
Get: 208 http://deb.debian.org/debian unstable/main armhf python3-dateutil all 2.9.0-3 [79.3 kB]
Get: 209 http://deb.debian.org/debian unstable/main armhf python3-decorator all 5.1.1-5 [15.1 kB]
Get: 210 http://deb.debian.org/debian unstable/main armhf python3.13-doc all 3.13.2-2 [15.3 MB]
Get: 211 http://deb.debian.org/debian unstable/main armhf python3-doc all 3.13.2-2 [10.3 kB]
Get: 212 http://deb.debian.org/debian unstable/main armhf python3-execnet all 2.1.1-1 [40.2 kB]
Get: 213 http://deb.debian.org/debian unstable/main armhf python3-executing all 2.2.0-0.1 [24.5 kB]
Get: 214 http://deb.debian.org/debian unstable/main armhf python3-sortedcontainers all 2.4.0-2 [31.9 kB]
Get: 215 http://deb.debian.org/debian unstable/main armhf python3-hypothesis all 6.127.4-1 [330 kB]
Get: 216 http://deb.debian.org/debian unstable/main armhf python3-iniconfig all 1.1.1-2 [6396 B]
Get: 217 http://deb.debian.org/debian unstable/main armhf python3-parso all 0.8.4-1 [67.8 kB]
Get: 218 http://deb.debian.org/debian unstable/main armhf python3-typeshed all 0.0~git20241223.ea91db2-1 [1530 kB]
Get: 219 http://deb.debian.org/debian unstable/main armhf python3-jedi all 0.19.1+ds1-1 [691 kB]
Get: 220 http://deb.debian.org/debian unstable/main armhf python3-traitlets all 5.14.3+really5.14.3-1 [70.9 kB]
Get: 221 http://deb.debian.org/debian unstable/main armhf python3-matplotlib-inline all 0.1.6-2 [8652 B]
Get: 222 http://deb.debian.org/debian unstable/main armhf python3-wcwidth all 0.2.13+dfsg1-1 [24.9 kB]
Get: 223 http://deb.debian.org/debian unstable/main armhf python3-prompt-toolkit all 3.0.50-1 [278 kB]
Get: 224 http://deb.debian.org/debian unstable/main armhf python3-pure-eval all 0.2.3-1 [11.2 kB]
Get: 225 http://deb.debian.org/debian unstable/main armhf python3-stack-data all 0.6.3-1 [21.6 kB]
Get: 226 http://deb.debian.org/debian unstable/main armhf python3-ptyprocess all 0.7.0-6 [14.5 kB]
Get: 227 http://deb.debian.org/debian unstable/main armhf python3-pexpect all 4.9-3 [55.6 kB]
Get: 228 http://deb.debian.org/debian unstable/main armhf python3-ipython all 8.30.0-2 [568 kB]
Get: 229 http://deb.debian.org/debian unstable/main armhf python3-pyproject-metadata all 0.9.1-1 [21.5 kB]
Get: 230 http://deb.debian.org/debian unstable/main armhf python3-mesonpy all 0.17.1-1 [108 kB]
Get: 231 http://deb.debian.org/debian unstable/main armhf python3-tabulate all 0.9.0-1 [45.9 kB]
Get: 232 http://deb.debian.org/debian unstable/main armhf python3-numpydoc all 1.8.0-1 [51.4 kB]
Get: 233 http://deb.debian.org/debian unstable/main armhf python3-pickleshare all 0.7.5-5 [7600 B]
Get: 234 http://deb.debian.org/debian unstable/main armhf python3-pluggy all 1.5.0-1 [26.9 kB]
Get: 235 http://deb.debian.org/debian unstable/main armhf python3-pydata-sphinx-theme all 0.16.1+dfsg-3 [917 kB]
Get: 236 http://deb.debian.org/debian unstable/main armhf python3-pytest all 8.3.5-1 [250 kB]
Get: 237 http://deb.debian.org/debian unstable/main armhf python3-pytest-xdist all 3.6.1-1 [44.4 kB]
Get: 238 http://deb.debian.org/debian unstable/main armhf python3-pytz all 2025.1-3 [150 kB]
Get: 239 http://deb.debian.org/debian unstable/main armhf python3-sphinx-copybutton all 0.5.2-2 [17.9 kB]
Get: 240 http://deb.debian.org/debian unstable/main armhf python3-sphinx-design all 0.6.1-1 [883 kB]
Get: 241 http://deb.debian.org/debian unstable/main armhf python3-tz all 2025.1-3 [4004 B]
Get: 242 http://deb.debian.org/debian unstable/main armhf tzdata-legacy all 2025a-2 [178 kB]
Fetched 206 MB in 8s (26.3 MB/s)
Preconfiguring packages ...
Selecting previously unselected package libpython3.13-minimal:armhf.
(Reading database ... 
(Reading database ... 5%
(Reading database ... 10%
(Reading database ... 15%
(Reading database ... 20%
(Reading database ... 25%
(Reading database ... 30%
(Reading database ... 35%
(Reading database ... 40%
(Reading database ... 45%
(Reading database ... 50%
(Reading database ... 55%
(Reading database ... 60%
(Reading database ... 65%
(Reading database ... 70%
(Reading database ... 75%
(Reading database ... 80%
(Reading database ... 85%
(Reading database ... 90%
(Reading database ... 95%
(Reading database ... 100%
(Reading database ... 19509 files and directories currently installed.)
Preparing to unpack .../libpython3.13-minimal_3.13.2-2_armhf.deb ...
Unpacking libpython3.13-minimal:armhf (3.13.2-2) ...
Selecting previously unselected package libexpat1:armhf.
Preparing to unpack .../libexpat1_2.7.0-1_armhf.deb ...
Unpacking libexpat1:armhf (2.7.0-1) ...
Selecting previously unselected package python3.13-minimal.
Preparing to unpack .../python3.13-minimal_3.13.2-2_armhf.deb ...
Unpacking python3.13-minimal (3.13.2-2) ...
Setting up libpython3.13-minimal:armhf (3.13.2-2) ...
Setting up libexpat1:armhf (2.7.0-1) ...
Setting up python3.13-minimal (3.13.2-2) ...
Selecting previously unselected package python3-minimal.
(Reading database ... 
(Reading database ... 5%
(Reading database ... 10%
(Reading database ... 15%
(Reading database ... 20%
(Reading database ... 25%
(Reading database ... 30%
(Reading database ... 35%
(Reading database ... 40%
(Reading database ... 45%
(Reading database ... 50%
(Reading database ... 55%
(Reading database ... 60%
(Reading database ... 65%
(Reading database ... 70%
(Reading database ... 75%
(Reading database ... 80%
(Reading database ... 85%
(Reading database ... 90%
(Reading database ... 95%
(Reading database ... 100%
(Reading database ... 19843 files and directories currently installed.)
Preparing to unpack .../0-python3-minimal_3.13.2-2_armhf.deb ...
Unpacking python3-minimal (3.13.2-2) ...
Selecting previously unselected package media-types.
Preparing to unpack .../1-media-types_13.0.0_all.deb ...
Unpacking media-types (13.0.0) ...
Selecting previously unselected package netbase.
Preparing to unpack .../2-netbase_6.5_all.deb ...
Unpacking netbase (6.5) ...
Selecting previously unselected package tzdata.
Preparing to unpack .../3-tzdata_2025a-2_all.deb ...
Unpacking tzdata (2025a-2) ...
Selecting previously unselected package libffi8:armhf.
Preparing to unpack .../4-libffi8_3.4.7-1_armhf.deb ...
Unpacking libffi8:armhf (3.4.7-1) ...
Selecting previously unselected package readline-common.
Preparing to unpack .../5-readline-common_8.2-6_all.deb ...
Unpacking readline-common (8.2-6) ...
Selecting previously unselected package libreadline8t64:armhf.
Preparing to unpack .../6-libreadline8t64_8.2-6_armhf.deb ...
Adding 'diversion of /lib/arm-linux-gnueabihf/libhistory.so.8 to /lib/arm-linux-gnueabihf/libhistory.so.8.usr-is-merged by libreadline8t64'
Adding 'diversion of /lib/arm-linux-gnueabihf/libhistory.so.8.2 to /lib/arm-linux-gnueabihf/libhistory.so.8.2.usr-is-merged by libreadline8t64'
Adding 'diversion of /lib/arm-linux-gnueabihf/libreadline.so.8 to /lib/arm-linux-gnueabihf/libreadline.so.8.usr-is-merged by libreadline8t64'
Adding 'diversion of /lib/arm-linux-gnueabihf/libreadline.so.8.2 to /lib/arm-linux-gnueabihf/libreadline.so.8.2.usr-is-merged by libreadline8t64'
Unpacking libreadline8t64:armhf (8.2-6) ...
Selecting previously unselected package libpython3.13-stdlib:armhf.
Preparing to unpack .../7-libpython3.13-stdlib_3.13.2-2_armhf.deb ...
Unpacking libpython3.13-stdlib:armhf (3.13.2-2) ...
Selecting previously unselected package python3.13.
Preparing to unpack .../8-python3.13_3.13.2-2_armhf.deb ...
Unpacking python3.13 (3.13.2-2) ...
Selecting previously unselected package libpython3-stdlib:armhf.
Preparing to unpack .../9-libpython3-stdlib_3.13.2-2_armhf.deb ...
Unpacking libpython3-stdlib:armhf (3.13.2-2) ...
Setting up python3-minimal (3.13.2-2) ...
Selecting previously unselected package python3.
(Reading database ... 
(Reading database ... 5%
(Reading database ... 10%
(Reading database ... 15%
(Reading database ... 20%
(Reading database ... 25%
(Reading database ... 30%
(Reading database ... 35%
(Reading database ... 40%
(Reading database ... 45%
(Reading database ... 50%
(Reading database ... 55%
(Reading database ... 60%
(Reading database ... 65%
(Reading database ... 70%
(Reading database ... 75%
(Reading database ... 80%
(Reading database ... 85%
(Reading database ... 90%
(Reading database ... 95%
(Reading database ... 100%
(Reading database ... 20853 files and directories currently installed.)
Preparing to unpack .../000-python3_3.13.2-2_armhf.deb ...
Unpacking python3 (3.13.2-2) ...
Selecting previously unselected package sgml-base.
Preparing to unpack .../001-sgml-base_1.31_all.deb ...
Unpacking sgml-base (1.31) ...
Selecting previously unselected package sensible-utils.
Preparing to unpack .../002-sensible-utils_0.0.24_all.deb ...
Unpacking sensible-utils (0.0.24) ...
Selecting previously unselected package openssl.
Preparing to unpack .../003-openssl_3.4.1-1_armhf.deb ...
Unpacking openssl (3.4.1-1) ...
Selecting previously unselected package ca-certificates.
Preparing to unpack .../004-ca-certificates_20241223_all.deb ...
Unpacking ca-certificates (20241223) ...
Selecting previously unselected package libmagic-mgc.
Preparing to unpack .../005-libmagic-mgc_1%3a5.46-2_armhf.deb ...
Unpacking libmagic-mgc (1:5.46-2) ...
Selecting previously unselected package libmagic1t64:armhf.
Preparing to unpack .../006-libmagic1t64_1%3a5.46-2_armhf.deb ...
Unpacking libmagic1t64:armhf (1:5.46-2) ...
Selecting previously unselected package file.
Preparing to unpack .../007-file_1%3a5.46-2_armhf.deb ...
Unpacking file (1:5.46-2) ...
Selecting previously unselected package gettext-base.
Preparing to unpack .../008-gettext-base_0.23.1-1_armhf.deb ...
Unpacking gettext-base (0.23.1-1) ...
Selecting previously unselected package libuchardet0:armhf.
Preparing to unpack .../009-libuchardet0_0.0.8-1+b2_armhf.deb ...
Unpacking libuchardet0:armhf (0.0.8-1+b2) ...
Selecting previously unselected package groff-base.
Preparing to unpack .../010-groff-base_1.23.0-7_armhf.deb ...
Unpacking groff-base (1.23.0-7) ...
Selecting previously unselected package bsdextrautils.
Preparing to unpack .../011-bsdextrautils_2.40.4-5_armhf.deb ...
Unpacking bsdextrautils (2.40.4-5) ...
Selecting previously unselected package libpipeline1:armhf.
Preparing to unpack .../012-libpipeline1_1.5.8-1_armhf.deb ...
Unpacking libpipeline1:armhf (1.5.8-1) ...
Selecting previously unselected package man-db.
Preparing to unpack .../013-man-db_2.13.0-1_armhf.deb ...
Unpacking man-db (2.13.0-1) ...
Selecting previously unselected package m4.
Preparing to unpack .../014-m4_1.4.19-7_armhf.deb ...
Unpacking m4 (1.4.19-7) ...
Selecting previously unselected package autoconf.
Preparing to unpack .../015-autoconf_2.72-3_all.deb ...
Unpacking autoconf (2.72-3) ...
Selecting previously unselected package autotools-dev.
Preparing to unpack .../016-autotools-dev_20220109.1_all.deb ...
Unpacking autotools-dev (20220109.1) ...
Selecting previously unselected package automake.
Preparing to unpack .../017-automake_1%3a1.17-3_all.deb ...
Unpacking automake (1:1.17-3) ...
Selecting previously unselected package autopoint.
Preparing to unpack .../018-autopoint_0.23.1-1_all.deb ...
Unpacking autopoint (0.23.1-1) ...
Selecting previously unselected package cython3.
Preparing to unpack .../019-cython3_3.0.11+dfsg-2+b1_armhf.deb ...
Unpacking cython3 (3.0.11+dfsg-2+b1) ...
Selecting previously unselected package libdebhelper-perl.
Preparing to unpack .../020-libdebhelper-perl_13.24.1_all.deb ...
Unpacking libdebhelper-perl (13.24.1) ...
Selecting previously unselected package libtool.
Preparing to unpack .../021-libtool_2.5.4-4_all.deb ...
Unpacking libtool (2.5.4-4) ...
Selecting previously unselected package dh-autoreconf.
Preparing to unpack .../022-dh-autoreconf_20_all.deb ...
Unpacking dh-autoreconf (20) ...
Selecting previously unselected package libarchive-zip-perl.
Preparing to unpack .../023-libarchive-zip-perl_1.68-1_all.deb ...
Unpacking libarchive-zip-perl (1.68-1) ...
Selecting previously unselected package libfile-stripnondeterminism-perl.
Preparing to unpack .../024-libfile-stripnondeterminism-perl_1.14.1-2_all.deb ...
Unpacking libfile-stripnondeterminism-perl (1.14.1-2) ...
Selecting previously unselected package dh-strip-nondeterminism.
Preparing to unpack .../025-dh-strip-nondeterminism_1.14.1-2_all.deb ...
Unpacking dh-strip-nondeterminism (1.14.1-2) ...
Selecting previously unselected package libelf1t64:armhf.
Preparing to unpack .../026-libelf1t64_0.192-4_armhf.deb ...
Unpacking libelf1t64:armhf (0.192-4) ...
Selecting previously unselected package dwz.
Preparing to unpack .../027-dwz_0.15-1+b2_armhf.deb ...
Unpacking dwz (0.15-1+b2) ...
Selecting previously unselected package libunistring5:armhf.
Preparing to unpack .../028-libunistring5_1.3-1_armhf.deb ...
Unpacking libunistring5:armhf (1.3-1) ...
Selecting previously unselected package libicu76:armhf.
Preparing to unpack .../029-libicu76_76.1-3_armhf.deb ...
Unpacking libicu76:armhf (76.1-3) ...
Selecting previously unselected package libxml2:armhf.
Preparing to unpack .../030-libxml2_2.12.7+dfsg+really2.9.14-0.3+b1_armhf.deb ...
Unpacking libxml2:armhf (2.12.7+dfsg+really2.9.14-0.3+b1) ...
Selecting previously unselected package gettext.
Preparing to unpack .../031-gettext_0.23.1-1_armhf.deb ...
Unpacking gettext (0.23.1-1) ...
Selecting previously unselected package intltool-debian.
Preparing to unpack .../032-intltool-debian_0.35.0+20060710.6_all.deb ...
Unpacking intltool-debian (0.35.0+20060710.6) ...
Selecting previously unselected package po-debconf.
Preparing to unpack .../033-po-debconf_1.0.21+nmu1_all.deb ...
Unpacking po-debconf (1.0.21+nmu1) ...
Selecting previously unselected package debhelper.
Preparing to unpack .../034-debhelper_13.24.1_all.deb ...
Unpacking debhelper (13.24.1) ...
Selecting previously unselected package dh-python.
Preparing to unpack .../035-dh-python_6.20250308_all.deb ...
Unpacking dh-python (6.20250308) ...
Selecting previously unselected package xml-core.
Preparing to unpack .../036-xml-core_0.19_all.deb ...
Unpacking xml-core (0.19) ...
Selecting previously unselected package docutils-common.
Preparing to unpack .../037-docutils-common_0.21.2+dfsg-2_all.deb ...
Unpacking docutils-common (0.21.2+dfsg-2) ...
Selecting previously unselected package libedit2:armhf.
Preparing to unpack .../038-libedit2_3.1-20250104-1_armhf.deb ...
Unpacking libedit2:armhf (3.1-20250104-1) ...
Selecting previously unselected package libz3-4:armhf.
Preparing to unpack .../039-libz3-4_4.13.3-1_armhf.deb ...
Unpacking libz3-4:armhf (4.13.3-1) ...
Selecting previously unselected package libllvm19:armhf.
Preparing to unpack .../040-libllvm19_1%3a19.1.7-3_armhf.deb ...
Unpacking libllvm19:armhf (1:19.1.7-3) ...
Selecting previously unselected package libclang-cpp19.
Preparing to unpack .../041-libclang-cpp19_1%3a19.1.7-3_armhf.deb ...
Unpacking libclang-cpp19 (1:19.1.7-3) ...
Selecting previously unselected package libclang1-19.
Preparing to unpack .../042-libclang1-19_1%3a19.1.7-3_armhf.deb ...
Unpacking libclang1-19 (1:19.1.7-3) ...
Selecting previously unselected package libfmt10:armhf.
Preparing to unpack .../043-libfmt10_10.1.1+ds1-4_armhf.deb ...
Unpacking libfmt10:armhf (10.1.1+ds1-4) ...
Selecting previously unselected package doxygen.
Preparing to unpack .../044-doxygen_1.9.8+ds-2.1_armhf.deb ...
Unpacking doxygen (1.9.8+ds-2.1) ...
Selecting previously unselected package libbrotli1:armhf.
Preparing to unpack .../045-libbrotli1_1.1.0-2+b7_armhf.deb ...
Unpacking libbrotli1:armhf (1.1.0-2+b7) ...
Selecting previously unselected package libpng16-16t64:armhf.
Preparing to unpack .../046-libpng16-16t64_1.6.47-1.1_armhf.deb ...
Unpacking libpng16-16t64:armhf (1.6.47-1.1) ...
Selecting previously unselected package libfreetype6:armhf.
Preparing to unpack .../047-libfreetype6_2.13.3+dfsg-1_armhf.deb ...
Unpacking libfreetype6:armhf (2.13.3+dfsg-1) ...
Selecting previously unselected package fonts-dejavu-mono.
Preparing to unpack .../048-fonts-dejavu-mono_2.37-8_all.deb ...
Unpacking fonts-dejavu-mono (2.37-8) ...
Selecting previously unselected package fonts-dejavu-core.
Preparing to unpack .../049-fonts-dejavu-core_2.37-8_all.deb ...
Unpacking fonts-dejavu-core (2.37-8) ...
Selecting previously unselected package fontconfig-config.
Preparing to unpack .../050-fontconfig-config_2.15.0-2.1_armhf.deb ...
Unpacking fontconfig-config (2.15.0-2.1) ...
Selecting previously unselected package libfontconfig1:armhf.
Preparing to unpack .../051-libfontconfig1_2.15.0-2.1_armhf.deb ...
Unpacking libfontconfig1:armhf (2.15.0-2.1) ...
Selecting previously unselected package fontconfig.
Preparing to unpack .../052-fontconfig_2.15.0-2.1_armhf.deb ...
Unpacking fontconfig (2.15.0-2.1) ...
Selecting previously unselected package fonts-glyphicons-halflings.
Preparing to unpack .../053-fonts-glyphicons-halflings_1.009~3.4.1+dfsg-3_all.deb ...
Unpacking fonts-glyphicons-halflings (1.009~3.4.1+dfsg-3) ...
Selecting previously unselected package fonts-mathjax.
Preparing to unpack .../054-fonts-mathjax_2.7.9+dfsg-1_all.deb ...
Unpacking fonts-mathjax (2.7.9+dfsg-1) ...
Selecting previously unselected package fonts-open-sans.
Preparing to unpack .../055-fonts-open-sans_1.11-2_all.deb ...
Unpacking fonts-open-sans (1.11-2) ...
Selecting previously unselected package libcdt5:armhf.
Preparing to unpack .../056-libcdt5_2.42.4-3_armhf.deb ...
Unpacking libcdt5:armhf (2.42.4-3) ...
Selecting previously unselected package libcgraph6:armhf.
Preparing to unpack .../057-libcgraph6_2.42.4-3_armhf.deb ...
Unpacking libcgraph6:armhf (2.42.4-3) ...
Selecting previously unselected package libaom3:armhf.
Preparing to unpack .../058-libaom3_3.12.0-1_armhf.deb ...
Unpacking libaom3:armhf (3.12.0-1) ...
Selecting previously unselected package libdav1d7:armhf.
Preparing to unpack .../059-libdav1d7_1.5.1-1_armhf.deb ...
Unpacking libdav1d7:armhf (1.5.1-1) ...
Selecting previously unselected package libabsl20240722:armhf.
Preparing to unpack .../060-libabsl20240722_20240722.0-1.5_armhf.deb ...
Unpacking libabsl20240722:armhf (20240722.0-1.5) ...
Selecting previously unselected package libgav1-1:armhf.
Preparing to unpack .../061-libgav1-1_0.19.0-3+b1_armhf.deb ...
Unpacking libgav1-1:armhf (0.19.0-3+b1) ...
Selecting previously unselected package librav1e0.7:armhf.
Preparing to unpack .../062-librav1e0.7_0.7.1-9+b1_armhf.deb ...
Unpacking librav1e0.7:armhf (0.7.1-9+b1) ...
Selecting previously unselected package libsvtav1enc2:armhf.
Preparing to unpack .../063-libsvtav1enc2_2.3.0+dfsg-1_armhf.deb ...
Unpacking libsvtav1enc2:armhf (2.3.0+dfsg-1) ...
Selecting previously unselected package libjpeg62-turbo:armhf.
Preparing to unpack .../064-libjpeg62-turbo_1%3a2.1.5-3.1_armhf.deb ...
Unpacking libjpeg62-turbo:armhf (1:2.1.5-3.1) ...
Selecting previously unselected package libyuv0:armhf.
Preparing to unpack .../065-libyuv0_0.0.1904.20250204-1_armhf.deb ...
Unpacking libyuv0:armhf (0.0.1904.20250204-1) ...
Selecting previously unselected package libavif16:armhf.
Preparing to unpack .../066-libavif16_1.2.0-1_armhf.deb ...
Unpacking libavif16:armhf (1.2.0-1) ...
Selecting previously unselected package libsharpyuv0:armhf.
Preparing to unpack .../067-libsharpyuv0_1.5.0-0.1_armhf.deb ...
Unpacking libsharpyuv0:armhf (1.5.0-0.1) ...
Selecting previously unselected package libheif-plugin-dav1d:armhf.
Preparing to unpack .../068-libheif-plugin-dav1d_1.19.7-1_armhf.deb ...
Unpacking libheif-plugin-dav1d:armhf (1.19.7-1) ...
Selecting previously unselected package libde265-0:armhf.
Preparing to unpack .../069-libde265-0_1.0.15-1+b3_armhf.deb ...
Unpacking libde265-0:armhf (1.0.15-1+b3) ...
Selecting previously unselected package libheif-plugin-libde265:armhf.
Preparing to unpack .../070-libheif-plugin-libde265_1.19.7-1_armhf.deb ...
Unpacking libheif-plugin-libde265:armhf (1.19.7-1) ...
Selecting previously unselected package libheif1:armhf.
Preparing to unpack .../071-libheif1_1.19.7-1_armhf.deb ...
Unpacking libheif1:armhf (1.19.7-1) ...
Selecting previously unselected package libimagequant0:armhf.
Preparing to unpack .../072-libimagequant0_2.18.0-1+b2_armhf.deb ...
Unpacking libimagequant0:armhf (2.18.0-1+b2) ...
Selecting previously unselected package libfribidi0:armhf.
Preparing to unpack .../073-libfribidi0_1.0.16-1_armhf.deb ...
Unpacking libfribidi0:armhf (1.0.16-1) ...
Selecting previously unselected package libglib2.0-0t64:armhf.
Preparing to unpack .../074-libglib2.0-0t64_2.84.0-2_armhf.deb ...
Unpacking libglib2.0-0t64:armhf (2.84.0-2) ...
Selecting previously unselected package libgraphite2-3:armhf.
Preparing to unpack .../075-libgraphite2-3_1.3.14-2+b1_armhf.deb ...
Unpacking libgraphite2-3:armhf (1.3.14-2+b1) ...
Selecting previously unselected package libharfbuzz0b:armhf.
Preparing to unpack .../076-libharfbuzz0b_10.2.0-1+b1_armhf.deb ...
Unpacking libharfbuzz0b:armhf (10.2.0-1+b1) ...
Selecting previously unselected package libraqm0:armhf.
Preparing to unpack .../077-libraqm0_0.10.2-1_armhf.deb ...
Unpacking libraqm0:armhf (0.10.2-1) ...
Selecting previously unselected package libdeflate0:armhf.
Preparing to unpack .../078-libdeflate0_1.23-1+b1_armhf.deb ...
Unpacking libdeflate0:armhf (1.23-1+b1) ...
Selecting previously unselected package libjbig0:armhf.
Preparing to unpack .../079-libjbig0_2.1-6.1+b2_armhf.deb ...
Unpacking libjbig0:armhf (2.1-6.1+b2) ...
Selecting previously unselected package liblerc4:armhf.
Preparing to unpack .../080-liblerc4_4.0.0+ds-5_armhf.deb ...
Unpacking liblerc4:armhf (4.0.0+ds-5) ...
Selecting previously unselected package libwebp7:armhf.
Preparing to unpack .../081-libwebp7_1.5.0-0.1_armhf.deb ...
Unpacking libwebp7:armhf (1.5.0-0.1) ...
Selecting previously unselected package libtiff6:armhf.
Preparing to unpack .../082-libtiff6_4.5.1+git230720-5_armhf.deb ...
Unpacking libtiff6:armhf (4.5.1+git230720-5) ...
Selecting previously unselected package libxau6:armhf.
Preparing to unpack .../083-libxau6_1%3a1.0.11-1_armhf.deb ...
Unpacking libxau6:armhf (1:1.0.11-1) ...
Selecting previously unselected package libxdmcp6:armhf.
Preparing to unpack .../084-libxdmcp6_1%3a1.1.5-1_armhf.deb ...
Unpacking libxdmcp6:armhf (1:1.1.5-1) ...
Selecting previously unselected package libxcb1:armhf.
Preparing to unpack .../085-libxcb1_1.17.0-2+b1_armhf.deb ...
Unpacking libxcb1:armhf (1.17.0-2+b1) ...
Selecting previously unselected package libx11-data.
Preparing to unpack .../086-libx11-data_2%3a1.8.10-2_all.deb ...
Unpacking libx11-data (2:1.8.10-2) ...
Selecting previously unselected package libx11-6:armhf.
Preparing to unpack .../087-libx11-6_2%3a1.8.10-2_armhf.deb ...
Unpacking libx11-6:armhf (2:1.8.10-2) ...
Selecting previously unselected package libxpm4:armhf.
Preparing to unpack .../088-libxpm4_1%3a3.5.17-1+b3_armhf.deb ...
Unpacking libxpm4:armhf (1:3.5.17-1+b3) ...
Selecting previously unselected package libgd3:armhf.
Preparing to unpack .../089-libgd3_2.3.3-12+b1_armhf.deb ...
Unpacking libgd3:armhf (2.3.3-12+b1) ...
Selecting previously unselected package libgts-0.7-5t64:armhf.
Preparing to unpack .../090-libgts-0.7-5t64_0.7.6+darcs121130-5.2+b1_armhf.deb ...
Unpacking libgts-0.7-5t64:armhf (0.7.6+darcs121130-5.2+b1) ...
Selecting previously unselected package libpixman-1-0:armhf.
Preparing to unpack .../091-libpixman-1-0_0.44.0-3_armhf.deb ...
Unpacking libpixman-1-0:armhf (0.44.0-3) ...
Selecting previously unselected package libxcb-render0:armhf.
Preparing to unpack .../092-libxcb-render0_1.17.0-2+b1_armhf.deb ...
Unpacking libxcb-render0:armhf (1.17.0-2+b1) ...
Selecting previously unselected package libxcb-shm0:armhf.
Preparing to unpack .../093-libxcb-shm0_1.17.0-2+b1_armhf.deb ...
Unpacking libxcb-shm0:armhf (1.17.0-2+b1) ...
Selecting previously unselected package libxext6:armhf.
Preparing to unpack .../094-libxext6_2%3a1.3.4-1+b3_armhf.deb ...
Unpacking libxext6:armhf (2:1.3.4-1+b3) ...
Selecting previously unselected package libxrender1:armhf.
Preparing to unpack .../095-libxrender1_1%3a0.9.10-1.1+b4_armhf.deb ...
Unpacking libxrender1:armhf (1:0.9.10-1.1+b4) ...
Selecting previously unselected package libcairo2:armhf.
Preparing to unpack .../096-libcairo2_1.18.4-1+b1_armhf.deb ...
Unpacking libcairo2:armhf (1.18.4-1+b1) ...
Selecting previously unselected package libltdl7:armhf.
Preparing to unpack .../097-libltdl7_2.5.4-4_armhf.deb ...
Unpacking libltdl7:armhf (2.5.4-4) ...
Selecting previously unselected package libthai-data.
Preparing to unpack .../098-libthai-data_0.1.29-2_all.deb ...
Unpacking libthai-data (0.1.29-2) ...
Selecting previously unselected package libdatrie1:armhf.
Preparing to unpack .../099-libdatrie1_0.2.13-3+b1_armhf.deb ...
Unpacking libdatrie1:armhf (0.2.13-3+b1) ...
Selecting previously unselected package libthai0:armhf.
Preparing to unpack .../100-libthai0_0.1.29-2+b1_armhf.deb ...
Unpacking libthai0:armhf (0.1.29-2+b1) ...
Selecting previously unselected package libpango-1.0-0:armhf.
Preparing to unpack .../101-libpango-1.0-0_1.56.2-1_armhf.deb ...
Unpacking libpango-1.0-0:armhf (1.56.2-1) ...
Selecting previously unselected package libpangoft2-1.0-0:armhf.
Preparing to unpack .../102-libpangoft2-1.0-0_1.56.2-1_armhf.deb ...
Unpacking libpangoft2-1.0-0:armhf (1.56.2-1) ...
Selecting previously unselected package libpangocairo-1.0-0:armhf.
Preparing to unpack .../103-libpangocairo-1.0-0_1.56.2-1_armhf.deb ...
Unpacking libpangocairo-1.0-0:armhf (1.56.2-1) ...
Selecting previously unselected package libpathplan4:armhf.
Preparing to unpack .../104-libpathplan4_2.42.4-3_armhf.deb ...
Unpacking libpathplan4:armhf (2.42.4-3) ...
Selecting previously unselected package libgvc6.
Preparing to unpack .../105-libgvc6_2.42.4-3_armhf.deb ...
Unpacking libgvc6 (2.42.4-3) ...
Selecting previously unselected package libgvpr2:armhf.
Preparing to unpack .../106-libgvpr2_2.42.4-3_armhf.deb ...
Unpacking libgvpr2:armhf (2.42.4-3) ...
Selecting previously unselected package liblab-gamut1:armhf.
Preparing to unpack .../107-liblab-gamut1_2.42.4-3_armhf.deb ...
Unpacking liblab-gamut1:armhf (2.42.4-3) ...
Selecting previously unselected package x11-common.
Preparing to unpack .../108-x11-common_1%3a7.7+24_all.deb ...
Unpacking x11-common (1:7.7+24) ...
Selecting previously unselected package libice6:armhf.
Preparing to unpack .../109-libice6_2%3a1.1.1-1_armhf.deb ...
Unpacking libice6:armhf (2:1.1.1-1) ...
Selecting previously unselected package libsm6:armhf.
Preparing to unpack .../110-libsm6_2%3a1.2.4-1_armhf.deb ...
Unpacking libsm6:armhf (2:1.2.4-1) ...
Selecting previously unselected package libxt6t64:armhf.
Preparing to unpack .../111-libxt6t64_1%3a1.2.1-1.2+b2_armhf.deb ...
Unpacking libxt6t64:armhf (1:1.2.1-1.2+b2) ...
Selecting previously unselected package libxmu6:armhf.
Preparing to unpack .../112-libxmu6_2%3a1.1.3-3+b4_armhf.deb ...
Unpacking libxmu6:armhf (2:1.1.3-3+b4) ...
Selecting previously unselected package libxaw7:armhf.
Preparing to unpack .../113-libxaw7_2%3a1.0.16-1_armhf.deb ...
Unpacking libxaw7:armhf (2:1.0.16-1) ...
Selecting previously unselected package graphviz.
Preparing to unpack .../114-graphviz_2.42.4-3_armhf.deb ...
Unpacking graphviz (2.42.4-3) ...
Selecting previously unselected package libblas3:armhf.
Preparing to unpack .../115-libblas3_3.12.1-2_armhf.deb ...
Unpacking libblas3:armhf (3.12.1-2) ...
Selecting previously unselected package libblas-dev:armhf.
Preparing to unpack .../116-libblas-dev_3.12.1-2_armhf.deb ...
Unpacking libblas-dev:armhf (3.12.1-2) ...
Selecting previously unselected package libexpat1-dev:armhf.
Preparing to unpack .../117-libexpat1-dev_2.7.0-1_armhf.deb ...
Unpacking libexpat1-dev:armhf (2.7.0-1) ...
Selecting previously unselected package libgfortran5:armhf.
Preparing to unpack .../118-libgfortran5_14.2.0-19_armhf.deb ...
Unpacking libgfortran5:armhf (14.2.0-19) ...
Selecting previously unselected package libjs-bootstrap.
Preparing to unpack .../119-libjs-bootstrap_3.4.1+dfsg-3_all.deb ...
Unpacking libjs-bootstrap (3.4.1+dfsg-3) ...
Selecting previously unselected package libjs-jquery.
Preparing to unpack .../120-libjs-jquery_3.6.1+dfsg+~3.5.14-1_all.deb ...
Unpacking libjs-jquery (3.6.1+dfsg+~3.5.14-1) ...
Selecting previously unselected package libjs-mathjax.
Preparing to unpack .../121-libjs-mathjax_2.7.9+dfsg-1_all.deb ...
Unpacking libjs-mathjax (2.7.9+dfsg-1) ...
Selecting previously unselected package libjs-underscore.
Preparing to unpack .../122-libjs-underscore_1.13.4~dfsg+~1.11.4-3_all.deb ...
Unpacking libjs-underscore (1.13.4~dfsg+~1.11.4-3) ...
Selecting previously unselected package libjs-sphinxdoc.
Preparing to unpack .../123-libjs-sphinxdoc_8.1.3-5_all.deb ...
Unpacking libjs-sphinxdoc (8.1.3-5) ...
Selecting previously unselected package libjson-perl.
Preparing to unpack .../124-libjson-perl_4.10000-1_all.deb ...
Unpacking libjson-perl (4.10000-1) ...
Selecting previously unselected package liblapack3:armhf.
Preparing to unpack .../125-liblapack3_3.12.1-2_armhf.deb ...
Unpacking liblapack3:armhf (3.12.1-2) ...
Selecting previously unselected package liblapack-dev:armhf.
Preparing to unpack .../126-liblapack-dev_3.12.1-2_armhf.deb ...
Unpacking liblapack-dev:armhf (3.12.1-2) ...
Selecting previously unselected package libpkgconf3:armhf.
Preparing to unpack .../127-libpkgconf3_1.8.1-4_armhf.deb ...
Unpacking libpkgconf3:armhf (1.8.1-4) ...
Selecting previously unselected package libpython3.13:armhf.
Preparing to unpack .../128-libpython3.13_3.13.2-2_armhf.deb ...
Unpacking libpython3.13:armhf (3.13.2-2) ...
Selecting previously unselected package zlib1g-dev:armhf.
Preparing to unpack .../129-zlib1g-dev_1%3a1.3.dfsg+really1.3.1-1+b1_armhf.deb ...
Unpacking zlib1g-dev:armhf (1:1.3.dfsg+really1.3.1-1+b1) ...
Selecting previously unselected package libpython3.13-dev:armhf.
Preparing to unpack .../130-libpython3.13-dev_3.13.2-2_armhf.deb ...
Unpacking libpython3.13-dev:armhf (3.13.2-2) ...
Selecting previously unselected package libpython3-dev:armhf.
Preparing to unpack .../131-libpython3-dev_3.13.2-2_armhf.deb ...
Unpacking libpython3-dev:armhf (3.13.2-2) ...
Selecting previously unselected package libpython3-all-dev:armhf.
Preparing to unpack .../132-libpython3-all-dev_3.13.2-2_armhf.deb ...
Unpacking libpython3-all-dev:armhf (3.13.2-2) ...
Selecting previously unselected package ninja-build.
Preparing to unpack .../133-ninja-build_1.12.1-1_armhf.deb ...
Unpacking ninja-build (1.12.1-1) ...
Selecting previously unselected package python3-autocommand.
Preparing to unpack .../134-python3-autocommand_2.2.2-3_all.deb ...
Unpacking python3-autocommand (2.2.2-3) ...
Selecting previously unselected package python3-more-itertools.
Preparing to unpack .../135-python3-more-itertools_10.6.0-1_all.deb ...
Unpacking python3-more-itertools (10.6.0-1) ...
Selecting previously unselected package python3-typing-extensions.
Preparing to unpack .../136-python3-typing-extensions_4.12.2-2_all.deb ...
Unpacking python3-typing-extensions (4.12.2-2) ...
Selecting previously unselected package python3-typeguard.
Preparing to unpack .../137-python3-typeguard_4.4.2-1_all.deb ...
Unpacking python3-typeguard (4.4.2-1) ...
Selecting previously unselected package python3-inflect.
Preparing to unpack .../138-python3-inflect_7.3.1-2_all.deb ...
Unpacking python3-inflect (7.3.1-2) ...
Selecting previously unselected package python3-jaraco.context.
Preparing to unpack .../139-python3-jaraco.context_6.0.1-1_all.deb ...
Unpacking python3-jaraco.context (6.0.1-1) ...
Selecting previously unselected package python3-jaraco.functools.
Preparing to unpack .../140-python3-jaraco.functools_4.1.0-1_all.deb ...
Unpacking python3-jaraco.functools (4.1.0-1) ...
Selecting previously unselected package python3-pkg-resources.
Preparing to unpack .../141-python3-pkg-resources_75.8.0-1_all.deb ...
Unpacking python3-pkg-resources (75.8.0-1) ...
Selecting previously unselected package python3-jaraco.text.
Preparing to unpack .../142-python3-jaraco.text_4.0.0-1_all.deb ...
Unpacking python3-jaraco.text (4.0.0-1) ...
Selecting previously unselected package python3-zipp.
Preparing to unpack .../143-python3-zipp_3.21.0-1_all.deb ...
Unpacking python3-zipp (3.21.0-1) ...
Selecting previously unselected package python3-setuptools.
Preparing to unpack .../144-python3-setuptools_75.8.0-1_all.deb ...
Unpacking python3-setuptools (75.8.0-1) ...
Selecting previously unselected package meson.
Preparing to unpack .../145-meson_1.7.0-1_all.deb ...
Unpacking meson (1.7.0-1) ...
Selecting previously unselected package python3-mypy-extensions.
Preparing to unpack .../146-python3-mypy-extensions_1.0.0-1_all.deb ...
Unpacking python3-mypy-extensions (1.0.0-1) ...
Selecting previously unselected package python3-psutil.
Preparing to unpack .../147-python3-psutil_5.9.8-2_armhf.deb ...
Unpacking python3-psutil (5.9.8-2) ...
Selecting previously unselected package python3-mypy.
Preparing to unpack .../148-python3-mypy_1.15.0-4+b1_armhf.deb ...
Unpacking python3-mypy (1.15.0-4+b1) ...
Selecting previously unselected package mypy.
Preparing to unpack .../149-mypy_1.15.0-4_all.deb ...
Unpacking mypy (1.15.0-4) ...
Selecting previously unselected package node-fortawesome-fontawesome-free.
Preparing to unpack .../150-node-fortawesome-fontawesome-free_6.7.2+ds1-1_all.deb ...
Unpacking node-fortawesome-fontawesome-free (6.7.2+ds1-1) ...
Selecting previously unselected package pkgconf-bin.
Preparing to unpack .../151-pkgconf-bin_1.8.1-4_armhf.deb ...
Unpacking pkgconf-bin (1.8.1-4) ...
Selecting previously unselected package pkgconf:armhf.
Preparing to unpack .../152-pkgconf_1.8.1-4_armhf.deb ...
Unpacking pkgconf:armhf (1.8.1-4) ...
Selecting previously unselected package python3-packaging.
Preparing to unpack .../153-python3-packaging_24.2-1_all.deb ...
Unpacking python3-packaging (24.2-1) ...
Selecting previously unselected package python3-pyproject-hooks.
Preparing to unpack .../154-python3-pyproject-hooks_1.2.0-1_all.deb ...
Unpacking python3-pyproject-hooks (1.2.0-1) ...
Selecting previously unselected package python3-toml.
Preparing to unpack .../155-python3-toml_0.10.2-1_all.deb ...
Unpacking python3-toml (0.10.2-1) ...
Selecting previously unselected package python3-wheel.
Preparing to unpack .../156-python3-wheel_0.45.1-1_all.deb ...
Unpacking python3-wheel (0.45.1-1) ...
Selecting previously unselected package python3-build.
Preparing to unpack .../157-python3-build_1.2.2-1_all.deb ...
Unpacking python3-build (1.2.2-1) ...
Selecting previously unselected package python3-installer.
Preparing to unpack .../158-python3-installer_0.7.0+dfsg1-3_all.deb ...
Unpacking python3-installer (0.7.0+dfsg1-3) ...
Selecting previously unselected package pybuild-plugin-pyproject.
Preparing to unpack .../159-pybuild-plugin-pyproject_6.20250308_all.deb ...
Unpacking pybuild-plugin-pyproject (6.20250308) ...
Selecting previously unselected package python-babel-localedata.
Preparing to unpack .../160-python-babel-localedata_2.17.0-1_all.deb ...
Unpacking python-babel-localedata (2.17.0-1) ...
Selecting previously unselected package python-imageio-doc.
Preparing to unpack .../161-python-imageio-doc_2.37.0-1_all.deb ...
Unpacking python-imageio-doc (2.37.0-1) ...
Selecting previously unselected package python-pandas-doc.
Preparing to unpack .../162-python-pandas-doc_2.2.3+dfsg-8_all.deb ...
Unpacking python-pandas-doc (2.2.3+dfsg-8) ...
Selecting previously unselected package python-pytest-doc.
Preparing to unpack .../163-python-pytest-doc_8.3.5-1_all.deb ...
Unpacking python-pytest-doc (8.3.5-1) ...
Selecting previously unselected package python-scipy-doc.
Preparing to unpack .../164-python-scipy-doc_1.15.2-5_all.deb ...
Unpacking python-scipy-doc (1.15.2-5) ...
Selecting previously unselected package python-skimage-doc.
Preparing to unpack .../165-python-skimage-doc_0.25.2-1_all.deb ...
Unpacking python-skimage-doc (0.25.2-1) ...
Selecting previously unselected package python3-pygments.
Preparing to unpack .../166-python3-pygments_2.18.0+dfsg-2_all.deb ...
Unpacking python3-pygments (2.18.0+dfsg-2) ...
Selecting previously unselected package python3-accessible-pygments.
Preparing to unpack .../167-python3-accessible-pygments_0.0.5-2_all.deb ...
Unpacking python3-accessible-pygments (0.0.5-2) ...
Selecting previously unselected package python3-alabaster.
Preparing to unpack .../168-python3-alabaster_0.7.16-0.1_all.deb ...
Unpacking python3-alabaster (0.7.16-0.1) ...
Selecting previously unselected package python3-all.
Preparing to unpack .../169-python3-all_3.13.2-2_armhf.deb ...
Unpacking python3-all (3.13.2-2) ...
Selecting previously unselected package python3.13-dev.
Preparing to unpack .../170-python3.13-dev_3.13.2-2_armhf.deb ...
Unpacking python3.13-dev (3.13.2-2) ...
Selecting previously unselected package python3-dev.
Preparing to unpack .../171-python3-dev_3.13.2-2_armhf.deb ...
Unpacking python3-dev (3.13.2-2) ...
Selecting previously unselected package python3-all-dev.
Preparing to unpack .../172-python3-all-dev_3.13.2-2_armhf.deb ...
Unpacking python3-all-dev (3.13.2-2) ...
Selecting previously unselected package python3-asttokens.
Preparing to unpack .../173-python3-asttokens_3.0.0-1_all.deb ...
Unpacking python3-asttokens (3.0.0-1) ...
Selecting previously unselected package python3-attr.
Preparing to unpack .../174-python3-attr_25.1.0-1_all.deb ...
Unpacking python3-attr (25.1.0-1) ...
Selecting previously unselected package python3-babel.
Preparing to unpack .../175-python3-babel_2.17.0-1_all.deb ...
Unpacking python3-babel (2.17.0-1) ...
Selecting previously unselected package python3-roman.
Preparing to unpack .../176-python3-roman_5.0-1_all.deb ...
Unpacking python3-roman (5.0-1) ...
Selecting previously unselected package python3-docutils.
Preparing to unpack .../177-python3-docutils_0.21.2+dfsg-2_all.deb ...
Unpacking python3-docutils (0.21.2+dfsg-2) ...
Selecting previously unselected package python3-defusedxml.
Preparing to unpack .../178-python3-defusedxml_0.7.1-3_all.deb ...
Unpacking python3-defusedxml (0.7.1-3) ...
Selecting previously unselected package sphinx-common.
Preparing to unpack .../179-sphinx-common_8.1.3-5_all.deb ...
Unpacking sphinx-common (8.1.3-5) ...
Selecting previously unselected package python3-imagesize.
Preparing to unpack .../180-python3-imagesize_1.4.1-1_all.deb ...
Unpacking python3-imagesize (1.4.1-1) ...
Selecting previously unselected package python3-markupsafe.
Preparing to unpack .../181-python3-markupsafe_2.1.5-1+b3_armhf.deb ...
Unpacking python3-markupsafe (2.1.5-1+b3) ...
Selecting previously unselected package python3-jinja2.
Preparing to unpack .../182-python3-jinja2_3.1.5-2_all.deb ...
Unpacking python3-jinja2 (3.1.5-2) ...
Selecting previously unselected package python3-certifi.
Preparing to unpack .../183-python3-certifi_2025.1.31+ds-1_all.deb ...
Unpacking python3-certifi (2025.1.31+ds-1) ...
Selecting previously unselected package python3-charset-normalizer.
Preparing to unpack .../184-python3-charset-normalizer_3.4.1-1+b1_armhf.deb ...
Unpacking python3-charset-normalizer (3.4.1-1+b1) ...
Selecting previously unselected package python3-idna.
Preparing to unpack .../185-python3-idna_3.10-1_all.deb ...
Unpacking python3-idna (3.10-1) ...
Selecting previously unselected package python3-urllib3.
Preparing to unpack .../186-python3-urllib3_2.3.0-2_all.deb ...
Unpacking python3-urllib3 (2.3.0-2) ...
Selecting previously unselected package python3-chardet.
Preparing to unpack .../187-python3-chardet_5.2.0+dfsg-2_all.deb ...
Unpacking python3-chardet (5.2.0+dfsg-2) ...
Selecting previously unselected package python3-requests.
Preparing to unpack .../188-python3-requests_2.32.3+dfsg-4_all.deb ...
Unpacking python3-requests (2.32.3+dfsg-4) ...
Selecting previously unselected package python3-snowballstemmer.
Preparing to unpack .../189-python3-snowballstemmer_2.2.0-4_all.deb ...
Unpacking python3-snowballstemmer (2.2.0-4) ...
Selecting previously unselected package python3-sphinx.
Preparing to unpack .../190-python3-sphinx_8.1.3-5_all.deb ...
Unpacking python3-sphinx (8.1.3-5) ...
Selecting previously unselected package python3-breathe.
Preparing to unpack .../191-python3-breathe_4.35.0-3_all.deb ...
Unpacking python3-breathe (4.35.0-3) ...
Selecting previously unselected package python3-soupsieve.
Preparing to unpack .../192-python3-soupsieve_2.6-1_all.deb ...
Unpacking python3-soupsieve (2.6-1) ...
Selecting previously unselected package python3-bs4.
Preparing to unpack .../193-python3-bs4_4.13.3-2_all.deb ...
Unpacking python3-bs4 (4.13.3-2) ...
Selecting previously unselected package python3-dateutil.
Preparing to unpack .../194-python3-dateutil_2.9.0-3_all.deb ...
Unpacking python3-dateutil (2.9.0-3) ...
Selecting previously unselected package python3-decorator.
Preparing to unpack .../195-python3-decorator_5.1.1-5_all.deb ...
Unpacking python3-decorator (5.1.1-5) ...
Selecting previously unselected package python3.13-doc.
Preparing to unpack .../196-python3.13-doc_3.13.2-2_all.deb ...
Unpacking python3.13-doc (3.13.2-2) ...
Selecting previously unselected package python3-doc.
Preparing to unpack .../197-python3-doc_3.13.2-2_all.deb ...
Unpacking python3-doc (3.13.2-2) ...
Selecting previously unselected package python3-execnet.
Preparing to unpack .../198-python3-execnet_2.1.1-1_all.deb ...
Unpacking python3-execnet (2.1.1-1) ...
Selecting previously unselected package python3-executing.
Preparing to unpack .../199-python3-executing_2.2.0-0.1_all.deb ...
Unpacking python3-executing (2.2.0-0.1) ...
Selecting previously unselected package python3-sortedcontainers.
Preparing to unpack .../200-python3-sortedcontainers_2.4.0-2_all.deb ...
Unpacking python3-sortedcontainers (2.4.0-2) ...
Selecting previously unselected package python3-hypothesis.
Preparing to unpack .../201-python3-hypothesis_6.127.4-1_all.deb ...
Unpacking python3-hypothesis (6.127.4-1) ...
Selecting previously unselected package python3-iniconfig.
Preparing to unpack .../202-python3-iniconfig_1.1.1-2_all.deb ...
Unpacking python3-iniconfig (1.1.1-2) ...
Selecting previously unselected package python3-parso.
Preparing to unpack .../203-python3-parso_0.8.4-1_all.deb ...
Unpacking python3-parso (0.8.4-1) ...
Selecting previously unselected package python3-typeshed.
Preparing to unpack .../204-python3-typeshed_0.0~git20241223.ea91db2-1_all.deb ...
Unpacking python3-typeshed (0.0~git20241223.ea91db2-1) ...
Selecting previously unselected package python3-jedi.
Preparing to unpack .../205-python3-jedi_0.19.1+ds1-1_all.deb ...
Unpacking python3-jedi (0.19.1+ds1-1) ...
Selecting previously unselected package python3-traitlets.
Preparing to unpack .../206-python3-traitlets_5.14.3+really5.14.3-1_all.deb ...
Unpacking python3-traitlets (5.14.3+really5.14.3-1) ...
Selecting previously unselected package python3-matplotlib-inline.
Preparing to unpack .../207-python3-matplotlib-inline_0.1.6-2_all.deb ...
Unpacking python3-matplotlib-inline (0.1.6-2) ...
Selecting previously unselected package python3-wcwidth.
Preparing to unpack .../208-python3-wcwidth_0.2.13+dfsg1-1_all.deb ...
Unpacking python3-wcwidth (0.2.13+dfsg1-1) ...
Selecting previously unselected package python3-prompt-toolkit.
Preparing to unpack .../209-python3-prompt-toolkit_3.0.50-1_all.deb ...
Unpacking python3-prompt-toolkit (3.0.50-1) ...
Selecting previously unselected package python3-pure-eval.
Preparing to unpack .../210-python3-pure-eval_0.2.3-1_all.deb ...
Unpacking python3-pure-eval (0.2.3-1) ...
Selecting previously unselected package python3-stack-data.
Preparing to unpack .../211-python3-stack-data_0.6.3-1_all.deb ...
Unpacking python3-stack-data (0.6.3-1) ...
Selecting previously unselected package python3-ptyprocess.
Preparing to unpack .../212-python3-ptyprocess_0.7.0-6_all.deb ...
Unpacking python3-ptyprocess (0.7.0-6) ...
Selecting previously unselected package python3-pexpect.
Preparing to unpack .../213-python3-pexpect_4.9-3_all.deb ...
Unpacking python3-pexpect (4.9-3) ...
Selecting previously unselected package python3-ipython.
Preparing to unpack .../214-python3-ipython_8.30.0-2_all.deb ...
Unpacking python3-ipython (8.30.0-2) ...
Selecting previously unselected package python3-pyproject-metadata.
Preparing to unpack .../215-python3-pyproject-metadata_0.9.1-1_all.deb ...
Unpacking python3-pyproject-metadata (0.9.1-1) ...
Selecting previously unselected package python3-mesonpy.
Preparing to unpack .../216-python3-mesonpy_0.17.1-1_all.deb ...
Unpacking python3-mesonpy (0.17.1-1) ...
Selecting previously unselected package python3-tabulate.
Preparing to unpack .../217-python3-tabulate_0.9.0-1_all.deb ...
Unpacking python3-tabulate (0.9.0-1) ...
Selecting previously unselected package python3-numpydoc.
Preparing to unpack .../218-python3-numpydoc_1.8.0-1_all.deb ...
Unpacking python3-numpydoc (1.8.0-1) ...
Selecting previously unselected package python3-pickleshare.
Preparing to unpack .../219-python3-pickleshare_0.7.5-5_all.deb ...
Unpacking python3-pickleshare (0.7.5-5) ...
Selecting previously unselected package python3-pluggy.
Preparing to unpack .../220-python3-pluggy_1.5.0-1_all.deb ...
Unpacking python3-pluggy (1.5.0-1) ...
Selecting previously unselected package python3-pydata-sphinx-theme.
Preparing to unpack .../221-python3-pydata-sphinx-theme_0.16.1+dfsg-3_all.deb ...
Unpacking python3-pydata-sphinx-theme (0.16.1+dfsg-3) ...
Selecting previously unselected package python3-pytest.
Preparing to unpack .../222-python3-pytest_8.3.5-1_all.deb ...
Unpacking python3-pytest (8.3.5-1) ...
Selecting previously unselected package python3-pytest-xdist.
Preparing to unpack .../223-python3-pytest-xdist_3.6.1-1_all.deb ...
Unpacking python3-pytest-xdist (3.6.1-1) ...
Selecting previously unselected package python3-pytz.
Preparing to unpack .../224-python3-pytz_2025.1-3_all.deb ...
Unpacking python3-pytz (2025.1-3) ...
Selecting previously unselected package python3-sphinx-copybutton.
Preparing to unpack .../225-python3-sphinx-copybutton_0.5.2-2_all.deb ...
Unpacking python3-sphinx-copybutton (0.5.2-2) ...
Selecting previously unselected package python3-sphinx-design.
Preparing to unpack .../226-python3-sphinx-design_0.6.1-1_all.deb ...
Unpacking python3-sphinx-design (0.6.1-1) ...
Selecting previously unselected package python3-tz.
Preparing to unpack .../227-python3-tz_2025.1-3_all.deb ...
Unpacking python3-tz (2025.1-3) ...
Selecting previously unselected package tzdata-legacy.
Preparing to unpack .../228-tzdata-legacy_2025a-2_all.deb ...
Unpacking tzdata-legacy (2025a-2) ...
Setting up media-types (13.0.0) ...
Setting up libpipeline1:armhf (1.5.8-1) ...
Setting up libgraphite2-3:armhf (1.3.14-2+b1) ...
Setting up libpixman-1-0:armhf (0.44.0-3) ...
Setting up libsharpyuv0:armhf (1.5.0-0.1) ...
Setting up libaom3:armhf (3.12.0-1) ...
Setting up libxau6:armhf (1:1.0.11-1) ...
Setting up libxdmcp6:armhf (1:1.1.5-1) ...
Setting up libxcb1:armhf (1.17.0-2+b1) ...
Setting up fonts-mathjax (2.7.9+dfsg-1) ...
Setting up liblerc4:armhf (4.0.0+ds-5) ...
Setting up bsdextrautils (2.40.4-5) ...
Setting up libjs-mathjax (2.7.9+dfsg-1) ...
Setting up libdatrie1:armhf (0.2.13-3+b1) ...
Setting up libmagic-mgc (1:5.46-2) ...
Setting up libxcb-render0:armhf (1.17.0-2+b1) ...
Setting up libarchive-zip-perl (1.68-1) ...
Setting up fonts-glyphicons-halflings (1.009~3.4.1+dfsg-3) ...
Setting up libdebhelper-perl (13.24.1) ...
Setting up libbrotli1:armhf (1.1.0-2+b7) ...
Setting up libedit2:armhf (3.1-20250104-1) ...
Setting up liblab-gamut1:armhf (2.42.4-3) ...
Setting up libmagic1t64:armhf (1:5.46-2) ...
Setting up x11-common (1:7.7+24) ...
invoke-rc.d: could not determine current runlevel
Setting up X socket directories... /tmp/.X11-unix /tmp/.ICE-unix.
Setting up libdeflate0:armhf (1.23-1+b1) ...
Setting up gettext-base (0.23.1-1) ...
Setting up m4 (1.4.19-7) ...
Setting up libxcb-shm0:armhf (1.17.0-2+b1) ...
Setting up file (1:5.46-2) ...
Setting up node-fortawesome-fontawesome-free (6.7.2+ds1-1) ...
Setting up fonts-open-sans (1.11-2) ...
Setting up libabsl20240722:armhf (20240722.0-1.5) ...
Setting up libjbig0:armhf (2.1-6.1+b2) ...
Setting up ninja-build (1.12.1-1) ...
Setting up libelf1t64:armhf (0.192-4) ...
Setting up python-babel-localedata (2.17.0-1) ...
Setting up tzdata (2025a-2) ...

Current default time zone: 'Etc/UTC'
Local time is now:      Mon Mar 17 06:59:23 UTC 2025.
Universal Time is now:  Mon Mar 17 06:59:23 UTC 2025.
Run 'dpkg-reconfigure tzdata' if you wish to change it.

Setting up autotools-dev (20220109.1) ...
Setting up libz3-4:armhf (4.13.3-1) ...
Setting up libblas3:armhf (3.12.1-2) ...
update-alternatives: using /usr/lib/arm-linux-gnueabihf/blas/libblas.so.3 to provide /usr/lib/arm-linux-gnueabihf/libblas.so.3 (libblas.so.3-arm-linux-gnueabihf) in auto mode
Setting up libpkgconf3:armhf (1.8.1-4) ...
Setting up libexpat1-dev:armhf (2.7.0-1) ...
Setting up libjpeg62-turbo:armhf (1:2.1.5-3.1) ...
Setting up libx11-data (2:1.8.10-2) ...
Setting up libsvtav1enc2:armhf (2.3.0+dfsg-1) ...
Setting up libpathplan4:armhf (2.42.4-3) ...
Setting up libfribidi0:armhf (1.0.16-1) ...
Setting up libimagequant0:armhf (2.18.0-1+b2) ...
Setting up libunistring5:armhf (1.3-1) ...
Setting up fonts-dejavu-mono (2.37-8) ...
Setting up libpng16-16t64:armhf (1.6.47-1.1) ...
Setting up autopoint (0.23.1-1) ...
Setting up fonts-dejavu-core (2.37-8) ...
Setting up libgav1-1:armhf (0.19.0-3+b1) ...
Setting up pkgconf-bin (1.8.1-4) ...
Setting up libltdl7:armhf (2.5.4-4) ...
Setting up libgfortran5:armhf (14.2.0-19) ...
Setting up autoconf (2.72-3) ...
Setting up libwebp7:armhf (1.5.0-0.1) ...
Setting up zlib1g-dev:armhf (1:1.3.dfsg+really1.3.1-1+b1) ...
Setting up libffi8:armhf (3.4.7-1) ...
Setting up dwz (0.15-1+b2) ...
Setting up libdav1d7:armhf (1.5.1-1) ...
Setting up sensible-utils (0.0.24) ...
Setting up libtiff6:armhf (4.5.1+git230720-5) ...
Setting up librav1e0.7:armhf (0.7.1-9+b1) ...
Setting up libuchardet0:armhf (0.0.8-1+b2) ...
Setting up libjson-perl (4.10000-1) ...
Setting up libx11-6:armhf (2:1.8.10-2) ...
Setting up libthai-data (0.1.29-2) ...
Setting up netbase (6.5) ...
Setting up sgml-base (1.31) ...
Setting up libcdt5:armhf (2.42.4-3) ...
Setting up libcgraph6:armhf (2.42.4-3) ...
Setting up libicu76:armhf (76.1-3) ...
Setting up libjs-jquery (3.6.1+dfsg+~3.5.14-1) ...
Setting up libde265-0:armhf (1.0.15-1+b3) ...
Setting up openssl (3.4.1-1) ...
Setting up libyuv0:armhf (0.0.1904.20250204-1) ...
Setting up readline-common (8.2-6) ...
Setting up libxml2:armhf (2.12.7+dfsg+really2.9.14-0.3+b1) ...
Setting up libfmt10:armhf (10.1.1+ds1-4) ...
Setting up libblas-dev:armhf (3.12.1-2) ...
update-alternatives: using /usr/lib/arm-linux-gnueabihf/blas/libblas.so to provide /usr/lib/arm-linux-gnueabihf/libblas.so (libblas.so-arm-linux-gnueabihf) in auto mode
Setting up libjs-bootstrap (3.4.1+dfsg-3) ...
Setting up libjs-underscore (1.13.4~dfsg+~1.11.4-3) ...
Setting up automake (1:1.17-3) ...
update-alternatives: using /usr/bin/automake-1.17 to provide /usr/bin/automake (automake) in auto mode
Setting up libfile-stripnondeterminism-perl (1.14.1-2) ...
Setting up libllvm19:armhf (1:19.1.7-3) ...
Setting up libice6:armhf (2:1.1.1-1) ...
Setting up libavif16:armhf (1.2.0-1) ...
Setting up liblapack3:armhf (3.12.1-2) ...
update-alternatives: using /usr/lib/arm-linux-gnueabihf/lapack/liblapack.so.3 to provide /usr/lib/arm-linux-gnueabihf/liblapack.so.3 (liblapack.so.3-arm-linux-gnueabihf) in auto mode
Setting up gettext (0.23.1-1) ...
Setting up libclang1-19 (1:19.1.7-3) ...
Setting up libxpm4:armhf (1:3.5.17-1+b3) ...
Setting up libxrender1:armhf (1:0.9.10-1.1+b4) ...
Setting up libtool (2.5.4-4) ...
Setting up fontconfig-config (2.15.0-2.1) ...
Setting up libxext6:armhf (2:1.3.4-1+b3) ...
Setting up tzdata-legacy (2025a-2) ...
Setting up pkgconf:armhf (1.8.1-4) ...
Setting up intltool-debian (0.35.0+20060710.6) ...
Setting up dh-autoreconf (20) ...
Setting up python3.13-doc (3.13.2-2) ...
Setting up libthai0:armhf (0.1.29-2+b1) ...
Setting up ca-certificates (20241223) ...
Updating certificates in /etc/ssl/certs...
152 added, 0 removed; done.
Setting up libglib2.0-0t64:armhf (2.84.0-2) ...
No schema files found: doing nothing.
Setting up libfreetype6:armhf (2.13.3+dfsg-1) ...
Setting up liblapack-dev:armhf (3.12.1-2) ...
update-alternatives: using /usr/lib/arm-linux-gnueabihf/lapack/liblapack.so to provide /usr/lib/arm-linux-gnueabihf/liblapack.so (liblapack.so-arm-linux-gnueabihf) in auto mode
Setting up libjs-sphinxdoc (8.1.3-5) ...
Setting up libreadline8t64:armhf (8.2-6) ...
Setting up dh-strip-nondeterminism (1.14.1-2) ...
Setting up python-imageio-doc (2.37.0-1) ...
Setting up libgvpr2:armhf (2.42.4-3) ...
Setting up groff-base (1.23.0-7) ...
Setting up xml-core (0.19) ...
Setting up libharfbuzz0b:armhf (10.2.0-1+b1) ...
Setting up libgts-0.7-5t64:armhf (0.7.6+darcs121130-5.2+b1) ...
Setting up libfontconfig1:armhf (2.15.0-2.1) ...
Setting up libsm6:armhf (2:1.2.4-1) ...
Setting up libpython3.13-stdlib:armhf (3.13.2-2) ...
Setting up python3-doc (3.13.2-2) ...
Setting up libpython3-stdlib:armhf (3.13.2-2) ...
Setting up libclang-cpp19 (1:19.1.7-3) ...
Setting up libpython3.13:armhf (3.13.2-2) ...
Setting up fontconfig (2.15.0-2.1) ...
Regenerating fonts cache... done.
Setting up python-pandas-doc (2.2.3+dfsg-8) ...
Setting up python3.13 (3.13.2-2) ...
Setting up po-debconf (1.0.21+nmu1) ...
Setting up python-skimage-doc (0.25.2-1) ...
Setting up libpango-1.0-0:armhf (1.56.2-1) ...
Setting up python-pytest-doc (8.3.5-1) ...
Setting up python3 (3.13.2-2) ...
Setting up python3-sortedcontainers (2.4.0-2) ...
Setting up python3-zipp (3.21.0-1) ...
Setting up python3-autocommand (2.2.2-3) ...
Setting up man-db (2.13.0-1) ...
Not building database; man-db/auto-update is not 'true'.
Setting up python3-markupsafe (2.1.5-1+b3) ...
Setting up python3-wheel (0.45.1-1) ...
Setting up libcairo2:armhf (1.18.4-1+b1) ...
Setting up python3-psutil (5.9.8-2) ...
Setting up python3-roman (5.0-1) ...
Setting up python3-decorator (5.1.1-5) ...
Setting up python3-jinja2 (3.1.5-2) ...
Setting up python3-pygments (2.18.0+dfsg-2) ...
Setting up doxygen (1.9.8+ds-2.1) ...
Setting up python3-packaging (24.2-1) ...
Setting up python3-chardet (5.2.0+dfsg-2) ...
Setting up python3-wcwidth (0.2.13+dfsg1-1) ...
Setting up python3-pyproject-hooks (1.2.0-1) ...
Setting up python3-accessible-pygments (0.0.5-2) ...
Setting up python3-certifi (2025.1.31+ds-1) ...
Setting up python3-typeshed (0.0~git20241223.ea91db2-1) ...
Setting up python3-snowballstemmer (2.2.0-4) ...
Setting up libraqm0:armhf (0.10.2-1) ...
Setting up libpython3.13-dev:armhf (3.13.2-2) ...
Setting up sphinx-common (8.1.3-5) ...
Setting up python-scipy-doc (1.15.2-5) ...
Setting up libxt6t64:armhf (1:1.2.1-1.2+b2) ...
Setting up python3-idna (3.10-1) ...
Setting up cython3 (3.0.11+dfsg-2+b1) ...
Setting up python3-typing-extensions (4.12.2-2) ...
Setting up python3-pickleshare (0.7.5-5) ...
Setting up python3-toml (0.10.2-1) ...
Setting up python3-installer (0.7.0+dfsg1-3) ...
Setting up python3-urllib3 (2.3.0-2) ...
Setting up python3-pluggy (1.5.0-1) ...
Setting up python3-traitlets (5.14.3+really5.14.3-1) ...
Setting up python3-dateutil (2.9.0-3) ...
Setting up libpangoft2-1.0-0:armhf (1.56.2-1) ...
Setting up python3-build (1.2.2-1) ...
Setting up python3-execnet (2.1.1-1) ...
Setting up python3-soupsieve (2.6-1) ...
Setting up libpangocairo-1.0-0:armhf (1.56.2-1) ...
Setting up python3-imagesize (1.4.1-1) ...
Setting up python3-ptyprocess (0.7.0-6) ...
Setting up python3-prompt-toolkit (3.0.50-1) ...
Setting up dh-python (6.20250308) ...
Setting up python3-more-itertools (10.6.0-1) ...
Setting up python3-iniconfig (1.1.1-2) ...
Setting up python3-attr (25.1.0-1) ...
Setting up python3-pure-eval (0.2.3-1) ...
Setting up libxmu6:armhf (2:1.1.3-3+b4) ...
Setting up libpython3-dev:armhf (3.13.2-2) ...
Setting up python3-jaraco.functools (4.1.0-1) ...
Setting up python3-jaraco.context (6.0.1-1) ...
Setting up python3-parso (0.8.4-1) ...
Setting up python3-pyproject-metadata (0.9.1-1) ...
Setting up python3-babel (2.17.0-1) ...
update-alternatives: using /usr/bin/pybabel-python3 to provide /usr/bin/pybabel (pybabel) in auto mode
Setting up python3-defusedxml (0.7.1-3) ...
Setting up python3-asttokens (3.0.0-1) ...
Setting up pybuild-plugin-pyproject (6.20250308) ...
Setting up python3-charset-normalizer (3.4.1-1+b1) ...
Setting up python3.13-dev (3.13.2-2) ...
Setting up python3-pytest (8.3.5-1) ...
Setting up python3-alabaster (0.7.16-0.1) ...
Setting up python3-mypy-extensions (1.0.0-1) ...
Setting up python3-hypothesis (6.127.4-1) ...
Setting up python3-typeguard (4.4.2-1) ...
Setting up python3-tabulate (0.9.0-1) ...
Setting up python3-all (3.13.2-2) ...
Setting up debhelper (13.24.1) ...
Setting up python3-pytz (2025.1-3) ...
Setting up libxaw7:armhf (2:1.0.16-1) ...
Setting up python3-tz (2025.1-3) ...
Setting up python3-bs4 (4.13.3-2) ...
Setting up python3-matplotlib-inline (0.1.6-2) ...
Setting up python3-inflect (7.3.1-2) ...
Setting up python3-executing (2.2.0-0.1) ...
Setting up libpython3-all-dev:armhf (3.13.2-2) ...
Setting up python3-jaraco.text (4.0.0-1) ...
Setting up python3-pexpect (4.9-3) ...
Setting up python3-dev (3.13.2-2) ...
Setting up python3-requests (2.32.3+dfsg-4) ...
Setting up python3-mypy (1.15.0-4+b1) ...
Setting up mypy (1.15.0-4) ...
Setting up python3-stack-data (0.6.3-1) ...
Setting up python3-pkg-resources (75.8.0-1) ...
Setting up python3-all-dev (3.13.2-2) ...
Setting up python3-setuptools (75.8.0-1) ...
Setting up python3-pytest-xdist (3.6.1-1) ...
Setting up python3-jedi (0.19.1+ds1-1) ...
Setting up meson (1.7.0-1) ...
Setting up python3-ipython (8.30.0-2) ...
Setting up python3-mesonpy (0.17.1-1) ...
Setting up libheif-plugin-libde265:armhf (1.19.7-1) ...
Setting up libheif1:armhf (1.19.7-1) ...
Setting up libgd3:armhf (2.3.3-12+b1) ...
Setting up libgvc6 (2.42.4-3) ...
Setting up libheif-plugin-dav1d:armhf (1.19.7-1) ...
Setting up graphviz (2.42.4-3) ...
Processing triggers for libc-bin (2.41-6) ...
Processing triggers for sgml-base (1.31) ...
Setting up docutils-common (0.21.2+dfsg-2) ...
Processing triggers for sgml-base (1.31) ...
Setting up python3-docutils (0.21.2+dfsg-2) ...
Setting up python3-sphinx (8.1.3-5) ...
Setting up python3-sphinx-copybutton (0.5.2-2) ...
Setting up python3-sphinx-design (0.6.1-1) ...
Setting up python3-breathe (4.35.0-3) ...
Setting up python3-numpydoc (1.8.0-1) ...
Setting up python3-pydata-sphinx-theme (0.16.1+dfsg-3) ...
Processing triggers for ca-certificates (20241223) ...
Updating certificates in /etc/ssl/certs...
0 added, 0 removed; done.
Running hooks in /etc/ca-certificates/update.d...
done.
Reading package lists...
Building dependency tree...
Reading state information...
Reading extended state information...
Initializing package states...
Writing extended state information...
Building tag database...
 -> Finished parsing the build-deps
Reading package lists...
Building dependency tree...
Reading state information...
fakeroot is already the newest version (1.37.1-1).
0 upgraded, 0 newly installed, 0 to remove and 0 not upgraded.
I: Building the package
I: Running cd /build/reproducible-path/numpy-2.2.3+ds/ && env PATH="/usr/sbin:/usr/bin:/sbin:/bin:/usr/games" HOME="/nonexistent/first-build" dpkg-buildpackage -us -uc -b && env PATH="/usr/sbin:/usr/bin:/sbin:/bin:/usr/games" HOME="/nonexistent/first-build" dpkg-genchanges -S  > ../numpy_2.2.3+ds-5_source.changes
dpkg-buildpackage: info: source package numpy
dpkg-buildpackage: info: source version 1:2.2.3+ds-5
dpkg-buildpackage: info: source distribution unstable
dpkg-buildpackage: info: source changed by Timo Röhling <roehling@debian.org>
 dpkg-source --before-build .
dpkg-buildpackage: info: host architecture armhf
dpkg-source: info: using options from numpy-2.2.3+ds/debian/source/options: --extend-diff-ignore=.bat
 debian/rules clean
dh clean --buildsystem=pybuild
   dh_auto_clean -O--buildsystem=pybuild
   dh_autoreconf_clean -O--buildsystem=pybuild
   dh_clean -O--buildsystem=pybuild
 debian/rules binary
dh binary --buildsystem=pybuild
   dh_update_autotools_config -O--buildsystem=pybuild
   dh_autoreconf -O--buildsystem=pybuild
   dh_auto_configure -O--buildsystem=pybuild
   debian/rules override_dh_auto_build-arch
make[1]: Entering directory '/build/reproducible-path/numpy-2.2.3+ds'
py3versions: no X-Python3-Version in control file, using supported versions
PYBUILD_DISABLE="" dh_auto_build
I: pybuild plugin_pyproject:129: Building wheel for python3.13 with "build" module
I: pybuild base:311: python3.13 -m build --skip-dependency-check --no-isolation --wheel --outdir /build/reproducible-path/numpy-2.2.3+ds/.pybuild/cpython3_3.13 --config-setting compile-args=--verbose --config-setting setup-args=--wrap-mode=nodownload --config-setting setup-args=--prefix=/usr --config-setting setup-args=--sysconfdir=/etc --config-setting setup-args=--localstatedir=/var --config-setting setup-args=--libdir=lib/arm-linux-gnueabihf --config-setting build-dir=/build/reproducible-path/numpy-2.2.3+ds/.mesonpy
* Building wheel...
+ /usr/bin/python3.13 /build/reproducible-path/numpy-2.2.3+ds/vendored-meson/meson/meson.py setup /build/reproducible-path/numpy-2.2.3+ds /build/reproducible-path/numpy-2.2.3+ds/.mesonpy -Dbuildtype=release -Db_ndebug=if-release -Db_vscrt=md --wrap-mode=nodownload --prefix=/usr --sysconfdir=/etc --localstatedir=/var --libdir=lib/arm-linux-gnueabihf --native-file=/build/reproducible-path/numpy-2.2.3+ds/.mesonpy/meson-python-native-file.ini
The Meson build system
Version: 1.5.2
Source dir: /build/reproducible-path/numpy-2.2.3+ds
Build dir: /build/reproducible-path/numpy-2.2.3+ds/.mesonpy
Build type: native build
Project name: NumPy
Project version: 2.2.3
C compiler for the host machine: cc (gcc 14.2.0 "cc (Debian 14.2.0-19) 14.2.0")
C linker for the host machine: cc ld.bfd 2.44
C++ compiler for the host machine: c++ (gcc 14.2.0 "c++ (Debian 14.2.0-19) 14.2.0")
C++ linker for the host machine: c++ ld.bfd 2.44
Cython compiler for the host machine: cython (cython 3.0.11)
Host machine cpu family: arm
Host machine cpu: arm
Program python found: YES (/usr/bin/python3.13)
Found pkg-config: YES (/usr/bin/pkg-config) 1.8.1
Run-time dependency python found: YES 3.13
Has header "Python.h" with dependency python-3.13: YES 
Compiler for C supports arguments -fno-strict-aliasing: YES 
Message: During parsing cpu-dispatch: The following CPU features were ignored due to platform incompatibility or lack of support:
"XOP FMA4"
Test features "NEON" : Supported 
Test features "NEON_FP16" : Supported 
Test features "NEON_VFPV4" : Supported 
Test features "ASIMD" : Unsupported due to Compiler fails against the test code of "ASIMD"
Test features "ASIMDHP" : Unsupported due to Implied feature "ASIMD" is not supported
Test features "ASIMDFHM" : Unsupported due to Implied feature "ASIMD" is not supported
Test features "SVE" : Unsupported due to Implied feature "ASIMD" is not supported
Configuring npy_cpu_dispatch_config.h using configuration
Message: 
CPU Optimization Options
  baseline:
    Requested : min
    Enabled   : 
  dispatch:
    Requested : max -xop -fma4
    Enabled   : NEON NEON_FP16 NEON_VFPV4

Library m found: YES
Run-time dependency scipy-openblas found: NO (tried pkgconfig)
Did not find CMake 'cmake'
Found CMake: NO
Run-time dependency openblas found: NO (tried pkgconfig, pkgconfig, pkgconfig, system and cmake)
Run-time dependency flexiblas found: NO (tried pkgconfig and cmake)
Run-time dependency blis found: NO (tried pkgconfig and cmake)
Run-time dependency blas found: YES 3.12.1
../numpy/meson.build:135: WARNING: Project targets '>=1.2.99' but uses feature introduced in '1.3.0': dep 'blas' custom lookup.
Message: BLAS symbol suffix: 
Run-time dependency openblas found: NO (tried pkgconfig, pkgconfig, pkgconfig, system and cmake)
Run-time dependency flexiblas found: NO (tried pkgconfig and cmake)
Run-time dependency lapack found: YES 3.12.1
../numpy/meson.build:198: WARNING: Project targets '>=1.2.99' but uses feature introduced in '1.3.0': dep 'lapack' custom lookup.
Checking if "Check atomic builtins without -latomic" : links: YES 
Program _build_utils/process_src_template.py found: YES (/usr/bin/python3.13 /build/reproducible-path/numpy-2.2.3+ds/numpy/_build_utils/process_src_template.py)
Program _build_utils/tempita.py found: YES (/usr/bin/python3.13 /build/reproducible-path/numpy-2.2.3+ds/numpy/_build_utils/tempita.py)
Configuring __config__.py using configuration

../numpy/_core/meson.build:145:31: ERROR: Can not run test applications in this cross environment.

A full log can be found at /build/reproducible-path/numpy-2.2.3+ds/.mesonpy/meson-logs/meson-log.txt

ERROR Backend subprocess exited when trying to invoke build_wheel
E: pybuild pybuild:389: build: plugin pyproject failed with: exit code=1: python3.13 -m build --skip-dependency-check --no-isolation --wheel --outdir /build/reproducible-path/numpy-2.2.3+ds/.pybuild/cpython3_3.13 --config-setting compile-args=--verbose --config-setting setup-args=--wrap-mode=nodownload --config-setting setup-args=--prefix=/usr --config-setting setup-args=--sysconfdir=/etc --config-setting setup-args=--localstatedir=/var --config-setting setup-args=--libdir=lib/arm-linux-gnueabihf --config-setting build-dir={dir}/.mesonpy
dh_auto_build: error: pybuild --build -i python{version} -p 3.13 returned exit code 13
make[1]: *** [debian/rules:90: auto-build-for-default-python] Error 25
make[1]: Leaving directory '/build/reproducible-path/numpy-2.2.3+ds'
make: *** [debian/rules:87: binary] Error 2
dpkg-buildpackage: error: debian/rules binary subprocess returned exit status 2
I: copying local configuration
E: Failed autobuilding of package
I: unmounting dev/ptmx filesystem
I: unmounting dev/pts filesystem
I: unmounting dev/shm filesystem
I: unmounting proc filesystem
I: unmounting sys filesystem
I: cleaning the build env 
I: removing directory /srv/workspace/pbuilder/7192 and its subdirectories
Mon Mar 17 07:01:56 UTC 2025  W: No second build log, what happened?