Tue Mar 18 04:05:19 UTC 2025  I: starting to build kf6-breeze-icons/unstable/armhf on jenkins on '2025-03-18 04:05'
Tue Mar 18 04:05:19 UTC 2025  I: The jenkins build log is/was available at https://jenkins.debian.net/userContent/reproducible/debian/build_service/armhf_24/12841/console.log
Tue Mar 18 04:05:19 UTC 2025  I: Downloading source for unstable/kf6-breeze-icons=6.11.0-1
--2025-03-18 04:05:20--  http://deb.debian.org/debian/pool/main/k/kf6-breeze-icons/kf6-breeze-icons_6.11.0-1.dsc
Connecting to 46.16.76.132:3128... connected.
Proxy request sent, awaiting response... 200 OK
Length: 2800 (2.7K) [text/prs.lines.tag]
Saving to: ‘kf6-breeze-icons_6.11.0-1.dsc’

     0K ..                                                    100%  412M=0s

2025-03-18 04:05:20 (412 MB/s) - ‘kf6-breeze-icons_6.11.0-1.dsc’ saved [2800/2800]

Tue Mar 18 04:05:20 UTC 2025  I: kf6-breeze-icons_6.11.0-1.dsc
-----BEGIN PGP SIGNED MESSAGE-----
Hash: SHA512

Format: 3.0 (quilt)
Source: kf6-breeze-icons
Binary: kf6-breeze-icon-theme, kf6-breeze-icon-theme-rcc, libkf6breezeicons-dev, libkf6breezeicons6
Architecture: any all
Version: 6.11.0-1
Maintainer: Debian Qt/KDE Maintainers <debian-qt-kde@lists.debian.org>
Uploaders: Aurélien COUDERC <coucouf@debian.org>, Patrick Franz <deltaone@debian.org>,
Homepage: https://invent.kde.org/frameworks/breeze-icons
Standards-Version: 4.7.0
Vcs-Browser: https://salsa.debian.org/qt-kde-team/kde/kf6-breeze-icons
Vcs-Git: https://salsa.debian.org/qt-kde-team/kde/kf6-breeze-icons.git
Build-Depends: debhelper-compat (= 13), dh-sequence-kf6, dh-sequence-pkgkde-symbolshelper, cmake (>= 3.16~), extra-cmake-modules (>= 6.11.0~), pkgconf, qt6-base-dev (>= 6.6.0~)
Build-Depends-Indep: fdupes, libxml2-utils, python3-lxml
Package-List:
 kf6-breeze-icon-theme deb kde optional arch=all
 kf6-breeze-icon-theme-rcc deb kde optional arch=all
 libkf6breezeicons-dev deb libdevel optional arch=any
 libkf6breezeicons6 deb libs optional arch=any
Checksums-Sha1:
 54190e8c7f8f93091c969daf64c23b848d5d632a 2253952 kf6-breeze-icons_6.11.0.orig.tar.xz
 611ece5338060f94ab2318eb5679ca9dfca2c0c5 228 kf6-breeze-icons_6.11.0.orig.tar.xz.asc
 9520f4864e5016440e5d3b0061df2e6b7caef364 97956 kf6-breeze-icons_6.11.0-1.debian.tar.xz
Checksums-Sha256:
 f9cd9ec1b6a4111467cba31a7eed50ee5f03846fb1f5c32b3abdbf68877f8a4e 2253952 kf6-breeze-icons_6.11.0.orig.tar.xz
 b5f451975db8027bcaac57df4cfacfd38c6b34af7020a6a136c50904c6ce080c 228 kf6-breeze-icons_6.11.0.orig.tar.xz.asc
 27a9711b4a85f21fc2073cfb3a64f8688c620314f337f8482129f6b34259fb02 97956 kf6-breeze-icons_6.11.0-1.debian.tar.xz
Files:
 8989043ad5c6bae49cb2abb3e88490aa 2253952 kf6-breeze-icons_6.11.0.orig.tar.xz
 5e6e62d034e4a74a0e8262ac10a84438 228 kf6-breeze-icons_6.11.0.orig.tar.xz.asc
 e76145ddd64b41219c2810c6178f938e 97956 kf6-breeze-icons_6.11.0-1.debian.tar.xz

-----BEGIN PGP SIGNATURE-----

iQJHBAEBCgAxFiEEIW//QAAaDgcOKDsfcaflM/KRoyQFAmew9csTHGNvdWNvdWZA
ZGViaWFuLm9yZwAKCRBxp+Uz8pGjJCTzD/4kHzld9gm96gA58uPNfXJQ8/0goRG3
CNcEUBPFyO47WUMj3dNRXklUDTX8ATYE7Ir1UXi6pa7eotniVpJ7n4pcVuvBH0Q2
xY9qt4YPbg1HWj12d0alTrvQPlPlyE8vT31lnboHDAvWxmtnrat812idyfdlhY1j
RcMfBvmGXd8+WZDGIcEfaC169eTuhzrvGXK3ShRkXrTXFcAW9lrAJfyndGl/qk60
XUHqD+Nw/EzuzsX+s9AijSV0CV/cnXOFmGVXcBA0oEOcuvEjvtSTctTVtulNbSLb
QmI2sCH2nAYkE9w1rTsjL54LKWKNybNO6VBl2rrAqlHtbQpWoq6R7/MQd9yxkaqd
0BxTrFWo6NcogPzWpy/LjJGrso992x62EW5a0q8ueEamxet7Asd772F312oDS8Ep
RxzWRGTtINsU+palPd8BwbF1JaMRmYxhjw08VsIuhY74b58ehxvb+8dirQlo96Q/
pn4w21LCEBW14xolwFppL9TuE5p10myMmzi0DMXiR91hyCxS80PUdLImuMr1rcDV
as13oT66VB5Be5E+lqBe6JWw11cDYN3X2nQ0VYc09FBZH4eMi73B1sZ9ob1Ej/Uo
EbQTIBbn+2A6xEmLTLtJ21e4Wx+tVZ77woWwOVX2HOjotR7q89PIfSZeufQxTc+G
U8WoyEUY0c9TXg==
=S0is
-----END PGP SIGNATURE-----
Tue Mar 18 04:05:20 UTC 2025  I: Checking whether the package is not for us
Tue Mar 18 04:05:20 UTC 2025  I: Starting 1st build on remote node ff4a-armhf-rb.debian.net.
Tue Mar 18 04:05:20 UTC 2025  I: Preparing to do remote build '1' on ff4a-armhf-rb.debian.net.
Tue Mar 18 04:11:32 UTC 2025  I: Deleting $TMPDIR on ff4a-armhf-rb.debian.net.
I: pbuilder: network access will be disabled during build
I: Current time: Mon Mar 17 16:05:26 -12 2025
I: pbuilder-time-stamp: 1742270726
I: Building the build Environment
I: extracting base tarball [/var/cache/pbuilder/unstable-reproducible-base.tgz]
I: copying local configuration
W: --override-config is not set; not updating apt.conf Read the manpage for details.
I: mounting /proc filesystem
I: mounting /sys filesystem
I: creating /{dev,run}/shm
I: mounting /dev/pts filesystem
I: redirecting /dev/ptmx to /dev/pts/ptmx
I: policy-rc.d already exists
I: Copying source file
I: copying [kf6-breeze-icons_6.11.0-1.dsc]
I: copying [./kf6-breeze-icons_6.11.0.orig.tar.xz]
I: copying [./kf6-breeze-icons_6.11.0.orig.tar.xz.asc]
I: copying [./kf6-breeze-icons_6.11.0-1.debian.tar.xz]
I: Extracting source
dpkg-source: warning: cannot verify inline signature for ./kf6-breeze-icons_6.11.0-1.dsc: unsupported subcommand
dpkg-source: info: extracting kf6-breeze-icons in kf6-breeze-icons-6.11.0
dpkg-source: info: unpacking kf6-breeze-icons_6.11.0.orig.tar.xz
dpkg-source: info: unpacking kf6-breeze-icons_6.11.0-1.debian.tar.xz
dpkg-source: info: using patch list from debian/patches/series
dpkg-source: info: applying upstream_revert_931fc452_Use-newly-introduced-ColorScheme-Accent.patch
I: Not using root during the build.
I: Installing the build-deps
I: user script /srv/workspace/pbuilder/25425/tmp/hooks/D02_print_environment starting
I: set
  BUILDDIR='/build/reproducible-path'
  BUILDUSERGECOS='first user,first room,first work-phone,first home-phone,first other'
  BUILDUSERNAME='pbuilder1'
  BUILD_ARCH='armhf'
  DEBIAN_FRONTEND='noninteractive'
  DEB_BUILD_OPTIONS='buildinfo=+all reproducible=+all parallel=3 '
  DISTRIBUTION='unstable'
  HOME='/root'
  HOST_ARCH='armhf'
  IFS=' 	
  '
  INVOCATION_ID='132a1de701454bf9b81995c1bc02b6e9'
  LANG='C'
  LANGUAGE='en_US:en'
  LC_ALL='C'
  MAIL='/var/mail/root'
  OPTIND='1'
  PATH='/usr/sbin:/usr/bin:/sbin:/bin:/usr/games'
  PBCURRENTCOMMANDLINEOPERATION='build'
  PBUILDER_OPERATION='build'
  PBUILDER_PKGDATADIR='/usr/share/pbuilder'
  PBUILDER_PKGLIBDIR='/usr/lib/pbuilder'
  PBUILDER_SYSCONFDIR='/etc'
  PPID='25425'
  PS1='# '
  PS2='> '
  PS4='+ '
  PWD='/'
  SHELL='/bin/bash'
  SHLVL='2'
  SUDO_COMMAND='/usr/bin/timeout -k 18.1h 18h /usr/bin/ionice -c 3 /usr/bin/nice /usr/sbin/pbuilder --build --configfile /srv/reproducible-results/rbuild-debian/r-b-build.VHrtOwRP/pbuilderrc_Hz4h --distribution unstable --hookdir /etc/pbuilder/first-build-hooks --debbuildopts -b --basetgz /var/cache/pbuilder/unstable-reproducible-base.tgz --buildresult /srv/reproducible-results/rbuild-debian/r-b-build.VHrtOwRP/b1 --logfile b1/build.log kf6-breeze-icons_6.11.0-1.dsc'
  SUDO_GID='113'
  SUDO_UID='107'
  SUDO_USER='jenkins'
  TERM='unknown'
  TZ='/usr/share/zoneinfo/Etc/GMT+12'
  USER='root'
  _='/usr/bin/systemd-run'
  http_proxy='http://10.0.0.15:3142/'
I: uname -a
  Linux ff4a 6.1.0-32-armmp-lpae #1 SMP Debian 6.1.129-1 (2025-03-06) armv7l GNU/Linux
I: ls -l /bin
  lrwxrwxrwx 1 root root 7 Mar  4 11:20 /bin -> usr/bin
I: user script /srv/workspace/pbuilder/25425/tmp/hooks/D02_print_environment finished
 -> Attempting to satisfy build-dependencies
 -> Creating pbuilder-satisfydepends-dummy package
Package: pbuilder-satisfydepends-dummy
Version: 0.invalid.0
Architecture: armhf
Maintainer: Debian Pbuilder Team <pbuilder-maint@lists.alioth.debian.org>
Description: Dummy package to satisfy dependencies with aptitude - created by pbuilder
 This package was created automatically by pbuilder to satisfy the
 build-dependencies of the package being currently built.
Depends: debhelper-compat (= 13), dh-sequence-kf6, dh-sequence-pkgkde-symbolshelper, cmake (>= 3.16~), extra-cmake-modules (>= 6.11.0~), pkgconf, qt6-base-dev (>= 6.6.0~), fdupes, libxml2-utils, python3-lxml
dpkg-deb: building package 'pbuilder-satisfydepends-dummy' in '/tmp/satisfydepends-aptitude/pbuilder-satisfydepends-dummy.deb'.
Selecting previously unselected package pbuilder-satisfydepends-dummy.
(Reading database ... 19509 files and directories currently installed.)
Preparing to unpack .../pbuilder-satisfydepends-dummy.deb ...
Unpacking pbuilder-satisfydepends-dummy (0.invalid.0) ...
dpkg: pbuilder-satisfydepends-dummy: dependency problems, but configuring anyway as you requested:
 pbuilder-satisfydepends-dummy depends on debhelper-compat (= 13); however:
  Package debhelper-compat is not installed.
 pbuilder-satisfydepends-dummy depends on dh-sequence-kf6; however:
  Package dh-sequence-kf6 is not installed.
 pbuilder-satisfydepends-dummy depends on dh-sequence-pkgkde-symbolshelper; however:
  Package dh-sequence-pkgkde-symbolshelper is not installed.
 pbuilder-satisfydepends-dummy depends on cmake (>= 3.16~); however:
  Package cmake is not installed.
 pbuilder-satisfydepends-dummy depends on extra-cmake-modules (>= 6.11.0~); however:
  Package extra-cmake-modules is not installed.
 pbuilder-satisfydepends-dummy depends on pkgconf; however:
  Package pkgconf is not installed.
 pbuilder-satisfydepends-dummy depends on qt6-base-dev (>= 6.6.0~); however:
  Package qt6-base-dev is not installed.
 pbuilder-satisfydepends-dummy depends on fdupes; however:
  Package fdupes is not installed.
 pbuilder-satisfydepends-dummy depends on libxml2-utils; however:
  Package libxml2-utils is not installed.
 pbuilder-satisfydepends-dummy depends on python3-lxml; however:
  Package python3-lxml is not installed.

Setting up pbuilder-satisfydepends-dummy (0.invalid.0) ...
Reading package lists...
Building dependency tree...
Reading state information...
Initializing package states...
Writing extended state information...
Building tag database...
pbuilder-satisfydepends-dummy is already installed at the requested version (0.invalid.0)
pbuilder-satisfydepends-dummy is already installed at the requested version (0.invalid.0)
The following NEW packages will be installed:
  autoconf{a} automake{a} autopoint{a} autotools-dev{a} bsdextrautils{a} cmake{a} cmake-data{a} debhelper{a} dh-autoreconf{a} dh-strip-nondeterminism{a} dwz{a} extra-cmake-modules{a} fdupes{a} file{a} fontconfig{a} fontconfig-config{a} fonts-dejavu-core{a} fonts-dejavu-mono{a} gettext{a} gettext-base{a} groff-base{a} intltool-debian{a} libarchive-zip-perl{a} libarchive13t64{a} libavahi-client3{a} libavahi-common-data{a} libavahi-common3{a} libb2-1{a} libbrotli1{a} libcom-err2{a} libcups2t64{a} libcurl3t64-gnutls{a} libcurl4t64{a} libdbus-1-3{a} libdebhelper-perl{a} libdouble-conversion3{a} libdrm-amdgpu1{a} libdrm-common{a} libdrm2{a} libduktape207{a} libedit2{a} libegl-mesa0{a} libegl1{a} libelf1t64{a} libevdev2{a} libexpat1{a} libffi8{a} libfile-stripnondeterminism-perl{a} libfontconfig1{a} libfreetype6{a} libgbm1{a} libgcrypt20{a} libgl-dev{a} libgl1{a} libgl1-mesa-dri{a} libglib2.0-0t64{a} libglvnd0{a} libglx-dev{a} libglx-mesa0{a} libglx0{a} libgnutls30t64{a} libgpg-error0{a} libgraphite2-3{a} libgssapi-krb5-2{a} libgudev-1.0-0{a} libharfbuzz0b{a} libice6{a} libicu76{a} libidn2-0{a} libinput-bin{a} libinput10{a} libjpeg62-turbo{a} libjsoncpp26{a} libk5crypto3{a} libkeyutils1{a} libkrb5-3{a} libkrb5support0{a} libldap2{a} libllvm19{a} libmagic-mgc{a} libmagic1t64{a} libmd4c0{a} libmtdev1t64{a} libnghttp2-14{a} libnghttp3-9{a} libngtcp2-16{a} libngtcp2-crypto-gnutls8{a} libopengl-dev{a} libopengl0{a} libp11-kit0{a} libpcre2-16-0{a} libpcre2-32-0{a} libpipeline1{a} libpkgconf3{a} libpng16-16t64{a} libproc2-0{a} libproxy1v5{a} libpsl5t64{a} libpython3-stdlib{a} libpython3.13-minimal{a} libpython3.13-stdlib{a} libqt6concurrent6{a} libqt6core6t64{a} libqt6dbus6{a} libqt6gui6{a} libqt6network6{a} libqt6opengl6{a} libqt6openglwidgets6{a} libqt6printsupport6{a} libqt6sql6{a} libqt6test6{a} libqt6widgets6{a} libqt6xml6{a} libreadline8t64{a} librhash1{a} librtmp1{a} libsasl2-2{a} libsasl2-modules-db{a} libsensors-config{a} libsensors5{a} libsm6{a} libssh2-1t64{a} libtasn1-6{a} libtool{a} libts0t64{a} libuchardet0{a} libunistring5{a} libuv1t64{a} libvulkan-dev{a} libvulkan1{a} libwacom-common{a} libwacom9{a} libwayland-client0{a} libwayland-server0{a} libx11-6{a} libx11-data{a} libx11-dev{a} libx11-xcb1{a} libxau-dev{a} libxau6{a} libxcb-cursor0{a} libxcb-dri3-0{a} libxcb-glx0{a} libxcb-icccm4{a} libxcb-image0{a} libxcb-keysyms1{a} libxcb-present0{a} libxcb-randr0{a} libxcb-render-util0{a} libxcb-render0{a} libxcb-shape0{a} libxcb-shm0{a} libxcb-sync1{a} libxcb-util1{a} libxcb-xfixes0{a} libxcb-xinput0{a} libxcb-xkb1{a} libxcb1{a} libxcb1-dev{a} libxdmcp-dev{a} libxdmcp6{a} libxext6{a} libxkbcommon-x11-0{a} libxkbcommon0{a} libxml2{a} libxml2-utils{a} libxshmfence1{a} libxslt1.1{a} libxxf86vm1{a} libyaml-0-2{a} libz3-4{a} m4{a} man-db{a} media-types{a} mesa-libgallium{a} netbase{a} pkg-kde-tools{a} pkgconf{a} pkgconf-bin{a} po-debconf{a} procps{a} python3{a} python3-charset-normalizer{a} python3-debian{a} python3-lxml{a} python3-minimal{a} python3-yaml{a} python3.13{a} python3.13-minimal{a} qmake6{a} qmake6-bin{a} qt6-base-dev{a} qt6-base-dev-tools{a} qt6-qpa-plugins{a} readline-common{a} sensible-utils{a} shared-mime-info{a} tzdata{a} x11-common{a} x11proto-dev{a} xkb-data{a} xorg-sgml-doctools{a} xtrans-dev{a} 
The following packages are RECOMMENDED but will NOT be installed:
  ca-certificates curl dbus krb5-locales libarchive-cpio-perl libglib2.0-data libgpg-error-l10n libldap-common libltdl-dev libmail-sendmail-perl libqt6sql6-ibase libqt6sql6-mysql libqt6sql6-odbc libqt6sql6-psql libqt6sql6-sqlite libsasl2-modules libwww-perl linux-sysctl-defaults lynx mesa-vulkan-drivers psmisc publicsuffix python3-bs4 python3-cssselect python3-html5lib qt6-gtk-platformtheme qt6-svg-plugins qt6-translations-l10n qt6-wayland wget xdg-user-dirs 
0 packages upgraded, 203 newly installed, 0 to remove and 0 not upgraded.
Need to get 119 MB of archives. After unpacking 484 MB will be used.
Writing extended state information...
Get: 1 http://deb.debian.org/debian unstable/main armhf libpython3.13-minimal armhf 3.13.2-2 [846 kB]
Get: 2 http://deb.debian.org/debian unstable/main armhf libexpat1 armhf 2.7.0-1 [85.2 kB]
Get: 3 http://deb.debian.org/debian unstable/main armhf python3.13-minimal armhf 3.13.2-2 [1840 kB]
Get: 4 http://deb.debian.org/debian unstable/main armhf python3-minimal armhf 3.13.2-2 [27.1 kB]
Get: 5 http://deb.debian.org/debian unstable/main armhf media-types all 13.0.0 [29.3 kB]
Get: 6 http://deb.debian.org/debian unstable/main armhf netbase all 6.5 [12.4 kB]
Get: 7 http://deb.debian.org/debian unstable/main armhf tzdata all 2025a-2 [259 kB]
Get: 8 http://deb.debian.org/debian unstable/main armhf libffi8 armhf 3.4.7-1 [20.3 kB]
Get: 9 http://deb.debian.org/debian unstable/main armhf readline-common all 8.2-6 [69.4 kB]
Get: 10 http://deb.debian.org/debian unstable/main armhf libreadline8t64 armhf 8.2-6 [146 kB]
Get: 11 http://deb.debian.org/debian unstable/main armhf libpython3.13-stdlib armhf 3.13.2-2 [1826 kB]
Get: 12 http://deb.debian.org/debian unstable/main armhf python3.13 armhf 3.13.2-2 [746 kB]
Get: 13 http://deb.debian.org/debian unstable/main armhf libpython3-stdlib armhf 3.13.2-2 [10.1 kB]
Get: 14 http://deb.debian.org/debian unstable/main armhf python3 armhf 3.13.2-2 [28.1 kB]
Get: 15 http://deb.debian.org/debian unstable/main armhf libproc2-0 armhf 2:4.0.4-7 [56.3 kB]
Get: 16 http://deb.debian.org/debian unstable/main armhf procps armhf 2:4.0.4-7 [866 kB]
Get: 17 http://deb.debian.org/debian unstable/main armhf sensible-utils all 0.0.24 [24.8 kB]
Get: 18 http://deb.debian.org/debian unstable/main armhf libmagic-mgc armhf 1:5.46-2 [337 kB]
Get: 19 http://deb.debian.org/debian unstable/main armhf libmagic1t64 armhf 1:5.46-2 [99.9 kB]
Get: 20 http://deb.debian.org/debian unstable/main armhf file armhf 1:5.46-2 [42.6 kB]
Get: 21 http://deb.debian.org/debian unstable/main armhf gettext-base armhf 0.23.1-1 [238 kB]
Get: 22 http://deb.debian.org/debian unstable/main armhf libuchardet0 armhf 0.0.8-1+b2 [65.6 kB]
Get: 23 http://deb.debian.org/debian unstable/main armhf groff-base armhf 1.23.0-7 [1095 kB]
Get: 24 http://deb.debian.org/debian unstable/main armhf bsdextrautils armhf 2.40.4-5 [84.9 kB]
Get: 25 http://deb.debian.org/debian unstable/main armhf libpipeline1 armhf 1.5.8-1 [35.0 kB]
Get: 26 http://deb.debian.org/debian unstable/main armhf man-db armhf 2.13.0-1 [1382 kB]
Get: 27 http://deb.debian.org/debian unstable/main armhf m4 armhf 1.4.19-7 [272 kB]
Get: 28 http://deb.debian.org/debian unstable/main armhf autoconf all 2.72-3 [493 kB]
Get: 29 http://deb.debian.org/debian unstable/main armhf autotools-dev all 20220109.1 [51.6 kB]
Get: 30 http://deb.debian.org/debian unstable/main armhf automake all 1:1.17-3 [862 kB]
Get: 31 http://deb.debian.org/debian unstable/main armhf autopoint all 0.23.1-1 [770 kB]
Get: 32 http://deb.debian.org/debian unstable/main armhf cmake-data all 3.31.6-1 [2268 kB]
Get: 33 http://deb.debian.org/debian unstable/main armhf libicu76 armhf 76.1-3 [9368 kB]
Get: 34 http://deb.debian.org/debian unstable/main armhf libxml2 armhf 2.12.7+dfsg+really2.9.14-0.3+b1 [605 kB]
Get: 35 http://deb.debian.org/debian unstable/main armhf libarchive13t64 armhf 3.7.4-1.1 [306 kB]
Get: 36 http://deb.debian.org/debian unstable/main armhf libbrotli1 armhf 1.1.0-2+b7 [284 kB]
Get: 37 http://deb.debian.org/debian unstable/main armhf libkrb5support0 armhf 1.21.3-5 [30.4 kB]
Get: 38 http://deb.debian.org/debian unstable/main armhf libcom-err2 armhf 1.47.2-1+b1 [23.6 kB]
Get: 39 http://deb.debian.org/debian unstable/main armhf libk5crypto3 armhf 1.21.3-5 [76.0 kB]
Get: 40 http://deb.debian.org/debian unstable/main armhf libkeyutils1 armhf 1.6.3-4 [8096 B]
Get: 41 http://deb.debian.org/debian unstable/main armhf libkrb5-3 armhf 1.21.3-5 [284 kB]
Get: 42 http://deb.debian.org/debian unstable/main armhf libgssapi-krb5-2 armhf 1.21.3-5 [116 kB]
Get: 43 http://deb.debian.org/debian unstable/main armhf libunistring5 armhf 1.3-1 [444 kB]
Get: 44 http://deb.debian.org/debian unstable/main armhf libidn2-0 armhf 2.3.8-2 [105 kB]
Get: 45 http://deb.debian.org/debian unstable/main armhf libsasl2-modules-db armhf 2.1.28+dfsg1-9 [18.5 kB]
Get: 46 http://deb.debian.org/debian unstable/main armhf libsasl2-2 armhf 2.1.28+dfsg1-9 [50.4 kB]
Get: 47 http://deb.debian.org/debian unstable/main armhf libldap2 armhf 2.6.9+dfsg-2 [168 kB]
Get: 48 http://deb.debian.org/debian unstable/main armhf libnghttp2-14 armhf 1.64.0-1 [62.9 kB]
Get: 49 http://deb.debian.org/debian unstable/main armhf libnghttp3-9 armhf 1.8.0-1 [59.9 kB]
Get: 50 http://deb.debian.org/debian unstable/main armhf libpsl5t64 armhf 0.21.2-1.1+b1 [55.8 kB]
Get: 51 http://deb.debian.org/debian unstable/main armhf libp11-kit0 armhf 0.25.5-3 [385 kB]
Get: 52 http://deb.debian.org/debian unstable/main armhf libtasn1-6 armhf 4.20.0-2 [44.4 kB]
Get: 53 http://deb.debian.org/debian unstable/main armhf libgnutls30t64 armhf 3.8.9-2 [1382 kB]
Get: 54 http://deb.debian.org/debian unstable/main armhf librtmp1 armhf 2.4+20151223.gitfa8646d.1-2+b5 [53.2 kB]
Get: 55 http://deb.debian.org/debian unstable/main armhf libssh2-1t64 armhf 1.11.1-1 [227 kB]
Get: 56 http://deb.debian.org/debian unstable/main armhf libcurl4t64 armhf 8.13.0~rc2-1 [328 kB]
Get: 57 http://deb.debian.org/debian unstable/main armhf libjsoncpp26 armhf 1.9.6-3 [69.9 kB]
Get: 58 http://deb.debian.org/debian unstable/main armhf librhash1 armhf 1.4.5-1 [143 kB]
Get: 59 http://deb.debian.org/debian unstable/main armhf libuv1t64 armhf 1.50.0-2 [140 kB]
Get: 60 http://deb.debian.org/debian unstable/main armhf cmake armhf 3.31.6-1 [5909 kB]
Get: 61 http://deb.debian.org/debian unstable/main armhf libdebhelper-perl all 13.24.1 [90.9 kB]
Get: 62 http://deb.debian.org/debian unstable/main armhf libtool all 2.5.4-4 [539 kB]
Get: 63 http://deb.debian.org/debian unstable/main armhf dh-autoreconf all 20 [17.1 kB]
Get: 64 http://deb.debian.org/debian unstable/main armhf libarchive-zip-perl all 1.68-1 [104 kB]
Get: 65 http://deb.debian.org/debian unstable/main armhf libfile-stripnondeterminism-perl all 1.14.1-2 [19.7 kB]
Get: 66 http://deb.debian.org/debian unstable/main armhf dh-strip-nondeterminism all 1.14.1-2 [8620 B]
Get: 67 http://deb.debian.org/debian unstable/main armhf libelf1t64 armhf 0.192-4 [184 kB]
Get: 68 http://deb.debian.org/debian unstable/main armhf dwz armhf 0.15-1+b2 [106 kB]
Get: 69 http://deb.debian.org/debian unstable/main armhf gettext armhf 0.23.1-1 [1560 kB]
Get: 70 http://deb.debian.org/debian unstable/main armhf intltool-debian all 0.35.0+20060710.6 [22.9 kB]
Get: 71 http://deb.debian.org/debian unstable/main armhf po-debconf all 1.0.21+nmu1 [248 kB]
Get: 72 http://deb.debian.org/debian unstable/main armhf debhelper all 13.24.1 [920 kB]
Get: 73 http://deb.debian.org/debian unstable/main armhf extra-cmake-modules armhf 6.11.0-1 [201 kB]
Get: 74 http://deb.debian.org/debian unstable/main armhf libpcre2-32-0 armhf 10.45-1 [235 kB]
Get: 75 http://deb.debian.org/debian unstable/main armhf fdupes armhf 1:2.3.2-1 [43.9 kB]
Get: 76 http://deb.debian.org/debian unstable/main armhf libpng16-16t64 armhf 1.6.47-1.1 [264 kB]
Get: 77 http://deb.debian.org/debian unstable/main armhf libfreetype6 armhf 2.13.3+dfsg-1 [385 kB]
Get: 78 http://deb.debian.org/debian unstable/main armhf fonts-dejavu-mono all 2.37-8 [489 kB]
Get: 79 http://deb.debian.org/debian unstable/main armhf fonts-dejavu-core all 2.37-8 [840 kB]
Get: 80 http://deb.debian.org/debian unstable/main armhf fontconfig-config armhf 2.15.0-2.1 [318 kB]
Get: 81 http://deb.debian.org/debian unstable/main armhf libfontconfig1 armhf 2.15.0-2.1 [371 kB]
Get: 82 http://deb.debian.org/debian unstable/main armhf fontconfig armhf 2.15.0-2.1 [462 kB]
Get: 83 http://deb.debian.org/debian unstable/main armhf libavahi-common-data armhf 0.8-16 [112 kB]
Get: 84 http://deb.debian.org/debian unstable/main armhf libavahi-common3 armhf 0.8-16 [41.2 kB]
Get: 85 http://deb.debian.org/debian unstable/main armhf libdbus-1-3 armhf 1.16.2-2 [155 kB]
Get: 86 http://deb.debian.org/debian unstable/main armhf libavahi-client3 armhf 0.8-16 [44.6 kB]
Get: 87 http://deb.debian.org/debian unstable/main armhf libb2-1 armhf 0.98.1-1.1+b2 [21.4 kB]
Get: 88 http://deb.debian.org/debian unstable/main armhf libcups2t64 armhf 2.4.10-2+b1 [220 kB]
Get: 89 http://deb.debian.org/debian unstable/main armhf libngtcp2-16 armhf 1.11.0-1 [127 kB]
Get: 90 http://deb.debian.org/debian unstable/main armhf libngtcp2-crypto-gnutls8 armhf 1.11.0-1 [26.7 kB]
Get: 91 http://deb.debian.org/debian unstable/main armhf libcurl3t64-gnutls armhf 8.13.0~rc2-1 [323 kB]
Get: 92 http://deb.debian.org/debian unstable/main armhf libdouble-conversion3 armhf 3.3.1-1 [39.3 kB]
Get: 93 http://deb.debian.org/debian unstable/main armhf libdrm-common all 2.4.124-1 [8180 B]
Get: 94 http://deb.debian.org/debian unstable/main armhf libdrm2 armhf 2.4.124-1 [34.3 kB]
Get: 95 http://deb.debian.org/debian unstable/main armhf libdrm-amdgpu1 armhf 2.4.124-1 [20.6 kB]
Get: 96 http://deb.debian.org/debian unstable/main armhf libduktape207 armhf 2.7.0-2+b2 [115 kB]
Get: 97 http://deb.debian.org/debian unstable/main armhf libedit2 armhf 3.1-20250104-1 [78.0 kB]
Get: 98 http://deb.debian.org/debian unstable/main armhf libwayland-server0 armhf 1.23.1-3 [28.2 kB]
Get: 99 http://deb.debian.org/debian unstable/main armhf libz3-4 armhf 4.13.3-1 [7252 kB]
Get: 100 http://deb.debian.org/debian unstable/main armhf libllvm19 armhf 1:19.1.7-3 [23.8 MB]
Get: 101 http://deb.debian.org/debian unstable/main armhf libsensors-config all 1:3.6.0-10 [14.6 kB]
Get: 102 http://deb.debian.org/debian unstable/main armhf libsensors5 armhf 1:3.6.0-10+b1 [32.3 kB]
Get: 103 http://deb.debian.org/debian unstable/main armhf libxau6 armhf 1:1.0.11-1 [19.7 kB]
Get: 104 http://deb.debian.org/debian unstable/main armhf libxdmcp6 armhf 1:1.1.5-1 [26.4 kB]
Get: 105 http://deb.debian.org/debian unstable/main armhf libxcb1 armhf 1.17.0-2+b1 [140 kB]
Get: 106 http://deb.debian.org/debian unstable/main armhf libx11-data all 2:1.8.10-2 [337 kB]
Get: 107 http://deb.debian.org/debian unstable/main armhf libx11-6 armhf 2:1.8.10-2 [750 kB]
Get: 108 http://deb.debian.org/debian unstable/main armhf libx11-xcb1 armhf 2:1.8.10-2 [241 kB]
Get: 109 http://deb.debian.org/debian unstable/main armhf libxcb-dri3-0 armhf 1.17.0-2+b1 [107 kB]
Get: 110 http://deb.debian.org/debian unstable/main armhf libxcb-present0 armhf 1.17.0-2+b1 [105 kB]
Get: 111 http://deb.debian.org/debian unstable/main armhf libxcb-randr0 armhf 1.17.0-2+b1 [116 kB]
Get: 112 http://deb.debian.org/debian unstable/main armhf libxcb-sync1 armhf 1.17.0-2+b1 [108 kB]
Get: 113 http://deb.debian.org/debian unstable/main armhf libxcb-xfixes0 armhf 1.17.0-2+b1 [109 kB]
Get: 114 http://deb.debian.org/debian unstable/main armhf libxshmfence1 armhf 1.3-1+b3 [8748 B]
Get: 115 http://deb.debian.org/debian unstable/main armhf mesa-libgallium armhf 25.0.1-2 [7396 kB]
Get: 116 http://deb.debian.org/debian unstable/main armhf libgbm1 armhf 25.0.1-2 [40.2 kB]
Get: 117 http://deb.debian.org/debian unstable/main armhf libwayland-client0 armhf 1.23.1-3 [21.5 kB]
Get: 118 http://deb.debian.org/debian unstable/main armhf libxcb-shm0 armhf 1.17.0-2+b1 [105 kB]
Get: 119 http://deb.debian.org/debian unstable/main armhf libegl-mesa0 armhf 25.0.1-2 [106 kB]
Get: 120 http://deb.debian.org/debian unstable/main armhf libevdev2 armhf 1.13.3+dfsg-1 [26.2 kB]
Get: 121 http://deb.debian.org/debian unstable/main armhf libgpg-error0 armhf 1.51-3 [71.9 kB]
Get: 122 http://deb.debian.org/debian unstable/main armhf libgcrypt20 armhf 1.11.0-7 [727 kB]
Get: 123 http://deb.debian.org/debian unstable/main armhf libglvnd0 armhf 1.7.0-1+b2 [51.8 kB]
Get: 124 http://deb.debian.org/debian unstable/main armhf libxcb-glx0 armhf 1.17.0-2+b1 [120 kB]
Get: 125 http://deb.debian.org/debian unstable/main armhf libxext6 armhf 2:1.3.4-1+b3 [45.2 kB]
Get: 126 http://deb.debian.org/debian unstable/main armhf libxxf86vm1 armhf 1:1.1.4-1+b4 [18.2 kB]
Get: 127 http://deb.debian.org/debian unstable/main armhf libvulkan1 armhf 1.4.304.0-1 [113 kB]
Get: 128 http://deb.debian.org/debian unstable/main armhf libgl1-mesa-dri armhf 25.0.1-2 [42.7 kB]
Get: 129 http://deb.debian.org/debian unstable/main armhf libglx-mesa0 armhf 25.0.1-2 [123 kB]
Get: 130 http://deb.debian.org/debian unstable/main armhf libglx0 armhf 1.7.0-1+b2 [32.6 kB]
Get: 131 http://deb.debian.org/debian unstable/main armhf libgl1 armhf 1.7.0-1+b2 [88.2 kB]
Get: 132 http://deb.debian.org/debian unstable/main armhf xorg-sgml-doctools all 1:1.11-1.1 [22.1 kB]
Get: 133 http://deb.debian.org/debian unstable/main armhf x11proto-dev all 2024.1-1 [603 kB]
Get: 134 http://deb.debian.org/debian unstable/main armhf libxau-dev armhf 1:1.0.11-1 [23.0 kB]
Get: 135 http://deb.debian.org/debian unstable/main armhf libxdmcp-dev armhf 1:1.1.5-1 [42.9 kB]
Get: 136 http://deb.debian.org/debian unstable/main armhf xtrans-dev all 1.4.0-1 [98.7 kB]
Get: 137 http://deb.debian.org/debian unstable/main armhf libxcb1-dev armhf 1.17.0-2+b1 [180 kB]
Get: 138 http://deb.debian.org/debian unstable/main armhf libx11-dev armhf 2:1.8.10-2 [825 kB]
Get: 139 http://deb.debian.org/debian unstable/main armhf libglx-dev armhf 1.7.0-1+b2 [15.8 kB]
Get: 140 http://deb.debian.org/debian unstable/main armhf libgl-dev armhf 1.7.0-1+b2 [101 kB]
Get: 141 http://deb.debian.org/debian unstable/main armhf libglib2.0-0t64 armhf 2.84.0-2 [1338 kB]
Get: 142 http://deb.debian.org/debian unstable/main armhf libgraphite2-3 armhf 1.3.14-2+b1 [63.1 kB]
Get: 143 http://deb.debian.org/debian unstable/main armhf libgudev-1.0-0 armhf 238-6 [12.7 kB]
Get: 144 http://deb.debian.org/debian unstable/main armhf libharfbuzz0b armhf 10.2.0-1+b1 [419 kB]
Get: 145 http://deb.debian.org/debian unstable/main armhf x11-common all 1:7.7+24 [217 kB]
Get: 146 http://deb.debian.org/debian unstable/main armhf libice6 armhf 2:1.1.1-1 [58.5 kB]
Get: 147 http://deb.debian.org/debian unstable/main armhf libwacom-common all 2.14.0-1 [103 kB]
Get: 148 http://deb.debian.org/debian unstable/main armhf libwacom9 armhf 2.14.0-1 [21.9 kB]
Get: 149 http://deb.debian.org/debian unstable/main armhf libinput-bin armhf 1.27.1-1 [24.4 kB]
Get: 150 http://deb.debian.org/debian unstable/main armhf libmtdev1t64 armhf 1.1.7-1 [21.5 kB]
Get: 151 http://deb.debian.org/debian unstable/main armhf libinput10 armhf 1.27.1-1 [116 kB]
Get: 152 http://deb.debian.org/debian unstable/main armhf libjpeg62-turbo armhf 1:2.1.5-3.1 [145 kB]
Get: 153 http://deb.debian.org/debian unstable/main armhf libmd4c0 armhf 0.5.2-2+b1 [43.8 kB]
Get: 154 http://deb.debian.org/debian unstable/main armhf libopengl0 armhf 1.7.0-1+b2 [32.1 kB]
Get: 155 http://deb.debian.org/debian unstable/main armhf libopengl-dev armhf 1.7.0-1+b2 [5372 B]
Get: 156 http://deb.debian.org/debian unstable/main armhf libpcre2-16-0 armhf 10.45-1 [243 kB]
Get: 157 http://deb.debian.org/debian unstable/main armhf libpkgconf3 armhf 1.8.1-4 [31.8 kB]
Get: 158 http://deb.debian.org/debian unstable/main armhf libproxy1v5 armhf 0.5.9-1 [23.6 kB]
Get: 159 http://deb.debian.org/debian unstable/main armhf shared-mime-info armhf 2.4-5+b2 [754 kB]
Get: 160 http://deb.debian.org/debian unstable/main armhf libqt6core6t64 armhf 6.8.2+dfsg-5+b1 [1569 kB]
Get: 161 http://deb.debian.org/debian unstable/main armhf libqt6concurrent6 armhf 6.8.2+dfsg-5+b1 [41.0 kB]
Get: 162 http://deb.debian.org/debian unstable/main armhf libqt6dbus6 armhf 6.8.2+dfsg-5+b1 [233 kB]
Get: 163 http://deb.debian.org/debian unstable/main armhf libegl1 armhf 1.7.0-1+b2 [29.1 kB]
Get: 164 http://deb.debian.org/debian unstable/main armhf libsm6 armhf 2:1.2.4-1 [33.5 kB]
Get: 165 http://deb.debian.org/debian unstable/main armhf libts0t64 armhf 1.22-1.1+b1 [58.1 kB]
Get: 166 http://deb.debian.org/debian unstable/main armhf libxcb-util1 armhf 0.4.1-1 [22.5 kB]
Get: 167 http://deb.debian.org/debian unstable/main armhf libxcb-image0 armhf 0.4.0-2+b2 [21.0 kB]
Get: 168 http://deb.debian.org/debian unstable/main armhf libxcb-render0 armhf 1.17.0-2+b1 [114 kB]
Get: 169 http://deb.debian.org/debian unstable/main armhf libxcb-render-util0 armhf 0.3.10-1 [17.7 kB]
Get: 170 http://deb.debian.org/debian unstable/main armhf libxcb-cursor0 armhf 0.1.5-1 [16.4 kB]
Get: 171 http://deb.debian.org/debian unstable/main armhf libxcb-icccm4 armhf 0.4.2-1 [26.4 kB]
Get: 172 http://deb.debian.org/debian unstable/main armhf libxcb-keysyms1 armhf 0.4.1-1 [16.2 kB]
Get: 173 http://deb.debian.org/debian unstable/main armhf libxcb-shape0 armhf 1.17.0-2+b1 [106 kB]
Get: 174 http://deb.debian.org/debian unstable/main armhf libxcb-xinput0 armhf 1.17.0-2+b1 [127 kB]
Get: 175 http://deb.debian.org/debian unstable/main armhf libxcb-xkb1 armhf 1.17.0-2+b1 [126 kB]
Get: 176 http://deb.debian.org/debian unstable/main armhf xkb-data all 2.42-1 [790 kB]
Get: 177 http://deb.debian.org/debian unstable/main armhf libxkbcommon0 armhf 1.7.0-2 [99.7 kB]
Get: 178 http://deb.debian.org/debian unstable/main armhf libxkbcommon-x11-0 armhf 1.7.0-2 [14.3 kB]
Get: 179 http://deb.debian.org/debian unstable/main armhf libqt6gui6 armhf 6.8.2+dfsg-5+b1 [2715 kB]
Get: 180 http://deb.debian.org/debian unstable/main armhf libqt6network6 armhf 6.8.2+dfsg-5+b1 [712 kB]
Get: 181 http://deb.debian.org/debian unstable/main armhf libqt6opengl6 armhf 6.8.2+dfsg-5+b1 [364 kB]
Get: 182 http://deb.debian.org/debian unstable/main armhf libqt6widgets6 armhf 6.8.2+dfsg-5+b1 [2320 kB]
Get: 183 http://deb.debian.org/debian unstable/main armhf libqt6openglwidgets6 armhf 6.8.2+dfsg-5+b1 [47.7 kB]
Get: 184 http://deb.debian.org/debian unstable/main armhf libqt6printsupport6 armhf 6.8.2+dfsg-5+b1 [201 kB]
Get: 185 http://deb.debian.org/debian unstable/main armhf libqt6sql6 armhf 6.8.2+dfsg-5+b1 [128 kB]
Get: 186 http://deb.debian.org/debian unstable/main armhf libqt6test6 armhf 6.8.2+dfsg-5+b1 [173 kB]
Get: 187 http://deb.debian.org/debian unstable/main armhf libqt6xml6 armhf 6.8.2+dfsg-5+b1 [78.0 kB]
Get: 188 http://deb.debian.org/debian unstable/main armhf libvulkan-dev armhf 1.4.304.0-1 [1452 kB]
Get: 189 http://deb.debian.org/debian unstable/main armhf libxml2-utils armhf 2.12.7+dfsg+really2.9.14-0.3+b1 [98.6 kB]
Get: 190 http://deb.debian.org/debian unstable/main armhf libxslt1.1 armhf 1.1.35-1.2 [212 kB]
Get: 191 http://deb.debian.org/debian unstable/main armhf libyaml-0-2 armhf 0.2.5-2 [45.4 kB]
Get: 192 http://deb.debian.org/debian unstable/main armhf python3-charset-normalizer armhf 3.4.1-1+b1 [118 kB]
Get: 193 http://deb.debian.org/debian unstable/main armhf python3-debian all 1.0.1 [120 kB]
Get: 194 http://deb.debian.org/debian unstable/main armhf python3-yaml armhf 6.0.2-1+b2 [126 kB]
Get: 195 http://deb.debian.org/debian unstable/main armhf pkg-kde-tools all 0.18.12 [89.1 kB]
Get: 196 http://deb.debian.org/debian unstable/main armhf pkgconf-bin armhf 1.8.1-4 [29.2 kB]
Get: 197 http://deb.debian.org/debian unstable/main armhf pkgconf armhf 1.8.1-4 [26.1 kB]
Get: 198 http://deb.debian.org/debian unstable/main armhf python3-lxml armhf 5.3.1-1+b1 [1192 kB]
Get: 199 http://deb.debian.org/debian unstable/main armhf qmake6-bin armhf 6.8.2+dfsg-5+b1 [575 kB]
Get: 200 http://deb.debian.org/debian unstable/main armhf qmake6 armhf 6.8.2+dfsg-5+b1 [150 kB]
Get: 201 http://deb.debian.org/debian unstable/main armhf qt6-base-dev-tools armhf 6.8.2+dfsg-5+b1 [939 kB]
Get: 202 http://deb.debian.org/debian unstable/main armhf qt6-qpa-plugins armhf 6.8.2+dfsg-5+b1 [83.9 kB]
Get: 203 http://deb.debian.org/debian unstable/main armhf qt6-base-dev armhf 6.8.2+dfsg-5+b1 [10.9 MB]
Fetched 119 MB in 7s (18.3 MB/s)
Preconfiguring packages ...
Selecting previously unselected package libpython3.13-minimal:armhf.
(Reading database ... 
(Reading database ... 5%
(Reading database ... 10%
(Reading database ... 15%
(Reading database ... 20%
(Reading database ... 25%
(Reading database ... 30%
(Reading database ... 35%
(Reading database ... 40%
(Reading database ... 45%
(Reading database ... 50%
(Reading database ... 55%
(Reading database ... 60%
(Reading database ... 65%
(Reading database ... 70%
(Reading database ... 75%
(Reading database ... 80%
(Reading database ... 85%
(Reading database ... 90%
(Reading database ... 95%
(Reading database ... 100%
(Reading database ... 19509 files and directories currently installed.)
Preparing to unpack .../libpython3.13-minimal_3.13.2-2_armhf.deb ...
Unpacking libpython3.13-minimal:armhf (3.13.2-2) ...
Selecting previously unselected package libexpat1:armhf.
Preparing to unpack .../libexpat1_2.7.0-1_armhf.deb ...
Unpacking libexpat1:armhf (2.7.0-1) ...
Selecting previously unselected package python3.13-minimal.
Preparing to unpack .../python3.13-minimal_3.13.2-2_armhf.deb ...
Unpacking python3.13-minimal (3.13.2-2) ...
Setting up libpython3.13-minimal:armhf (3.13.2-2) ...
Setting up libexpat1:armhf (2.7.0-1) ...
Setting up python3.13-minimal (3.13.2-2) ...
Selecting previously unselected package python3-minimal.
(Reading database ... 
(Reading database ... 5%
(Reading database ... 10%
(Reading database ... 15%
(Reading database ... 20%
(Reading database ... 25%
(Reading database ... 30%
(Reading database ... 35%
(Reading database ... 40%
(Reading database ... 45%
(Reading database ... 50%
(Reading database ... 55%
(Reading database ... 60%
(Reading database ... 65%
(Reading database ... 70%
(Reading database ... 75%
(Reading database ... 80%
(Reading database ... 85%
(Reading database ... 90%
(Reading database ... 95%
(Reading database ... 100%
(Reading database ... 19843 files and directories currently installed.)
Preparing to unpack .../0-python3-minimal_3.13.2-2_armhf.deb ...
Unpacking python3-minimal (3.13.2-2) ...
Selecting previously unselected package media-types.
Preparing to unpack .../1-media-types_13.0.0_all.deb ...
Unpacking media-types (13.0.0) ...
Selecting previously unselected package netbase.
Preparing to unpack .../2-netbase_6.5_all.deb ...
Unpacking netbase (6.5) ...
Selecting previously unselected package tzdata.
Preparing to unpack .../3-tzdata_2025a-2_all.deb ...
Unpacking tzdata (2025a-2) ...
Selecting previously unselected package libffi8:armhf.
Preparing to unpack .../4-libffi8_3.4.7-1_armhf.deb ...
Unpacking libffi8:armhf (3.4.7-1) ...
Selecting previously unselected package readline-common.
Preparing to unpack .../5-readline-common_8.2-6_all.deb ...
Unpacking readline-common (8.2-6) ...
Selecting previously unselected package libreadline8t64:armhf.
Preparing to unpack .../6-libreadline8t64_8.2-6_armhf.deb ...
Adding 'diversion of /lib/arm-linux-gnueabihf/libhistory.so.8 to /lib/arm-linux-gnueabihf/libhistory.so.8.usr-is-merged by libreadline8t64'
Adding 'diversion of /lib/arm-linux-gnueabihf/libhistory.so.8.2 to /lib/arm-linux-gnueabihf/libhistory.so.8.2.usr-is-merged by libreadline8t64'
Adding 'diversion of /lib/arm-linux-gnueabihf/libreadline.so.8 to /lib/arm-linux-gnueabihf/libreadline.so.8.usr-is-merged by libreadline8t64'
Adding 'diversion of /lib/arm-linux-gnueabihf/libreadline.so.8.2 to /lib/arm-linux-gnueabihf/libreadline.so.8.2.usr-is-merged by libreadline8t64'
Unpacking libreadline8t64:armhf (8.2-6) ...
Selecting previously unselected package libpython3.13-stdlib:armhf.
Preparing to unpack .../7-libpython3.13-stdlib_3.13.2-2_armhf.deb ...
Unpacking libpython3.13-stdlib:armhf (3.13.2-2) ...
Selecting previously unselected package python3.13.
Preparing to unpack .../8-python3.13_3.13.2-2_armhf.deb ...
Unpacking python3.13 (3.13.2-2) ...
Selecting previously unselected package libpython3-stdlib:armhf.
Preparing to unpack .../9-libpython3-stdlib_3.13.2-2_armhf.deb ...
Unpacking libpython3-stdlib:armhf (3.13.2-2) ...
Setting up python3-minimal (3.13.2-2) ...
Selecting previously unselected package python3.
(Reading database ... 
(Reading database ... 5%
(Reading database ... 10%
(Reading database ... 15%
(Reading database ... 20%
(Reading database ... 25%
(Reading database ... 30%
(Reading database ... 35%
(Reading database ... 40%
(Reading database ... 45%
(Reading database ... 50%
(Reading database ... 55%
(Reading database ... 60%
(Reading database ... 65%
(Reading database ... 70%
(Reading database ... 75%
(Reading database ... 80%
(Reading database ... 85%
(Reading database ... 90%
(Reading database ... 95%
(Reading database ... 100%
(Reading database ... 20853 files and directories currently installed.)
Preparing to unpack .../000-python3_3.13.2-2_armhf.deb ...
Unpacking python3 (3.13.2-2) ...
Selecting previously unselected package libproc2-0:armhf.
Preparing to unpack .../001-libproc2-0_2%3a4.0.4-7_armhf.deb ...
Unpacking libproc2-0:armhf (2:4.0.4-7) ...
Selecting previously unselected package procps.
Preparing to unpack .../002-procps_2%3a4.0.4-7_armhf.deb ...
Unpacking procps (2:4.0.4-7) ...
Selecting previously unselected package sensible-utils.
Preparing to unpack .../003-sensible-utils_0.0.24_all.deb ...
Unpacking sensible-utils (0.0.24) ...
Selecting previously unselected package libmagic-mgc.
Preparing to unpack .../004-libmagic-mgc_1%3a5.46-2_armhf.deb ...
Unpacking libmagic-mgc (1:5.46-2) ...
Selecting previously unselected package libmagic1t64:armhf.
Preparing to unpack .../005-libmagic1t64_1%3a5.46-2_armhf.deb ...
Unpacking libmagic1t64:armhf (1:5.46-2) ...
Selecting previously unselected package file.
Preparing to unpack .../006-file_1%3a5.46-2_armhf.deb ...
Unpacking file (1:5.46-2) ...
Selecting previously unselected package gettext-base.
Preparing to unpack .../007-gettext-base_0.23.1-1_armhf.deb ...
Unpacking gettext-base (0.23.1-1) ...
Selecting previously unselected package libuchardet0:armhf.
Preparing to unpack .../008-libuchardet0_0.0.8-1+b2_armhf.deb ...
Unpacking libuchardet0:armhf (0.0.8-1+b2) ...
Selecting previously unselected package groff-base.
Preparing to unpack .../009-groff-base_1.23.0-7_armhf.deb ...
Unpacking groff-base (1.23.0-7) ...
Selecting previously unselected package bsdextrautils.
Preparing to unpack .../010-bsdextrautils_2.40.4-5_armhf.deb ...
Unpacking bsdextrautils (2.40.4-5) ...
Selecting previously unselected package libpipeline1:armhf.
Preparing to unpack .../011-libpipeline1_1.5.8-1_armhf.deb ...
Unpacking libpipeline1:armhf (1.5.8-1) ...
Selecting previously unselected package man-db.
Preparing to unpack .../012-man-db_2.13.0-1_armhf.deb ...
Unpacking man-db (2.13.0-1) ...
Selecting previously unselected package m4.
Preparing to unpack .../013-m4_1.4.19-7_armhf.deb ...
Unpacking m4 (1.4.19-7) ...
Selecting previously unselected package autoconf.
Preparing to unpack .../014-autoconf_2.72-3_all.deb ...
Unpacking autoconf (2.72-3) ...
Selecting previously unselected package autotools-dev.
Preparing to unpack .../015-autotools-dev_20220109.1_all.deb ...
Unpacking autotools-dev (20220109.1) ...
Selecting previously unselected package automake.
Preparing to unpack .../016-automake_1%3a1.17-3_all.deb ...
Unpacking automake (1:1.17-3) ...
Selecting previously unselected package autopoint.
Preparing to unpack .../017-autopoint_0.23.1-1_all.deb ...
Unpacking autopoint (0.23.1-1) ...
Selecting previously unselected package cmake-data.
Preparing to unpack .../018-cmake-data_3.31.6-1_all.deb ...
Unpacking cmake-data (3.31.6-1) ...
Selecting previously unselected package libicu76:armhf.
Preparing to unpack .../019-libicu76_76.1-3_armhf.deb ...
Unpacking libicu76:armhf (76.1-3) ...
Selecting previously unselected package libxml2:armhf.
Preparing to unpack .../020-libxml2_2.12.7+dfsg+really2.9.14-0.3+b1_armhf.deb ...
Unpacking libxml2:armhf (2.12.7+dfsg+really2.9.14-0.3+b1) ...
Selecting previously unselected package libarchive13t64:armhf.
Preparing to unpack .../021-libarchive13t64_3.7.4-1.1_armhf.deb ...
Unpacking libarchive13t64:armhf (3.7.4-1.1) ...
Selecting previously unselected package libbrotli1:armhf.
Preparing to unpack .../022-libbrotli1_1.1.0-2+b7_armhf.deb ...
Unpacking libbrotli1:armhf (1.1.0-2+b7) ...
Selecting previously unselected package libkrb5support0:armhf.
Preparing to unpack .../023-libkrb5support0_1.21.3-5_armhf.deb ...
Unpacking libkrb5support0:armhf (1.21.3-5) ...
Selecting previously unselected package libcom-err2:armhf.
Preparing to unpack .../024-libcom-err2_1.47.2-1+b1_armhf.deb ...
Unpacking libcom-err2:armhf (1.47.2-1+b1) ...
Selecting previously unselected package libk5crypto3:armhf.
Preparing to unpack .../025-libk5crypto3_1.21.3-5_armhf.deb ...
Unpacking libk5crypto3:armhf (1.21.3-5) ...
Selecting previously unselected package libkeyutils1:armhf.
Preparing to unpack .../026-libkeyutils1_1.6.3-4_armhf.deb ...
Unpacking libkeyutils1:armhf (1.6.3-4) ...
Selecting previously unselected package libkrb5-3:armhf.
Preparing to unpack .../027-libkrb5-3_1.21.3-5_armhf.deb ...
Unpacking libkrb5-3:armhf (1.21.3-5) ...
Selecting previously unselected package libgssapi-krb5-2:armhf.
Preparing to unpack .../028-libgssapi-krb5-2_1.21.3-5_armhf.deb ...
Unpacking libgssapi-krb5-2:armhf (1.21.3-5) ...
Selecting previously unselected package libunistring5:armhf.
Preparing to unpack .../029-libunistring5_1.3-1_armhf.deb ...
Unpacking libunistring5:armhf (1.3-1) ...
Selecting previously unselected package libidn2-0:armhf.
Preparing to unpack .../030-libidn2-0_2.3.8-2_armhf.deb ...
Unpacking libidn2-0:armhf (2.3.8-2) ...
Selecting previously unselected package libsasl2-modules-db:armhf.
Preparing to unpack .../031-libsasl2-modules-db_2.1.28+dfsg1-9_armhf.deb ...
Unpacking libsasl2-modules-db:armhf (2.1.28+dfsg1-9) ...
Selecting previously unselected package libsasl2-2:armhf.
Preparing to unpack .../032-libsasl2-2_2.1.28+dfsg1-9_armhf.deb ...
Unpacking libsasl2-2:armhf (2.1.28+dfsg1-9) ...
Selecting previously unselected package libldap2:armhf.
Preparing to unpack .../033-libldap2_2.6.9+dfsg-2_armhf.deb ...
Unpacking libldap2:armhf (2.6.9+dfsg-2) ...
Selecting previously unselected package libnghttp2-14:armhf.
Preparing to unpack .../034-libnghttp2-14_1.64.0-1_armhf.deb ...
Unpacking libnghttp2-14:armhf (1.64.0-1) ...
Selecting previously unselected package libnghttp3-9:armhf.
Preparing to unpack .../035-libnghttp3-9_1.8.0-1_armhf.deb ...
Unpacking libnghttp3-9:armhf (1.8.0-1) ...
Selecting previously unselected package libpsl5t64:armhf.
Preparing to unpack .../036-libpsl5t64_0.21.2-1.1+b1_armhf.deb ...
Unpacking libpsl5t64:armhf (0.21.2-1.1+b1) ...
Selecting previously unselected package libp11-kit0:armhf.
Preparing to unpack .../037-libp11-kit0_0.25.5-3_armhf.deb ...
Unpacking libp11-kit0:armhf (0.25.5-3) ...
Selecting previously unselected package libtasn1-6:armhf.
Preparing to unpack .../038-libtasn1-6_4.20.0-2_armhf.deb ...
Unpacking libtasn1-6:armhf (4.20.0-2) ...
Selecting previously unselected package libgnutls30t64:armhf.
Preparing to unpack .../039-libgnutls30t64_3.8.9-2_armhf.deb ...
Unpacking libgnutls30t64:armhf (3.8.9-2) ...
Selecting previously unselected package librtmp1:armhf.
Preparing to unpack .../040-librtmp1_2.4+20151223.gitfa8646d.1-2+b5_armhf.deb ...
Unpacking librtmp1:armhf (2.4+20151223.gitfa8646d.1-2+b5) ...
Selecting previously unselected package libssh2-1t64:armhf.
Preparing to unpack .../041-libssh2-1t64_1.11.1-1_armhf.deb ...
Unpacking libssh2-1t64:armhf (1.11.1-1) ...
Selecting previously unselected package libcurl4t64:armhf.
Preparing to unpack .../042-libcurl4t64_8.13.0~rc2-1_armhf.deb ...
Unpacking libcurl4t64:armhf (8.13.0~rc2-1) ...
Selecting previously unselected package libjsoncpp26:armhf.
Preparing to unpack .../043-libjsoncpp26_1.9.6-3_armhf.deb ...
Unpacking libjsoncpp26:armhf (1.9.6-3) ...
Selecting previously unselected package librhash1:armhf.
Preparing to unpack .../044-librhash1_1.4.5-1_armhf.deb ...
Unpacking librhash1:armhf (1.4.5-1) ...
Selecting previously unselected package libuv1t64:armhf.
Preparing to unpack .../045-libuv1t64_1.50.0-2_armhf.deb ...
Unpacking libuv1t64:armhf (1.50.0-2) ...
Selecting previously unselected package cmake.
Preparing to unpack .../046-cmake_3.31.6-1_armhf.deb ...
Unpacking cmake (3.31.6-1) ...
Selecting previously unselected package libdebhelper-perl.
Preparing to unpack .../047-libdebhelper-perl_13.24.1_all.deb ...
Unpacking libdebhelper-perl (13.24.1) ...
Selecting previously unselected package libtool.
Preparing to unpack .../048-libtool_2.5.4-4_all.deb ...
Unpacking libtool (2.5.4-4) ...
Selecting previously unselected package dh-autoreconf.
Preparing to unpack .../049-dh-autoreconf_20_all.deb ...
Unpacking dh-autoreconf (20) ...
Selecting previously unselected package libarchive-zip-perl.
Preparing to unpack .../050-libarchive-zip-perl_1.68-1_all.deb ...
Unpacking libarchive-zip-perl (1.68-1) ...
Selecting previously unselected package libfile-stripnondeterminism-perl.
Preparing to unpack .../051-libfile-stripnondeterminism-perl_1.14.1-2_all.deb ...
Unpacking libfile-stripnondeterminism-perl (1.14.1-2) ...
Selecting previously unselected package dh-strip-nondeterminism.
Preparing to unpack .../052-dh-strip-nondeterminism_1.14.1-2_all.deb ...
Unpacking dh-strip-nondeterminism (1.14.1-2) ...
Selecting previously unselected package libelf1t64:armhf.
Preparing to unpack .../053-libelf1t64_0.192-4_armhf.deb ...
Unpacking libelf1t64:armhf (0.192-4) ...
Selecting previously unselected package dwz.
Preparing to unpack .../054-dwz_0.15-1+b2_armhf.deb ...
Unpacking dwz (0.15-1+b2) ...
Selecting previously unselected package gettext.
Preparing to unpack .../055-gettext_0.23.1-1_armhf.deb ...
Unpacking gettext (0.23.1-1) ...
Selecting previously unselected package intltool-debian.
Preparing to unpack .../056-intltool-debian_0.35.0+20060710.6_all.deb ...
Unpacking intltool-debian (0.35.0+20060710.6) ...
Selecting previously unselected package po-debconf.
Preparing to unpack .../057-po-debconf_1.0.21+nmu1_all.deb ...
Unpacking po-debconf (1.0.21+nmu1) ...
Selecting previously unselected package debhelper.
Preparing to unpack .../058-debhelper_13.24.1_all.deb ...
Unpacking debhelper (13.24.1) ...
Selecting previously unselected package extra-cmake-modules.
Preparing to unpack .../059-extra-cmake-modules_6.11.0-1_armhf.deb ...
Unpacking extra-cmake-modules (6.11.0-1) ...
Selecting previously unselected package libpcre2-32-0:armhf.
Preparing to unpack .../060-libpcre2-32-0_10.45-1_armhf.deb ...
Unpacking libpcre2-32-0:armhf (10.45-1) ...
Selecting previously unselected package fdupes.
Preparing to unpack .../061-fdupes_1%3a2.3.2-1_armhf.deb ...
Unpacking fdupes (1:2.3.2-1) ...
Selecting previously unselected package libpng16-16t64:armhf.
Preparing to unpack .../062-libpng16-16t64_1.6.47-1.1_armhf.deb ...
Unpacking libpng16-16t64:armhf (1.6.47-1.1) ...
Selecting previously unselected package libfreetype6:armhf.
Preparing to unpack .../063-libfreetype6_2.13.3+dfsg-1_armhf.deb ...
Unpacking libfreetype6:armhf (2.13.3+dfsg-1) ...
Selecting previously unselected package fonts-dejavu-mono.
Preparing to unpack .../064-fonts-dejavu-mono_2.37-8_all.deb ...
Unpacking fonts-dejavu-mono (2.37-8) ...
Selecting previously unselected package fonts-dejavu-core.
Preparing to unpack .../065-fonts-dejavu-core_2.37-8_all.deb ...
Unpacking fonts-dejavu-core (2.37-8) ...
Selecting previously unselected package fontconfig-config.
Preparing to unpack .../066-fontconfig-config_2.15.0-2.1_armhf.deb ...
Unpacking fontconfig-config (2.15.0-2.1) ...
Selecting previously unselected package libfontconfig1:armhf.
Preparing to unpack .../067-libfontconfig1_2.15.0-2.1_armhf.deb ...
Unpacking libfontconfig1:armhf (2.15.0-2.1) ...
Selecting previously unselected package fontconfig.
Preparing to unpack .../068-fontconfig_2.15.0-2.1_armhf.deb ...
Unpacking fontconfig (2.15.0-2.1) ...
Selecting previously unselected package libavahi-common-data:armhf.
Preparing to unpack .../069-libavahi-common-data_0.8-16_armhf.deb ...
Unpacking libavahi-common-data:armhf (0.8-16) ...
Selecting previously unselected package libavahi-common3:armhf.
Preparing to unpack .../070-libavahi-common3_0.8-16_armhf.deb ...
Unpacking libavahi-common3:armhf (0.8-16) ...
Selecting previously unselected package libdbus-1-3:armhf.
Preparing to unpack .../071-libdbus-1-3_1.16.2-2_armhf.deb ...
Unpacking libdbus-1-3:armhf (1.16.2-2) ...
Selecting previously unselected package libavahi-client3:armhf.
Preparing to unpack .../072-libavahi-client3_0.8-16_armhf.deb ...
Unpacking libavahi-client3:armhf (0.8-16) ...
Selecting previously unselected package libb2-1:armhf.
Preparing to unpack .../073-libb2-1_0.98.1-1.1+b2_armhf.deb ...
Unpacking libb2-1:armhf (0.98.1-1.1+b2) ...
Selecting previously unselected package libcups2t64:armhf.
Preparing to unpack .../074-libcups2t64_2.4.10-2+b1_armhf.deb ...
Unpacking libcups2t64:armhf (2.4.10-2+b1) ...
Selecting previously unselected package libngtcp2-16:armhf.
Preparing to unpack .../075-libngtcp2-16_1.11.0-1_armhf.deb ...
Unpacking libngtcp2-16:armhf (1.11.0-1) ...
Selecting previously unselected package libngtcp2-crypto-gnutls8:armhf.
Preparing to unpack .../076-libngtcp2-crypto-gnutls8_1.11.0-1_armhf.deb ...
Unpacking libngtcp2-crypto-gnutls8:armhf (1.11.0-1) ...
Selecting previously unselected package libcurl3t64-gnutls:armhf.
Preparing to unpack .../077-libcurl3t64-gnutls_8.13.0~rc2-1_armhf.deb ...
Unpacking libcurl3t64-gnutls:armhf (8.13.0~rc2-1) ...
Selecting previously unselected package libdouble-conversion3:armhf.
Preparing to unpack .../078-libdouble-conversion3_3.3.1-1_armhf.deb ...
Unpacking libdouble-conversion3:armhf (3.3.1-1) ...
Selecting previously unselected package libdrm-common.
Preparing to unpack .../079-libdrm-common_2.4.124-1_all.deb ...
Unpacking libdrm-common (2.4.124-1) ...
Selecting previously unselected package libdrm2:armhf.
Preparing to unpack .../080-libdrm2_2.4.124-1_armhf.deb ...
Unpacking libdrm2:armhf (2.4.124-1) ...
Selecting previously unselected package libdrm-amdgpu1:armhf.
Preparing to unpack .../081-libdrm-amdgpu1_2.4.124-1_armhf.deb ...
Unpacking libdrm-amdgpu1:armhf (2.4.124-1) ...
Selecting previously unselected package libduktape207:armhf.
Preparing to unpack .../082-libduktape207_2.7.0-2+b2_armhf.deb ...
Unpacking libduktape207:armhf (2.7.0-2+b2) ...
Selecting previously unselected package libedit2:armhf.
Preparing to unpack .../083-libedit2_3.1-20250104-1_armhf.deb ...
Unpacking libedit2:armhf (3.1-20250104-1) ...
Selecting previously unselected package libwayland-server0:armhf.
Preparing to unpack .../084-libwayland-server0_1.23.1-3_armhf.deb ...
Unpacking libwayland-server0:armhf (1.23.1-3) ...
Selecting previously unselected package libz3-4:armhf.
Preparing to unpack .../085-libz3-4_4.13.3-1_armhf.deb ...
Unpacking libz3-4:armhf (4.13.3-1) ...
Selecting previously unselected package libllvm19:armhf.
Preparing to unpack .../086-libllvm19_1%3a19.1.7-3_armhf.deb ...
Unpacking libllvm19:armhf (1:19.1.7-3) ...
Selecting previously unselected package libsensors-config.
Preparing to unpack .../087-libsensors-config_1%3a3.6.0-10_all.deb ...
Unpacking libsensors-config (1:3.6.0-10) ...
Selecting previously unselected package libsensors5:armhf.
Preparing to unpack .../088-libsensors5_1%3a3.6.0-10+b1_armhf.deb ...
Unpacking libsensors5:armhf (1:3.6.0-10+b1) ...
Selecting previously unselected package libxau6:armhf.
Preparing to unpack .../089-libxau6_1%3a1.0.11-1_armhf.deb ...
Unpacking libxau6:armhf (1:1.0.11-1) ...
Selecting previously unselected package libxdmcp6:armhf.
Preparing to unpack .../090-libxdmcp6_1%3a1.1.5-1_armhf.deb ...
Unpacking libxdmcp6:armhf (1:1.1.5-1) ...
Selecting previously unselected package libxcb1:armhf.
Preparing to unpack .../091-libxcb1_1.17.0-2+b1_armhf.deb ...
Unpacking libxcb1:armhf (1.17.0-2+b1) ...
Selecting previously unselected package libx11-data.
Preparing to unpack .../092-libx11-data_2%3a1.8.10-2_all.deb ...
Unpacking libx11-data (2:1.8.10-2) ...
Selecting previously unselected package libx11-6:armhf.
Preparing to unpack .../093-libx11-6_2%3a1.8.10-2_armhf.deb ...
Unpacking libx11-6:armhf (2:1.8.10-2) ...
Selecting previously unselected package libx11-xcb1:armhf.
Preparing to unpack .../094-libx11-xcb1_2%3a1.8.10-2_armhf.deb ...
Unpacking libx11-xcb1:armhf (2:1.8.10-2) ...
Selecting previously unselected package libxcb-dri3-0:armhf.
Preparing to unpack .../095-libxcb-dri3-0_1.17.0-2+b1_armhf.deb ...
Unpacking libxcb-dri3-0:armhf (1.17.0-2+b1) ...
Selecting previously unselected package libxcb-present0:armhf.
Preparing to unpack .../096-libxcb-present0_1.17.0-2+b1_armhf.deb ...
Unpacking libxcb-present0:armhf (1.17.0-2+b1) ...
Selecting previously unselected package libxcb-randr0:armhf.
Preparing to unpack .../097-libxcb-randr0_1.17.0-2+b1_armhf.deb ...
Unpacking libxcb-randr0:armhf (1.17.0-2+b1) ...
Selecting previously unselected package libxcb-sync1:armhf.
Preparing to unpack .../098-libxcb-sync1_1.17.0-2+b1_armhf.deb ...
Unpacking libxcb-sync1:armhf (1.17.0-2+b1) ...
Selecting previously unselected package libxcb-xfixes0:armhf.
Preparing to unpack .../099-libxcb-xfixes0_1.17.0-2+b1_armhf.deb ...
Unpacking libxcb-xfixes0:armhf (1.17.0-2+b1) ...
Selecting previously unselected package libxshmfence1:armhf.
Preparing to unpack .../100-libxshmfence1_1.3-1+b3_armhf.deb ...
Unpacking libxshmfence1:armhf (1.3-1+b3) ...
Selecting previously unselected package mesa-libgallium:armhf.
Preparing to unpack .../101-mesa-libgallium_25.0.1-2_armhf.deb ...
Unpacking mesa-libgallium:armhf (25.0.1-2) ...
Selecting previously unselected package libgbm1:armhf.
Preparing to unpack .../102-libgbm1_25.0.1-2_armhf.deb ...
Unpacking libgbm1:armhf (25.0.1-2) ...
Selecting previously unselected package libwayland-client0:armhf.
Preparing to unpack .../103-libwayland-client0_1.23.1-3_armhf.deb ...
Unpacking libwayland-client0:armhf (1.23.1-3) ...
Selecting previously unselected package libxcb-shm0:armhf.
Preparing to unpack .../104-libxcb-shm0_1.17.0-2+b1_armhf.deb ...
Unpacking libxcb-shm0:armhf (1.17.0-2+b1) ...
Selecting previously unselected package libegl-mesa0:armhf.
Preparing to unpack .../105-libegl-mesa0_25.0.1-2_armhf.deb ...
Unpacking libegl-mesa0:armhf (25.0.1-2) ...
Selecting previously unselected package libevdev2:armhf.
Preparing to unpack .../106-libevdev2_1.13.3+dfsg-1_armhf.deb ...
Unpacking libevdev2:armhf (1.13.3+dfsg-1) ...
Selecting previously unselected package libgpg-error0:armhf.
Preparing to unpack .../107-libgpg-error0_1.51-3_armhf.deb ...
Unpacking libgpg-error0:armhf (1.51-3) ...
Selecting previously unselected package libgcrypt20:armhf.
Preparing to unpack .../108-libgcrypt20_1.11.0-7_armhf.deb ...
Unpacking libgcrypt20:armhf (1.11.0-7) ...
Selecting previously unselected package libglvnd0:armhf.
Preparing to unpack .../109-libglvnd0_1.7.0-1+b2_armhf.deb ...
Unpacking libglvnd0:armhf (1.7.0-1+b2) ...
Selecting previously unselected package libxcb-glx0:armhf.
Preparing to unpack .../110-libxcb-glx0_1.17.0-2+b1_armhf.deb ...
Unpacking libxcb-glx0:armhf (1.17.0-2+b1) ...
Selecting previously unselected package libxext6:armhf.
Preparing to unpack .../111-libxext6_2%3a1.3.4-1+b3_armhf.deb ...
Unpacking libxext6:armhf (2:1.3.4-1+b3) ...
Selecting previously unselected package libxxf86vm1:armhf.
Preparing to unpack .../112-libxxf86vm1_1%3a1.1.4-1+b4_armhf.deb ...
Unpacking libxxf86vm1:armhf (1:1.1.4-1+b4) ...
Selecting previously unselected package libvulkan1:armhf.
Preparing to unpack .../113-libvulkan1_1.4.304.0-1_armhf.deb ...
Unpacking libvulkan1:armhf (1.4.304.0-1) ...
Selecting previously unselected package libgl1-mesa-dri:armhf.
Preparing to unpack .../114-libgl1-mesa-dri_25.0.1-2_armhf.deb ...
Unpacking libgl1-mesa-dri:armhf (25.0.1-2) ...
Selecting previously unselected package libglx-mesa0:armhf.
Preparing to unpack .../115-libglx-mesa0_25.0.1-2_armhf.deb ...
Unpacking libglx-mesa0:armhf (25.0.1-2) ...
Selecting previously unselected package libglx0:armhf.
Preparing to unpack .../116-libglx0_1.7.0-1+b2_armhf.deb ...
Unpacking libglx0:armhf (1.7.0-1+b2) ...
Selecting previously unselected package libgl1:armhf.
Preparing to unpack .../117-libgl1_1.7.0-1+b2_armhf.deb ...
Unpacking libgl1:armhf (1.7.0-1+b2) ...
Selecting previously unselected package xorg-sgml-doctools.
Preparing to unpack .../118-xorg-sgml-doctools_1%3a1.11-1.1_all.deb ...
Unpacking xorg-sgml-doctools (1:1.11-1.1) ...
Selecting previously unselected package x11proto-dev.
Preparing to unpack .../119-x11proto-dev_2024.1-1_all.deb ...
Unpacking x11proto-dev (2024.1-1) ...
Selecting previously unselected package libxau-dev:armhf.
Preparing to unpack .../120-libxau-dev_1%3a1.0.11-1_armhf.deb ...
Unpacking libxau-dev:armhf (1:1.0.11-1) ...
Selecting previously unselected package libxdmcp-dev:armhf.
Preparing to unpack .../121-libxdmcp-dev_1%3a1.1.5-1_armhf.deb ...
Unpacking libxdmcp-dev:armhf (1:1.1.5-1) ...
Selecting previously unselected package xtrans-dev.
Preparing to unpack .../122-xtrans-dev_1.4.0-1_all.deb ...
Unpacking xtrans-dev (1.4.0-1) ...
Selecting previously unselected package libxcb1-dev:armhf.
Preparing to unpack .../123-libxcb1-dev_1.17.0-2+b1_armhf.deb ...
Unpacking libxcb1-dev:armhf (1.17.0-2+b1) ...
Selecting previously unselected package libx11-dev:armhf.
Preparing to unpack .../124-libx11-dev_2%3a1.8.10-2_armhf.deb ...
Unpacking libx11-dev:armhf (2:1.8.10-2) ...
Selecting previously unselected package libglx-dev:armhf.
Preparing to unpack .../125-libglx-dev_1.7.0-1+b2_armhf.deb ...
Unpacking libglx-dev:armhf (1.7.0-1+b2) ...
Selecting previously unselected package libgl-dev:armhf.
Preparing to unpack .../126-libgl-dev_1.7.0-1+b2_armhf.deb ...
Unpacking libgl-dev:armhf (1.7.0-1+b2) ...
Selecting previously unselected package libglib2.0-0t64:armhf.
Preparing to unpack .../127-libglib2.0-0t64_2.84.0-2_armhf.deb ...
Unpacking libglib2.0-0t64:armhf (2.84.0-2) ...
Selecting previously unselected package libgraphite2-3:armhf.
Preparing to unpack .../128-libgraphite2-3_1.3.14-2+b1_armhf.deb ...
Unpacking libgraphite2-3:armhf (1.3.14-2+b1) ...
Selecting previously unselected package libgudev-1.0-0:armhf.
Preparing to unpack .../129-libgudev-1.0-0_238-6_armhf.deb ...
Unpacking libgudev-1.0-0:armhf (238-6) ...
Selecting previously unselected package libharfbuzz0b:armhf.
Preparing to unpack .../130-libharfbuzz0b_10.2.0-1+b1_armhf.deb ...
Unpacking libharfbuzz0b:armhf (10.2.0-1+b1) ...
Selecting previously unselected package x11-common.
Preparing to unpack .../131-x11-common_1%3a7.7+24_all.deb ...
Unpacking x11-common (1:7.7+24) ...
Selecting previously unselected package libice6:armhf.
Preparing to unpack .../132-libice6_2%3a1.1.1-1_armhf.deb ...
Unpacking libice6:armhf (2:1.1.1-1) ...
Selecting previously unselected package libwacom-common.
Preparing to unpack .../133-libwacom-common_2.14.0-1_all.deb ...
Unpacking libwacom-common (2.14.0-1) ...
Selecting previously unselected package libwacom9:armhf.
Preparing to unpack .../134-libwacom9_2.14.0-1_armhf.deb ...
Unpacking libwacom9:armhf (2.14.0-1) ...
Selecting previously unselected package libinput-bin.
Preparing to unpack .../135-libinput-bin_1.27.1-1_armhf.deb ...
Unpacking libinput-bin (1.27.1-1) ...
Selecting previously unselected package libmtdev1t64:armhf.
Preparing to unpack .../136-libmtdev1t64_1.1.7-1_armhf.deb ...
Unpacking libmtdev1t64:armhf (1.1.7-1) ...
Selecting previously unselected package libinput10:armhf.
Preparing to unpack .../137-libinput10_1.27.1-1_armhf.deb ...
Unpacking libinput10:armhf (1.27.1-1) ...
Selecting previously unselected package libjpeg62-turbo:armhf.
Preparing to unpack .../138-libjpeg62-turbo_1%3a2.1.5-3.1_armhf.deb ...
Unpacking libjpeg62-turbo:armhf (1:2.1.5-3.1) ...
Selecting previously unselected package libmd4c0:armhf.
Preparing to unpack .../139-libmd4c0_0.5.2-2+b1_armhf.deb ...
Unpacking libmd4c0:armhf (0.5.2-2+b1) ...
Selecting previously unselected package libopengl0:armhf.
Preparing to unpack .../140-libopengl0_1.7.0-1+b2_armhf.deb ...
Unpacking libopengl0:armhf (1.7.0-1+b2) ...
Selecting previously unselected package libopengl-dev:armhf.
Preparing to unpack .../141-libopengl-dev_1.7.0-1+b2_armhf.deb ...
Unpacking libopengl-dev:armhf (1.7.0-1+b2) ...
Selecting previously unselected package libpcre2-16-0:armhf.
Preparing to unpack .../142-libpcre2-16-0_10.45-1_armhf.deb ...
Unpacking libpcre2-16-0:armhf (10.45-1) ...
Selecting previously unselected package libpkgconf3:armhf.
Preparing to unpack .../143-libpkgconf3_1.8.1-4_armhf.deb ...
Unpacking libpkgconf3:armhf (1.8.1-4) ...
Selecting previously unselected package libproxy1v5:armhf.
Preparing to unpack .../144-libproxy1v5_0.5.9-1_armhf.deb ...
Unpacking libproxy1v5:armhf (0.5.9-1) ...
Selecting previously unselected package shared-mime-info.
Preparing to unpack .../145-shared-mime-info_2.4-5+b2_armhf.deb ...
Unpacking shared-mime-info (2.4-5+b2) ...
Selecting previously unselected package libqt6core6t64:armhf.
Preparing to unpack .../146-libqt6core6t64_6.8.2+dfsg-5+b1_armhf.deb ...
Unpacking libqt6core6t64:armhf (6.8.2+dfsg-5+b1) ...
Selecting previously unselected package libqt6concurrent6:armhf.
Preparing to unpack .../147-libqt6concurrent6_6.8.2+dfsg-5+b1_armhf.deb ...
Unpacking libqt6concurrent6:armhf (6.8.2+dfsg-5+b1) ...
Selecting previously unselected package libqt6dbus6:armhf.
Preparing to unpack .../148-libqt6dbus6_6.8.2+dfsg-5+b1_armhf.deb ...
Unpacking libqt6dbus6:armhf (6.8.2+dfsg-5+b1) ...
Selecting previously unselected package libegl1:armhf.
Preparing to unpack .../149-libegl1_1.7.0-1+b2_armhf.deb ...
Unpacking libegl1:armhf (1.7.0-1+b2) ...
Selecting previously unselected package libsm6:armhf.
Preparing to unpack .../150-libsm6_2%3a1.2.4-1_armhf.deb ...
Unpacking libsm6:armhf (2:1.2.4-1) ...
Selecting previously unselected package libts0t64:armhf.
Preparing to unpack .../151-libts0t64_1.22-1.1+b1_armhf.deb ...
Unpacking libts0t64:armhf (1.22-1.1+b1) ...
Selecting previously unselected package libxcb-util1:armhf.
Preparing to unpack .../152-libxcb-util1_0.4.1-1_armhf.deb ...
Unpacking libxcb-util1:armhf (0.4.1-1) ...
Selecting previously unselected package libxcb-image0:armhf.
Preparing to unpack .../153-libxcb-image0_0.4.0-2+b2_armhf.deb ...
Unpacking libxcb-image0:armhf (0.4.0-2+b2) ...
Selecting previously unselected package libxcb-render0:armhf.
Preparing to unpack .../154-libxcb-render0_1.17.0-2+b1_armhf.deb ...
Unpacking libxcb-render0:armhf (1.17.0-2+b1) ...
Selecting previously unselected package libxcb-render-util0:armhf.
Preparing to unpack .../155-libxcb-render-util0_0.3.10-1_armhf.deb ...
Unpacking libxcb-render-util0:armhf (0.3.10-1) ...
Selecting previously unselected package libxcb-cursor0:armhf.
Preparing to unpack .../156-libxcb-cursor0_0.1.5-1_armhf.deb ...
Unpacking libxcb-cursor0:armhf (0.1.5-1) ...
Selecting previously unselected package libxcb-icccm4:armhf.
Preparing to unpack .../157-libxcb-icccm4_0.4.2-1_armhf.deb ...
Unpacking libxcb-icccm4:armhf (0.4.2-1) ...
Selecting previously unselected package libxcb-keysyms1:armhf.
Preparing to unpack .../158-libxcb-keysyms1_0.4.1-1_armhf.deb ...
Unpacking libxcb-keysyms1:armhf (0.4.1-1) ...
Selecting previously unselected package libxcb-shape0:armhf.
Preparing to unpack .../159-libxcb-shape0_1.17.0-2+b1_armhf.deb ...
Unpacking libxcb-shape0:armhf (1.17.0-2+b1) ...
Selecting previously unselected package libxcb-xinput0:armhf.
Preparing to unpack .../160-libxcb-xinput0_1.17.0-2+b1_armhf.deb ...
Unpacking libxcb-xinput0:armhf (1.17.0-2+b1) ...
Selecting previously unselected package libxcb-xkb1:armhf.
Preparing to unpack .../161-libxcb-xkb1_1.17.0-2+b1_armhf.deb ...
Unpacking libxcb-xkb1:armhf (1.17.0-2+b1) ...
Selecting previously unselected package xkb-data.
Preparing to unpack .../162-xkb-data_2.42-1_all.deb ...
Unpacking xkb-data (2.42-1) ...
Selecting previously unselected package libxkbcommon0:armhf.
Preparing to unpack .../163-libxkbcommon0_1.7.0-2_armhf.deb ...
Unpacking libxkbcommon0:armhf (1.7.0-2) ...
Selecting previously unselected package libxkbcommon-x11-0:armhf.
Preparing to unpack .../164-libxkbcommon-x11-0_1.7.0-2_armhf.deb ...
Unpacking libxkbcommon-x11-0:armhf (1.7.0-2) ...
Selecting previously unselected package libqt6gui6:armhf.
Preparing to unpack .../165-libqt6gui6_6.8.2+dfsg-5+b1_armhf.deb ...
Unpacking libqt6gui6:armhf (6.8.2+dfsg-5+b1) ...
Selecting previously unselected package libqt6network6:armhf.
Preparing to unpack .../166-libqt6network6_6.8.2+dfsg-5+b1_armhf.deb ...
Unpacking libqt6network6:armhf (6.8.2+dfsg-5+b1) ...
Selecting previously unselected package libqt6opengl6:armhf.
Preparing to unpack .../167-libqt6opengl6_6.8.2+dfsg-5+b1_armhf.deb ...
Unpacking libqt6opengl6:armhf (6.8.2+dfsg-5+b1) ...
Selecting previously unselected package libqt6widgets6:armhf.
Preparing to unpack .../168-libqt6widgets6_6.8.2+dfsg-5+b1_armhf.deb ...
Unpacking libqt6widgets6:armhf (6.8.2+dfsg-5+b1) ...
Selecting previously unselected package libqt6openglwidgets6:armhf.
Preparing to unpack .../169-libqt6openglwidgets6_6.8.2+dfsg-5+b1_armhf.deb ...
Unpacking libqt6openglwidgets6:armhf (6.8.2+dfsg-5+b1) ...
Selecting previously unselected package libqt6printsupport6:armhf.
Preparing to unpack .../170-libqt6printsupport6_6.8.2+dfsg-5+b1_armhf.deb ...
Unpacking libqt6printsupport6:armhf (6.8.2+dfsg-5+b1) ...
Selecting previously unselected package libqt6sql6:armhf.
Preparing to unpack .../171-libqt6sql6_6.8.2+dfsg-5+b1_armhf.deb ...
Unpacking libqt6sql6:armhf (6.8.2+dfsg-5+b1) ...
Selecting previously unselected package libqt6test6:armhf.
Preparing to unpack .../172-libqt6test6_6.8.2+dfsg-5+b1_armhf.deb ...
Unpacking libqt6test6:armhf (6.8.2+dfsg-5+b1) ...
Selecting previously unselected package libqt6xml6:armhf.
Preparing to unpack .../173-libqt6xml6_6.8.2+dfsg-5+b1_armhf.deb ...
Unpacking libqt6xml6:armhf (6.8.2+dfsg-5+b1) ...
Selecting previously unselected package libvulkan-dev:armhf.
Preparing to unpack .../174-libvulkan-dev_1.4.304.0-1_armhf.deb ...
Unpacking libvulkan-dev:armhf (1.4.304.0-1) ...
Selecting previously unselected package libxml2-utils.
Preparing to unpack .../175-libxml2-utils_2.12.7+dfsg+really2.9.14-0.3+b1_armhf.deb ...
Unpacking libxml2-utils (2.12.7+dfsg+really2.9.14-0.3+b1) ...
Selecting previously unselected package libxslt1.1:armhf.
Preparing to unpack .../176-libxslt1.1_1.1.35-1.2_armhf.deb ...
Unpacking libxslt1.1:armhf (1.1.35-1.2) ...
Selecting previously unselected package libyaml-0-2:armhf.
Preparing to unpack .../177-libyaml-0-2_0.2.5-2_armhf.deb ...
Unpacking libyaml-0-2:armhf (0.2.5-2) ...
Selecting previously unselected package python3-charset-normalizer.
Preparing to unpack .../178-python3-charset-normalizer_3.4.1-1+b1_armhf.deb ...
Unpacking python3-charset-normalizer (3.4.1-1+b1) ...
Selecting previously unselected package python3-debian.
Preparing to unpack .../179-python3-debian_1.0.1_all.deb ...
Unpacking python3-debian (1.0.1) ...
Selecting previously unselected package python3-yaml.
Preparing to unpack .../180-python3-yaml_6.0.2-1+b2_armhf.deb ...
Unpacking python3-yaml (6.0.2-1+b2) ...
Selecting previously unselected package pkg-kde-tools.
Preparing to unpack .../181-pkg-kde-tools_0.18.12_all.deb ...
Unpacking pkg-kde-tools (0.18.12) ...
Selecting previously unselected package pkgconf-bin.
Preparing to unpack .../182-pkgconf-bin_1.8.1-4_armhf.deb ...
Unpacking pkgconf-bin (1.8.1-4) ...
Selecting previously unselected package pkgconf:armhf.
Preparing to unpack .../183-pkgconf_1.8.1-4_armhf.deb ...
Unpacking pkgconf:armhf (1.8.1-4) ...
Selecting previously unselected package python3-lxml:armhf.
Preparing to unpack .../184-python3-lxml_5.3.1-1+b1_armhf.deb ...
Unpacking python3-lxml:armhf (5.3.1-1+b1) ...
Selecting previously unselected package qmake6-bin.
Preparing to unpack .../185-qmake6-bin_6.8.2+dfsg-5+b1_armhf.deb ...
Unpacking qmake6-bin (6.8.2+dfsg-5+b1) ...
Selecting previously unselected package qmake6:armhf.
Preparing to unpack .../186-qmake6_6.8.2+dfsg-5+b1_armhf.deb ...
Unpacking qmake6:armhf (6.8.2+dfsg-5+b1) ...
Selecting previously unselected package qt6-base-dev-tools.
Preparing to unpack .../187-qt6-base-dev-tools_6.8.2+dfsg-5+b1_armhf.deb ...
Unpacking qt6-base-dev-tools (6.8.2+dfsg-5+b1) ...
Selecting previously unselected package qt6-qpa-plugins:armhf.
Preparing to unpack .../188-qt6-qpa-plugins_6.8.2+dfsg-5+b1_armhf.deb ...
Unpacking qt6-qpa-plugins:armhf (6.8.2+dfsg-5+b1) ...
Selecting previously unselected package qt6-base-dev:armhf.
Preparing to unpack .../189-qt6-base-dev_6.8.2+dfsg-5+b1_armhf.deb ...
Unpacking qt6-base-dev:armhf (6.8.2+dfsg-5+b1) ...
Setting up media-types (13.0.0) ...
Setting up libb2-1:armhf (0.98.1-1.1+b2) ...
Setting up libpipeline1:armhf (1.5.8-1) ...
Setting up libgraphite2-3:armhf (1.3.14-2+b1) ...
Setting up libxau6:armhf (1:1.0.11-1) ...
Setting up libxdmcp6:armhf (1:1.1.5-1) ...
Setting up libdouble-conversion3:armhf (3.3.1-1) ...
Setting up libkeyutils1:armhf (1.6.3-4) ...
Setting up libxcb1:armhf (1.17.0-2+b1) ...
Setting up libxcb-xfixes0:armhf (1.17.0-2+b1) ...
Setting up bsdextrautils (2.40.4-5) ...
Setting up libgpg-error0:armhf (1.51-3) ...
Setting up libxcb-xinput0:armhf (1.17.0-2+b1) ...
Setting up extra-cmake-modules (6.11.0-1) ...
Setting up libmagic-mgc (1:5.46-2) ...
Setting up libxcb-render0:armhf (1.17.0-2+b1) ...
Setting up libarchive-zip-perl (1.68-1) ...
Setting up libyaml-0-2:armhf (0.2.5-2) ...
Setting up libglvnd0:armhf (1.7.0-1+b2) ...
Setting up libts0t64:armhf (1.22-1.1+b1) ...
Setting up libxcb-glx0:armhf (1.17.0-2+b1) ...
Setting up libdebhelper-perl (13.24.1) ...
Setting up libbrotli1:armhf (1.1.0-2+b7) ...
Setting up libedit2:armhf (3.1-20250104-1) ...
Setting up libuv1t64:armhf (1.50.0-2) ...
Setting up libmagic1t64:armhf (1:5.46-2) ...
Setting up libxcb-keysyms1:armhf (0.4.1-1) ...
Setting up libxcb-shape0:armhf (1.17.0-2+b1) ...
Setting up x11-common (1:7.7+24) ...
invoke-rc.d: could not determine current runlevel
Setting up X socket directories... /tmp/.X11-unix /tmp/.ICE-unix.
Setting up libsensors-config (1:3.6.0-10) ...
Setting up libnghttp2-14:armhf (1.64.0-1) ...
Setting up gettext-base (0.23.1-1) ...
Setting up m4 (1.4.19-7) ...
Setting up libgcrypt20:armhf (1.11.0-7) ...
Setting up libxcb-render-util0:armhf (0.3.10-1) ...
Setting up xkb-data (2.42-1) ...
Setting up libxcb-shm0:armhf (1.17.0-2+b1) ...
Setting up libxcb-icccm4:armhf (0.4.2-1) ...
Setting up libcom-err2:armhf (1.47.2-1+b1) ...
Setting up file (1:5.46-2) ...
Setting up libpcre2-16-0:armhf (10.45-1) ...
Setting up libopengl0:armhf (1.7.0-1+b2) ...
Setting up libelf1t64:armhf (0.192-4) ...
Setting up libxcb-util1:armhf (0.4.1-1) ...
Setting up libxcb-xkb1:armhf (1.17.0-2+b1) ...
Setting up libxcb-image0:armhf (0.4.0-2+b2) ...
Setting up libkrb5support0:armhf (1.21.3-5) ...
Setting up libsasl2-modules-db:armhf (2.1.28+dfsg1-9) ...
Setting up tzdata (2025a-2) ...

Current default time zone: 'Etc/UTC'
Local time is now:      Tue Mar 18 04:07:13 UTC 2025.
Universal Time is now:  Tue Mar 18 04:07:13 UTC 2025.
Run 'dpkg-reconfigure tzdata' if you wish to change it.

Setting up libxcb-present0:armhf (1.17.0-2+b1) ...
Setting up xtrans-dev (1.4.0-1) ...
Setting up autotools-dev (20220109.1) ...
Setting up libz3-4:armhf (4.13.3-1) ...
Setting up libpcre2-32-0:armhf (10.45-1) ...
Setting up libpkgconf3:armhf (1.8.1-4) ...
Setting up libjpeg62-turbo:armhf (1:2.1.5-3.1) ...
Setting up libx11-data (2:1.8.10-2) ...
Setting up libxcb-sync1:armhf (1.17.0-2+b1) ...
Setting up libjsoncpp26:armhf (1.9.6-3) ...
Setting up libxcb-cursor0:armhf (0.1.5-1) ...
Setting up libavahi-common-data:armhf (0.8-16) ...
Setting up libdbus-1-3:armhf (1.16.2-2) ...
Setting up libproc2-0:armhf (2:4.0.4-7) ...
Setting up libunistring5:armhf (1.3-1) ...
Setting up fonts-dejavu-mono (2.37-8) ...
Setting up libpng16-16t64:armhf (1.6.47-1.1) ...
Setting up autopoint (0.23.1-1) ...
Setting up fdupes (1:2.3.2-1) ...
Setting up fonts-dejavu-core (2.37-8) ...
Setting up pkgconf-bin (1.8.1-4) ...
Setting up libsensors5:armhf (1:3.6.0-10+b1) ...
Setting up libk5crypto3:armhf (1.21.3-5) ...
Setting up libsasl2-2:armhf (2.1.28+dfsg1-9) ...
Setting up libvulkan1:armhf (1.4.304.0-1) ...
Setting up autoconf (2.72-3) ...
Setting up libnghttp3-9:armhf (1.8.0-1) ...
Setting up libffi8:armhf (3.4.7-1) ...
Setting up dwz (0.15-1+b2) ...
Setting up libmtdev1t64:armhf (1.1.7-1) ...
Setting up sensible-utils (0.0.24) ...
Setting up libduktape207:armhf (2.7.0-2+b2) ...
Setting up libxshmfence1:armhf (1.3-1+b3) ...
Setting up libxcb-randr0:armhf (1.17.0-2+b1) ...
Setting up libuchardet0:armhf (0.0.8-1+b2) ...
Setting up procps (2:4.0.4-7) ...
Setting up libtasn1-6:armhf (4.20.0-2) ...
Setting up libmd4c0:armhf (0.5.2-2+b1) ...
Setting up libx11-6:armhf (2:1.8.10-2) ...
Setting up xorg-sgml-doctools (1:1.11-1.1) ...
Setting up netbase (6.5) ...
Setting up libngtcp2-16:armhf (1.11.0-1) ...
Setting up cmake-data (3.31.6-1) ...
Setting up librhash1:armhf (1.4.5-1) ...
Setting up libkrb5-3:armhf (1.21.3-5) ...
Setting up libicu76:armhf (76.1-3) ...
Setting up libssh2-1t64:armhf (1.11.1-1) ...
Setting up libopengl-dev:armhf (1.7.0-1+b2) ...
Setting up libdrm-common (2.4.124-1) ...
Setting up libevdev2:armhf (1.13.3+dfsg-1) ...
Setting up readline-common (8.2-6) ...
Setting up libxml2:armhf (2.12.7+dfsg+really2.9.14-0.3+b1) ...
Setting up libldap2:armhf (2.6.9+dfsg-2) ...
Setting up libwacom-common (2.14.0-1) ...
Setting up libxkbcommon0:armhf (1.7.0-2) ...
Setting up libwayland-client0:armhf (1.23.1-3) ...
Setting up automake (1:1.17-3) ...
update-alternatives: using /usr/bin/automake-1.17 to provide /usr/bin/automake (automake) in auto mode
Setting up x11proto-dev (2024.1-1) ...
Setting up libfile-stripnondeterminism-perl (1.14.1-2) ...
Setting up libxcb-dri3-0:armhf (1.17.0-2+b1) ...
Setting up libllvm19:armhf (1:19.1.7-3) ...
Setting up libwayland-server0:armhf (1.23.1-3) ...
Setting up libx11-xcb1:armhf (2:1.8.10-2) ...
Setting up libice6:armhf (2:1.1.1-1) ...
Setting up gettext (0.23.1-1) ...
Setting up libxau-dev:armhf (1:1.0.11-1) ...
Setting up libtool (2.5.4-4) ...
Setting up fontconfig-config (2.15.0-2.1) ...
Setting up libavahi-common3:armhf (0.8-16) ...
Setting up libxext6:armhf (2:1.3.4-1+b3) ...
Setting up libidn2-0:armhf (2.3.8-2) ...
Setting up pkgconf:armhf (1.8.1-4) ...
Setting up libxxf86vm1:armhf (1:1.1.4-1+b4) ...
Setting up intltool-debian (0.35.0+20060710.6) ...
Setting up dh-autoreconf (20) ...
Setting up libxdmcp-dev:armhf (1:1.1.5-1) ...
Setting up libglib2.0-0t64:armhf (2.84.0-2) ...
No schema files found: doing nothing.
Setting up libfreetype6:armhf (2.13.3+dfsg-1) ...
Setting up shared-mime-info (2.4-5+b2) ...
Setting up libp11-kit0:armhf (0.25.5-3) ...
Setting up libxkbcommon-x11-0:armhf (1.7.0-2) ...
Setting up libgssapi-krb5-2:armhf (1.21.3-5) ...
Setting up libreadline8t64:armhf (8.2-6) ...
Setting up dh-strip-nondeterminism (1.14.1-2) ...
Setting up libdrm2:armhf (2.4.124-1) ...
Setting up groff-base (1.23.0-7) ...
Setting up libxslt1.1:armhf (1.1.35-1.2) ...
Setting up libharfbuzz0b:armhf (10.2.0-1+b1) ...
Setting up libfontconfig1:armhf (2.15.0-2.1) ...
Setting up libxml2-utils (2.12.7+dfsg+really2.9.14-0.3+b1) ...
Setting up libsm6:armhf (2:1.2.4-1) ...
Setting up libarchive13t64:armhf (3.7.4-1.1) ...
Setting up libpython3.13-stdlib:armhf (3.13.2-2) ...
Setting up libavahi-client3:armhf (0.8-16) ...
Setting up libgudev-1.0-0:armhf (238-6) ...
Setting up libpython3-stdlib:armhf (3.13.2-2) ...
Setting up libdrm-amdgpu1:armhf (2.4.124-1) ...
Setting up libgnutls30t64:armhf (3.8.9-2) ...
Setting up libqt6core6t64:armhf (6.8.2+dfsg-5+b1) ...
Setting up mesa-libgallium:armhf (25.0.1-2) ...
Setting up fontconfig (2.15.0-2.1) ...
Regenerating fonts cache... done.
Setting up libqt6test6:armhf (6.8.2+dfsg-5+b1) ...
Setting up libxcb1-dev:armhf (1.17.0-2+b1) ...
Setting up libgbm1:armhf (25.0.1-2) ...
Setting up python3.13 (3.13.2-2) ...
Setting up libwacom9:armhf (2.14.0-1) ...
Setting up po-debconf (1.0.21+nmu1) ...
Setting up libgl1-mesa-dri:armhf (25.0.1-2) ...
Setting up libpsl5t64:armhf (0.21.2-1.1+b1) ...
Setting up libx11-dev:armhf (2:1.8.10-2) ...
Setting up python3 (3.13.2-2) ...
Setting up man-db (2.13.0-1) ...
Not building database; man-db/auto-update is not 'true'.
Setting up libinput-bin (1.27.1-1) ...
Setting up libegl-mesa0:armhf (25.0.1-2) ...
Setting up libqt6xml6:armhf (6.8.2+dfsg-5+b1) ...
Setting up libqt6sql6:armhf (6.8.2+dfsg-5+b1) ...
Setting up librtmp1:armhf (2.4+20151223.gitfa8646d.1-2+b5) ...
Setting up qmake6-bin (6.8.2+dfsg-5+b1) ...
Setting up python3-lxml:armhf (5.3.1-1+b1) ...
Setting up libegl1:armhf (1.7.0-1+b2) ...
Setting up libcups2t64:armhf (2.4.10-2+b1) ...
Setting up libngtcp2-crypto-gnutls8:armhf (1.11.0-1) ...
Setting up libqt6dbus6:armhf (6.8.2+dfsg-5+b1) ...
Setting up libqt6concurrent6:armhf (6.8.2+dfsg-5+b1) ...
Setting up libinput10:armhf (1.27.1-1) ...
Setting up libvulkan-dev:armhf (1.4.304.0-1) ...
Setting up libglx-mesa0:armhf (25.0.1-2) ...
Setting up qt6-base-dev-tools (6.8.2+dfsg-5+b1) ...
Setting up libglx0:armhf (1.7.0-1+b2) ...
Setting up libcurl4t64:armhf (8.13.0~rc2-1) ...
Setting up python3-charset-normalizer (3.4.1-1+b1) ...
Setting up libcurl3t64-gnutls:armhf (8.13.0~rc2-1) ...
Setting up python3-yaml (6.0.2-1+b2) ...
Setting up debhelper (13.24.1) ...
Setting up qmake6:armhf (6.8.2+dfsg-5+b1) ...
Setting up libgl1:armhf (1.7.0-1+b2) ...
Setting up libqt6gui6:armhf (6.8.2+dfsg-5+b1) ...
Setting up python3-debian (1.0.1) ...
Setting up pkg-kde-tools (0.18.12) ...
Setting up cmake (3.31.6-1) ...
Setting up libglx-dev:armhf (1.7.0-1+b2) ...
Setting up libgl-dev:armhf (1.7.0-1+b2) ...
Setting up libproxy1v5:armhf (0.5.9-1) ...
Setting up libqt6opengl6:armhf (6.8.2+dfsg-5+b1) ...
Setting up libqt6widgets6:armhf (6.8.2+dfsg-5+b1) ...
Setting up libqt6network6:armhf (6.8.2+dfsg-5+b1) ...
Setting up libqt6openglwidgets6:armhf (6.8.2+dfsg-5+b1) ...
Setting up libqt6printsupport6:armhf (6.8.2+dfsg-5+b1) ...
Setting up qt6-qpa-plugins:armhf (6.8.2+dfsg-5+b1) ...
Setting up qt6-base-dev:armhf (6.8.2+dfsg-5+b1) ...
Processing triggers for libc-bin (2.41-6) ...
Reading package lists...
Building dependency tree...
Reading state information...
Reading extended state information...
Initializing package states...
Writing extended state information...
Building tag database...
 -> Finished parsing the build-deps
I: Building the package
I: Running cd /build/reproducible-path/kf6-breeze-icons-6.11.0/ && env PATH="/usr/sbin:/usr/bin:/sbin:/bin:/usr/games" HOME="/nonexistent/first-build" dpkg-buildpackage -us -uc -b && env PATH="/usr/sbin:/usr/bin:/sbin:/bin:/usr/games" HOME="/nonexistent/first-build" dpkg-genchanges -S  > ../kf6-breeze-icons_6.11.0-1_source.changes
dpkg-buildpackage: info: source package kf6-breeze-icons
dpkg-buildpackage: info: source version 6.11.0-1
dpkg-buildpackage: info: source distribution unstable
dpkg-buildpackage: info: source changed by Aurélien COUDERC <coucouf@debian.org>
 dpkg-source --before-build .
dpkg-buildpackage: info: host architecture armhf
 debian/rules clean
dh clean --no-parallel
   dh_auto_clean --buildsystem=kf6 -O--no-parallel
   dh_autoreconf_clean -O--no-parallel
   dh_clean -O--no-parallel
 debian/rules binary
dh binary --no-parallel
   dh_update_autotools_config -O--no-parallel
   dh_autoreconf -O--no-parallel
   debian/rules override_dh_auto_configure
make[1]: Entering directory '/build/reproducible-path/kf6-breeze-icons-6.11.0'
dh_auto_configure -- \
  -DBINARY_ICONS_RESOURCE=ON \
  -DWITH_ICON_GENERATION=ON \
  -DSKIP_INSTALL_ICONS=OFF
	cd obj-arm-linux-gnueabihf && DEB_PYTHON_INSTALL_LAYOUT=deb PKG_CONFIG=/usr/bin/pkg-config cmake -DCMAKE_INSTALL_PREFIX=/usr -DCMAKE_BUILD_TYPE=None -DCMAKE_INSTALL_SYSCONFDIR=/etc -DCMAKE_INSTALL_LOCALSTATEDIR=/var -DCMAKE_EXPORT_NO_PACKAGE_REGISTRY=ON -DCMAKE_FIND_USE_PACKAGE_REGISTRY=OFF -DCMAKE_FIND_PACKAGE_NO_PACKAGE_REGISTRY=ON -DFETCHCONTENT_FULLY_DISCONNECTED=ON -DCMAKE_INSTALL_RUNSTATEDIR=/run -DCMAKE_SKIP_INSTALL_ALL_DEPENDENCY=ON "-GUnix Makefiles" -DCMAKE_VERBOSE_MAKEFILE=ON -DCMAKE_INSTALL_LIBDIR=lib/arm-linux-gnueabihf -DBINARY_ICONS_RESOURCE=ON -DWITH_ICON_GENERATION=ON -DSKIP_INSTALL_ICONS=OFF ..
-- The C compiler identification is GNU 14.2.0
-- The CXX compiler identification is GNU 14.2.0
-- Detecting C compiler ABI info
-- Detecting C compiler ABI info - done
-- Check for working C compiler: /usr/bin/cc - skipped
-- Detecting C compile features
-- Detecting C compile features - done
-- Detecting CXX compiler ABI info
-- Detecting CXX compiler ABI info - done
-- Check for working CXX compiler: /usr/bin/c++ - skipped
-- Detecting CXX compile features
-- Detecting CXX compile features - done
-- 

Detected locale "C" with character encoding "ANSI_X3.4-1968", which is not UTF-8.
Qt depends on a UTF-8 locale, and has switched to "C.UTF-8" instead.
If this causes problems, reconfigure your locale. See the locale(1) manual
for more information.
-- Installing in the same prefix as Qt, adopting their path scheme.
Detected locale "C" with character encoding "ANSI_X3.4-1968", which is not UTF-8.
Qt depends on a UTF-8 locale, and has switched to "C.UTF-8" instead.
If this causes problems, reconfigure your locale. See the locale(1) manual
for more information.
Detected locale "C" with character encoding "ANSI_X3.4-1968", which is not UTF-8.
Qt depends on a UTF-8 locale, and has switched to "C.UTF-8" instead.
If this causes problems, reconfigure your locale. See the locale(1) manual
for more information.
Detected locale "C" with character encoding "ANSI_X3.4-1968", which is not UTF-8.
Qt depends on a UTF-8 locale, and has switched to "C.UTF-8" instead.
If this causes problems, reconfigure your locale. See the locale(1) manual
for more information.
-- Could not set up the appstream test. appstreamcli is missing.
-- Performing Test HAVE_STDATOMIC
-- Performing Test HAVE_STDATOMIC - Success
-- Found WrapAtomic: TRUE
-- Looking for __GLIBC__
-- Looking for __GLIBC__ - found
-- Performing Test _OFFT_IS_64BIT
-- Performing Test _OFFT_IS_64BIT - Success
-- Performing Test HAVE_DATE_TIME
-- Performing Test HAVE_DATE_TIME - Success
CMake Warning (dev) at /usr/share/ECM/kde-modules/KDEClangFormat.cmake:109 (add_custom_command):
  Exactly one of PRE_BUILD, PRE_LINK, or POST_BUILD must be given.  Assuming
  POST_BUILD to preserve backward compatibility.

  Policy CMP0175 is not set: add_custom_command() rejects invalid arguments.
  Run "cmake --help-policy CMP0175" for policy details.  Use the cmake_policy
  command to set the policy and suppress this warning.
Call Stack (most recent call first):
  /usr/share/ECM/kde-modules/KDEFrameworkCompilerSettings.cmake:66 (kde_clang_format)
  CMakeLists.txt:23 (include)
This warning is for project developers.  Use -Wno-dev to suppress it.

-- Found OpenGL: /usr/lib/arm-linux-gnueabihf/libOpenGL.so
-- Found WrapOpenGL: TRUE
-- Could NOT find XKB (missing: XKB_LIBRARY XKB_INCLUDE_DIR) (Required is at least version "0.5.0")
-- Found WrapVulkanHeaders: /usr/include
-- Found Python: /usr/bin/python3 (found suitable version "3.13.2", minimum required is "3") found components: Interpreter
CMake Warning (dev) at CMakeLists.txt:40 (exec_program):
  Policy CMP0153 is not set: The exec_program command should not be called.
  Run "cmake --help-policy CMP0153" for policy details.  Use the cmake_policy
  command to set the policy and suppress this warning.

  Use execute_process() instead.
This warning is for project developers.  Use -Wno-dev to suppress it.

running /usr/bin/python3 -c "import lxml; from lxml import etree; print(lxml.get_include())"  2>&1
['/usr/lib/python3/dist-packages/lxml/includes', '/usr/lib/python3/dist-packages/lxml', '/usr/lib/python3/dist-packages/lxml/includes/__pycache__']
-- Performing Test COMPILER_HAS_HIDDEN_VISIBILITY
-- Performing Test COMPILER_HAS_HIDDEN_VISIBILITY - Success
-- Performing Test COMPILER_HAS_HIDDEN_INLINE_VISIBILITY
-- Performing Test COMPILER_HAS_HIDDEN_INLINE_VISIBILITY - Success
-- Performing Test COMPILER_HAS_DEPRECATED_ATTR
-- Performing Test COMPILER_HAS_DEPRECATED_ATTR - Success
-- The following features have been enabled:

 * Icon generation, for 24x24 and symbolic dark icons.
   This feature requires Python 3 and the lxml Python 3 module.

-- The following OPTIONAL packages have been found:

 * Qt6Core
 * OpenGL
 * PkgConfig
 * Vulkan
 * WrapVulkanHeaders
 * Qt6GuiTools (required version >= 6.8.2)
 * Qt6CoreTools (required version >= 6.8.2)
 * Qt6DBusTools (required version >= 6.8.2)
 * Qt6Gui (required version >= 6.6.0)
 * Python (required version >= 3)
 * Qt6Test (required version >= 6.6.0)

-- The following REQUIRED packages have been found:

 * ECM (required version >= 6.11.0), Extra CMake Modules., <https://commits.kde.org/extra-cmake-modules>
 * Qt6 (required version >= 6.6.0)

-- The following OPTIONAL packages have not been found:

 * XKB (required version >= 0.5.0), XKB API common to servers and clients., <http://xkbcommon.org>

-- Configuring done (9.7s)
-- Generating done (0.3s)
CMake Warning:
  Manually-specified variables were not used by the project:

    CMAKE_EXPORT_NO_PACKAGE_REGISTRY
    CMAKE_FIND_PACKAGE_NO_PACKAGE_REGISTRY
    FETCHCONTENT_FULLY_DISCONNECTED


-- Build files have been written to: /build/reproducible-path/kf6-breeze-icons-6.11.0/obj-arm-linux-gnueabihf
make[1]: Leaving directory '/build/reproducible-path/kf6-breeze-icons-6.11.0'
   dh_auto_build --buildsystem=kf6 -O--no-parallel
	cd obj-arm-linux-gnueabihf && make -j1 "INSTALL=install --strip-program=true" VERBOSE=1
make[1]: Entering directory '/build/reproducible-path/kf6-breeze-icons-6.11.0/obj-arm-linux-gnueabihf'
/usr/bin/cmake -S/build/reproducible-path/kf6-breeze-icons-6.11.0 -B/build/reproducible-path/kf6-breeze-icons-6.11.0/obj-arm-linux-gnueabihf --check-build-system CMakeFiles/Makefile.cmake 0
/usr/bin/cmake -E cmake_progress_start /build/reproducible-path/kf6-breeze-icons-6.11.0/obj-arm-linux-gnueabihf/CMakeFiles /build/reproducible-path/kf6-breeze-icons-6.11.0/obj-arm-linux-gnueabihf//CMakeFiles/progress.marks
make  -f CMakeFiles/Makefile2 all
make[2]: Entering directory '/build/reproducible-path/kf6-breeze-icons-6.11.0/obj-arm-linux-gnueabihf'
make  -f autotests/CMakeFiles/scalable_autogen_timestamp_deps.dir/build.make autotests/CMakeFiles/scalable_autogen_timestamp_deps.dir/depend
make[3]: Entering directory '/build/reproducible-path/kf6-breeze-icons-6.11.0/obj-arm-linux-gnueabihf'
cd /build/reproducible-path/kf6-breeze-icons-6.11.0/obj-arm-linux-gnueabihf && /usr/bin/cmake -E cmake_depends "Unix Makefiles" /build/reproducible-path/kf6-breeze-icons-6.11.0 /build/reproducible-path/kf6-breeze-icons-6.11.0/autotests /build/reproducible-path/kf6-breeze-icons-6.11.0/obj-arm-linux-gnueabihf /build/reproducible-path/kf6-breeze-icons-6.11.0/obj-arm-linux-gnueabihf/autotests /build/reproducible-path/kf6-breeze-icons-6.11.0/obj-arm-linux-gnueabihf/autotests/CMakeFiles/scalable_autogen_timestamp_deps.dir/DependInfo.cmake "--color="
make[3]: Leaving directory '/build/reproducible-path/kf6-breeze-icons-6.11.0/obj-arm-linux-gnueabihf'
make  -f autotests/CMakeFiles/scalable_autogen_timestamp_deps.dir/build.make autotests/CMakeFiles/scalable_autogen_timestamp_deps.dir/build
make[3]: Entering directory '/build/reproducible-path/kf6-breeze-icons-6.11.0/obj-arm-linux-gnueabihf'
make[3]: Nothing to be done for 'autotests/CMakeFiles/scalable_autogen_timestamp_deps.dir/build'.
make[3]: Leaving directory '/build/reproducible-path/kf6-breeze-icons-6.11.0/obj-arm-linux-gnueabihf'
[  0%] Built target scalable_autogen_timestamp_deps
make  -f autotests/CMakeFiles/scalable_autogen.dir/build.make autotests/CMakeFiles/scalable_autogen.dir/depend
make[3]: Entering directory '/build/reproducible-path/kf6-breeze-icons-6.11.0/obj-arm-linux-gnueabihf'
cd /build/reproducible-path/kf6-breeze-icons-6.11.0/obj-arm-linux-gnueabihf && /usr/bin/cmake -E cmake_depends "Unix Makefiles" /build/reproducible-path/kf6-breeze-icons-6.11.0 /build/reproducible-path/kf6-breeze-icons-6.11.0/autotests /build/reproducible-path/kf6-breeze-icons-6.11.0/obj-arm-linux-gnueabihf /build/reproducible-path/kf6-breeze-icons-6.11.0/obj-arm-linux-gnueabihf/autotests /build/reproducible-path/kf6-breeze-icons-6.11.0/obj-arm-linux-gnueabihf/autotests/CMakeFiles/scalable_autogen.dir/DependInfo.cmake "--color="
make[3]: Leaving directory '/build/reproducible-path/kf6-breeze-icons-6.11.0/obj-arm-linux-gnueabihf'
make  -f autotests/CMakeFiles/scalable_autogen.dir/build.make autotests/CMakeFiles/scalable_autogen.dir/build
make[3]: Entering directory '/build/reproducible-path/kf6-breeze-icons-6.11.0/obj-arm-linux-gnueabihf'
[  4%] Automatic MOC for target scalable
cd /build/reproducible-path/kf6-breeze-icons-6.11.0/obj-arm-linux-gnueabihf/autotests && /usr/bin/cmake -E cmake_autogen /build/reproducible-path/kf6-breeze-icons-6.11.0/obj-arm-linux-gnueabihf/autotests/CMakeFiles/scalable_autogen.dir/AutogenInfo.json None
AutoGen: Refreshing parse cache because it doesn't exist.
AutoMoc: Generating "SRC:/obj-arm-linux-gnueabihf/autotests/scalable_autogen/moc_predefs.h", because it doesn't exist.
/usr/bin/c++ -std=c++20 -dM -E -c /usr/share/cmake-3.31/Modules/CMakeCXXCompilerABI.cpp -DQT_CORE_LIB -DQT_FORCE_ASSERTS -DQT_NO_CAST_FROM_ASCII -DQT_NO_CAST_FROM_BYTEARRAY -DQT_NO_CAST_TO_ASCII -DQT_NO_DEBUG -DQT_NO_FOREACH -DQT_NO_KEYWORDS -DQT_NO_NARROWING_CONVERSIONS_IN_CONNECT -DQT_NO_URL_CAST_FROM_STRING -DQT_STRICT_ITERATORS "-DQT_TESTCASE_BUILDDIR=\"/build/reproducible-path/kf6-breeze-icons-6.11.0/obj-arm-linux-gnueabihf/autotests\"" "-DQT_TESTCASE_SOURCEDIR=\"/build/reproducible-path/kf6-breeze-icons-6.11.0/autotests\"" -DQT_TESTLIB_LIB -DQT_USE_QSTRINGBUILDER -D_GNU_SOURCE -D_LARGEFILE64_SOURCE -I/build/reproducible-path/kf6-breeze-icons-6.11.0/obj-arm-linux-gnueabihf/autotests -I/build/reproducible-path/kf6-breeze-icons-6.11.0/autotests -I/usr/include/arm-linux-gnueabihf/qt6/QtTest -I/usr/include/arm-linux-gnueabihf/qt6 -I/usr/include/arm-linux-gnueabihf/qt6/QtCore -I/usr/lib/arm-linux-gnueabihf/qt6/mkspecs/linux-g++ -I/usr/include/c++/14 -I/usr/include/arm-linux-gnueabihf/c++/14 -I/usr/include/c++/14/backward -I/usr/lib/gcc/arm-linux-gnueabihf/14/include -I/usr/local/include -I/usr/include/arm-linux-gnueabihf -I/usr/include
AutoGen: Parsing "SRC:/autotests/scalabletest.cpp"
AutoMoc: Generating "SRC:/obj-arm-linux-gnueabihf/autotests/scalable_autogen/include/scalabletest.moc", because it doesn't exist, from "SRC:/autotests/scalabletest.cpp"
/usr/lib/qt6/libexec/moc -DQT_CORE_LIB -DQT_FORCE_ASSERTS -DQT_NO_CAST_FROM_ASCII -DQT_NO_CAST_FROM_BYTEARRAY -DQT_NO_CAST_TO_ASCII -DQT_NO_DEBUG -DQT_NO_FOREACH -DQT_NO_KEYWORDS -DQT_NO_NARROWING_CONVERSIONS_IN_CONNECT -DQT_NO_URL_CAST_FROM_STRING -DQT_STRICT_ITERATORS "-DQT_TESTCASE_BUILDDIR=\"/build/reproducible-path/kf6-breeze-icons-6.11.0/obj-arm-linux-gnueabihf/autotests\"" "-DQT_TESTCASE_SOURCEDIR=\"/build/reproducible-path/kf6-breeze-icons-6.11.0/autotests\"" -DQT_TESTLIB_LIB -DQT_USE_QSTRINGBUILDER -D_GNU_SOURCE -D_LARGEFILE64_SOURCE -I/build/reproducible-path/kf6-breeze-icons-6.11.0/obj-arm-linux-gnueabihf/autotests -I/build/reproducible-path/kf6-breeze-icons-6.11.0/autotests -I/usr/include/arm-linux-gnueabihf/qt6/QtTest -I/usr/include/arm-linux-gnueabihf/qt6 -I/usr/include/arm-linux-gnueabihf/qt6/QtCore -I/usr/lib/arm-linux-gnueabihf/qt6/mkspecs/linux-g++ -I/usr/include/c++/14 -I/usr/include/arm-linux-gnueabihf/c++/14 -I/usr/include/c++/14/backward -I/usr/lib/gcc/arm-linux-gnueabihf/14/include -I/usr/local/include -I/usr/include/arm-linux-gnueabihf -I/usr/include --include /build/reproducible-path/kf6-breeze-icons-6.11.0/obj-arm-linux-gnueabihf/autotests/scalable_autogen/moc_predefs.h --output-dep-file -o /build/reproducible-path/kf6-breeze-icons-6.11.0/obj-arm-linux-gnueabihf/autotests/scalable_autogen/include/scalabletest.moc /build/reproducible-path/kf6-breeze-icons-6.11.0/autotests/scalabletest.cpp
AutoMoc: Reading dependencies from "SRC:/obj-arm-linux-gnueabihf/autotests/scalable_autogen/include/scalabletest.moc.d"
AutoMoc: Generating MOC compilation "SRC:/obj-arm-linux-gnueabihf/autotests/scalable_autogen/mocs_compilation.cpp"
AutoMoc: Merging MOC dependencies into "SRC:/obj-arm-linux-gnueabihf/autotests/scalable_autogen/deps"
AutoGen: Writing the parse cache file "SRC:/obj-arm-linux-gnueabihf/autotests/CMakeFiles/scalable_autogen.dir/ParseCache.txt"
AutoGen: Writing the settings file "SRC:/obj-arm-linux-gnueabihf/autotests/CMakeFiles/scalable_autogen.dir/AutogenUsed.txt"
cd /build/reproducible-path/kf6-breeze-icons-6.11.0/obj-arm-linux-gnueabihf/autotests && /usr/bin/cmake -E touch /build/reproducible-path/kf6-breeze-icons-6.11.0/obj-arm-linux-gnueabihf/autotests/scalable_autogen/timestamp
make[3]: Leaving directory '/build/reproducible-path/kf6-breeze-icons-6.11.0/obj-arm-linux-gnueabihf'
[  4%] Built target scalable_autogen
make  -f autotests/CMakeFiles/scalable.dir/build.make autotests/CMakeFiles/scalable.dir/depend
make[3]: Entering directory '/build/reproducible-path/kf6-breeze-icons-6.11.0/obj-arm-linux-gnueabihf'
cd /build/reproducible-path/kf6-breeze-icons-6.11.0/obj-arm-linux-gnueabihf && /usr/bin/cmake -E cmake_depends "Unix Makefiles" /build/reproducible-path/kf6-breeze-icons-6.11.0 /build/reproducible-path/kf6-breeze-icons-6.11.0/autotests /build/reproducible-path/kf6-breeze-icons-6.11.0/obj-arm-linux-gnueabihf /build/reproducible-path/kf6-breeze-icons-6.11.0/obj-arm-linux-gnueabihf/autotests /build/reproducible-path/kf6-breeze-icons-6.11.0/obj-arm-linux-gnueabihf/autotests/CMakeFiles/scalable.dir/DependInfo.cmake "--color="
Dependencies file "autotests/scalable_autogen/deps" is newer than depends file "/build/reproducible-path/kf6-breeze-icons-6.11.0/obj-arm-linux-gnueabihf/autotests/CMakeFiles/scalable.dir/compiler_depend.internal".
Consolidate compiler generated dependencies of target scalable
make[3]: Leaving directory '/build/reproducible-path/kf6-breeze-icons-6.11.0/obj-arm-linux-gnueabihf'
make  -f autotests/CMakeFiles/scalable.dir/build.make autotests/CMakeFiles/scalable.dir/build
make[3]: Entering directory '/build/reproducible-path/kf6-breeze-icons-6.11.0/obj-arm-linux-gnueabihf'
[  8%] Building CXX object autotests/CMakeFiles/scalable.dir/scalable_autogen/mocs_compilation.cpp.o
cd /build/reproducible-path/kf6-breeze-icons-6.11.0/obj-arm-linux-gnueabihf/autotests && /usr/bin/c++ -DQT_CORE_LIB -DQT_FORCE_ASSERTS -DQT_NO_CAST_FROM_ASCII -DQT_NO_CAST_FROM_BYTEARRAY -DQT_NO_CAST_TO_ASCII -DQT_NO_DEBUG -DQT_NO_FOREACH -DQT_NO_KEYWORDS -DQT_NO_NARROWING_CONVERSIONS_IN_CONNECT -DQT_NO_URL_CAST_FROM_STRING -DQT_STRICT_ITERATORS -DQT_TESTCASE_BUILDDIR=\"/build/reproducible-path/kf6-breeze-icons-6.11.0/obj-arm-linux-gnueabihf/autotests\" -DQT_TESTCASE_SOURCEDIR=\"/build/reproducible-path/kf6-breeze-icons-6.11.0/autotests\" -DQT_TESTLIB_LIB -DQT_USE_QSTRINGBUILDER -D_GNU_SOURCE -D_LARGEFILE64_SOURCE -I/build/reproducible-path/kf6-breeze-icons-6.11.0/obj-arm-linux-gnueabihf/autotests -I/build/reproducible-path/kf6-breeze-icons-6.11.0/autotests -I/build/reproducible-path/kf6-breeze-icons-6.11.0/obj-arm-linux-gnueabihf/autotests/scalable_autogen/include -isystem /usr/include/arm-linux-gnueabihf/qt6/QtTest -isystem /usr/include/arm-linux-gnueabihf/qt6 -isystem /usr/include/arm-linux-gnueabihf/qt6/QtCore -isystem /usr/lib/arm-linux-gnueabihf/qt6/mkspecs/linux-g++ -g -O2 -ffile-prefix-map=/build/reproducible-path/kf6-breeze-icons-6.11.0=. -fstack-protector-strong -fstack-clash-protection -Wformat -Werror=format-security -D_LARGEFILE_SOURCE -D_FILE_OFFSET_BITS=64 -D_TIME_BITS=64 -Wdate-time -D_FORTIFY_SOURCE=2 -fno-operator-names -fno-exceptions -Wall -Wextra -Wcast-align -Wchar-subscripts -Wformat-security -Wno-long-long -Wpointer-arith -Wundef -Wnon-virtual-dtor -Woverloaded-virtual -Werror=return-type -Werror=init-self -Werror=undef -Wvla -Wdate-time -Wsuggest-override -Wlogical-op -pedantic -Wzero-as-null-pointer-constant -Wmissing-include-dirs -std=c++20 -fPIE -fvisibility=hidden -fvisibility-inlines-hidden -MD -MT autotests/CMakeFiles/scalable.dir/scalable_autogen/mocs_compilation.cpp.o -MF CMakeFiles/scalable.dir/scalable_autogen/mocs_compilation.cpp.o.d -o CMakeFiles/scalable.dir/scalable_autogen/mocs_compilation.cpp.o -c /build/reproducible-path/kf6-breeze-icons-6.11.0/obj-arm-linux-gnueabihf/autotests/scalable_autogen/mocs_compilation.cpp
[ 12%] Building CXX object autotests/CMakeFiles/scalable.dir/scalabletest.cpp.o
cd /build/reproducible-path/kf6-breeze-icons-6.11.0/obj-arm-linux-gnueabihf/autotests && /usr/bin/c++ -DQT_CORE_LIB -DQT_FORCE_ASSERTS -DQT_NO_CAST_FROM_ASCII -DQT_NO_CAST_FROM_BYTEARRAY -DQT_NO_CAST_TO_ASCII -DQT_NO_DEBUG -DQT_NO_FOREACH -DQT_NO_KEYWORDS -DQT_NO_NARROWING_CONVERSIONS_IN_CONNECT -DQT_NO_URL_CAST_FROM_STRING -DQT_STRICT_ITERATORS -DQT_TESTCASE_BUILDDIR=\"/build/reproducible-path/kf6-breeze-icons-6.11.0/obj-arm-linux-gnueabihf/autotests\" -DQT_TESTCASE_SOURCEDIR=\"/build/reproducible-path/kf6-breeze-icons-6.11.0/autotests\" -DQT_TESTLIB_LIB -DQT_USE_QSTRINGBUILDER -D_GNU_SOURCE -D_LARGEFILE64_SOURCE -I/build/reproducible-path/kf6-breeze-icons-6.11.0/obj-arm-linux-gnueabihf/autotests -I/build/reproducible-path/kf6-breeze-icons-6.11.0/autotests -I/build/reproducible-path/kf6-breeze-icons-6.11.0/obj-arm-linux-gnueabihf/autotests/scalable_autogen/include -isystem /usr/include/arm-linux-gnueabihf/qt6/QtTest -isystem /usr/include/arm-linux-gnueabihf/qt6 -isystem /usr/include/arm-linux-gnueabihf/qt6/QtCore -isystem /usr/lib/arm-linux-gnueabihf/qt6/mkspecs/linux-g++ -g -O2 -ffile-prefix-map=/build/reproducible-path/kf6-breeze-icons-6.11.0=. -fstack-protector-strong -fstack-clash-protection -Wformat -Werror=format-security -D_LARGEFILE_SOURCE -D_FILE_OFFSET_BITS=64 -D_TIME_BITS=64 -Wdate-time -D_FORTIFY_SOURCE=2 -fno-operator-names -fno-exceptions -Wall -Wextra -Wcast-align -Wchar-subscripts -Wformat-security -Wno-long-long -Wpointer-arith -Wundef -Wnon-virtual-dtor -Woverloaded-virtual -Werror=return-type -Werror=init-self -Werror=undef -Wvla -Wdate-time -Wsuggest-override -Wlogical-op -pedantic -Wzero-as-null-pointer-constant -Wmissing-include-dirs -std=c++20 -fPIE -fvisibility=hidden -fvisibility-inlines-hidden -MD -MT autotests/CMakeFiles/scalable.dir/scalabletest.cpp.o -MF CMakeFiles/scalable.dir/scalabletest.cpp.o.d -o CMakeFiles/scalable.dir/scalabletest.cpp.o -c /build/reproducible-path/kf6-breeze-icons-6.11.0/autotests/scalabletest.cpp
[ 16%] Linking CXX executable ../bin/scalable
cd /build/reproducible-path/kf6-breeze-icons-6.11.0/obj-arm-linux-gnueabihf/autotests && /usr/bin/cmake -E cmake_link_script CMakeFiles/scalable.dir/link.txt --verbose=1
/usr/bin/c++ -g -O2 -ffile-prefix-map=/build/reproducible-path/kf6-breeze-icons-6.11.0=. -fstack-protector-strong -fstack-clash-protection -Wformat -Werror=format-security -D_LARGEFILE_SOURCE -D_FILE_OFFSET_BITS=64 -D_TIME_BITS=64 -Wdate-time -D_FORTIFY_SOURCE=2 -fno-operator-names -fno-exceptions -Wall -Wextra -Wcast-align -Wchar-subscripts -Wformat-security -Wno-long-long -Wpointer-arith -Wundef -Wnon-virtual-dtor -Woverloaded-virtual -Werror=return-type -Werror=init-self -Werror=undef -Wvla -Wdate-time -Wsuggest-override -Wlogical-op -pedantic -Wzero-as-null-pointer-constant -Wmissing-include-dirs -Wl,--enable-new-dtags -Wl,-z,relro -Wl,-z,now CMakeFiles/scalable.dir/scalable_autogen/mocs_compilation.cpp.o CMakeFiles/scalable.dir/scalabletest.cpp.o -o ../bin/scalable  /usr/lib/arm-linux-gnueabihf/libQt6Test.so.6.8.2 /usr/lib/arm-linux-gnueabihf/libQt6Core.so.6.8.2
make[3]: Leaving directory '/build/reproducible-path/kf6-breeze-icons-6.11.0/obj-arm-linux-gnueabihf'
[ 20%] Built target scalable
make  -f icons/CMakeFiles/create-app-symlinks.dir/build.make icons/CMakeFiles/create-app-symlinks.dir/depend
make[3]: Entering directory '/build/reproducible-path/kf6-breeze-icons-6.11.0/obj-arm-linux-gnueabihf'
cd /build/reproducible-path/kf6-breeze-icons-6.11.0/obj-arm-linux-gnueabihf && /usr/bin/cmake -E cmake_depends "Unix Makefiles" /build/reproducible-path/kf6-breeze-icons-6.11.0 /build/reproducible-path/kf6-breeze-icons-6.11.0/icons /build/reproducible-path/kf6-breeze-icons-6.11.0/obj-arm-linux-gnueabihf /build/reproducible-path/kf6-breeze-icons-6.11.0/obj-arm-linux-gnueabihf/icons /build/reproducible-path/kf6-breeze-icons-6.11.0/obj-arm-linux-gnueabihf/icons/CMakeFiles/create-app-symlinks.dir/DependInfo.cmake "--color="
make[3]: Leaving directory '/build/reproducible-path/kf6-breeze-icons-6.11.0/obj-arm-linux-gnueabihf'
make  -f icons/CMakeFiles/create-app-symlinks.dir/build.make icons/CMakeFiles/create-app-symlinks.dir/build
make[3]: Entering directory '/build/reproducible-path/kf6-breeze-icons-6.11.0/obj-arm-linux-gnueabihf'
[ 25%] Creating icon symlinks for app aliases
cd /build/reproducible-path/kf6-breeze-icons-6.11.0/obj-arm-linux-gnueabihf/icons && /usr/bin/python3 /build/reproducible-path/kf6-breeze-icons-6.11.0/create-app-symlinks.py /build/reproducible-path/kf6-breeze-icons-6.11.0/icons /build/reproducible-path/kf6-breeze-icons-6.11.0/obj-arm-linux-gnueabihf/icons/aliases/
Symlinking application icons to their Flatpak IDs:
{'CMakeSetup': {},
 'QOwnNotes': {},
 'QtProject-designer': {},
 'TeamViewer-symbolic': {},
 'VBox': {},
 'accessories-calculator': {},
 'accessories-character-map': {},
 'accessories-screenshot-tool': {},
 'accessories-text-editor': {},
 'acroread': {},
 'akonadi-symbolic': {},
 'akregator': {'org.kde.akregator': [48]},
 'akregator-symbolic': {},
 'alienarena': {},
 'alligator': {'org.kde.alligator': [48]},
 'amarok': {'org.kde.amarok': [48]},
 'amarok-symbolic': {},
 'android-file-transfer': {},
 'android-studio': {},
 'anjuta': {},
 'anydesk': {'com.anydesk.Anydesk': [22, 16, 48, 32]},
 'apper': {},
 'application-x-clementine': {},
 'aptana': {},
 'ardour': {'org.ardour.Ardour': [48]},
 'ark': {'org.kde.ark': [48]},
 'artikulate': {'org.kde.artikulate': [48]},
 'assistant': {},
 'atom': {'io.atom.Atom': [48]},
 'audacity': {'org.audacityteam.Audacity': [48]},
 'author': {},
 'babe': {},
 'baloo': {},
 'bitcoin128': {},
 'bittorrent-sync': {},
 'bleachbit': {},
 'blender': {'org.blender.Blender': [48]},
 'blinken': {'org.kde.blinken': [48]},
 'blogilo': {},
 'bluefish': {'nl.openoffice.bluefish': [48]},
 'bluegriffon': {},
 'bomber': {'org.kde.bomber': [48]},
 'bomi': {},
 'bovo': {'org.kde.bovo': [48]},
 'brackets': {'io.brackets.Brackets': [48]},
 'braindump': {},
 'breeze-settings': {},
 'btsync-gui': {},
 'buho': {},
 'calamares': {},
 'calibre-ebook-edit': {},
 'calibre-viewer': {},
 'calindori': {},
 'calligraauthor': {},
 'calligraflow': {},
 'calligrakarbon': {},
 'calligrakexi': {},
 'calligraplan': {},
 'calligraplanwork': {},
 'calligrasheets': {},
 'calligrastage': {},
 'calligrawords': {},
 'cantata': {},
 'cantata-symbolic': {},
 'cantor': {'org.kde.cantor': [48]},
 'cervisia': {},
 'choqok': {},
 'claws-mail': {'org.claws_mail.Claws-Mail': [48]},
 'clementine': {},
 'cmake': {},
 'codeblocks': {},
 'com.visualstudio.code': {},
 'com.visualstudio.code.oss': {},
 'converseen': {'net.fasterland.converseen': [48]},
 'crow-translate': {'org.kde.CrowTranslate.svg': [48]},
 'cuttlefish': {'org.kde.iconexplorer': [48]},
 'darktable': {'org.darktable.Darktable': [48]},
 'dev.suyu_emu.suyu': {},
 'diaspora': {},
 'diffuse': {'io.github.mightycreak.Diffuse': [48]},
 'digikam': {'org.kde.digikam': [48]},
 'dragonplayer': {},
 'elisa': {'org.kde.elisa': [22, 48]},
 'elisa-symbolic': {},
 'emacs': {},
 'falkon': {'org.kde.falkon': [48]},
 'ffmulticonverter': {},
 'filelight': {},
 'filezilla': {'org.filezillaproject.Filezilla': [48]},
 'fingerprint-gui': {},
 'firewall-config': {},
 'flow': {},
 'fluid': {},
 'fontforge': {'org.fontforge.FontForge': [48]},
 'freemind': {},
 'frostwire': {},
 'gcompris-qt': {},
 'gimp': {'org.gimp.GIMP': [48]},
 'git-cola': {'com.github.git_cola.git-cola': [48]},
 'git-gui': {},
 'goodvibes': {'io.gitlab.Goodvibes': [48]},
 'gpick': {},
 'gpodder': {'org.gpodder.gpodder': [48]},
 'granatier': {'org.kde.granatier': [48]},
 'graphics-viewer-document': {},
 'graphics-viewer-document-symbolic': {},
 'grub-customizer': {},
 'gtkhash': {'org.gtkhash.gtkhash': [48]},
 'gwenview': {'org.kde.gwenview': [48]},
 'haguichi': {'com.github.ztefn.haguichi': [48]},
 'handbrake': {'fr.handbrake.ghb': [48]},
 'help-browser': {},
 'homebank': {'fr.free.Homebank': [48]},
 'homerun': {},
 'hotspot': {},
 'hotspot-symbolic': {},
 'htop': {},
 'hwinfo': {},
 'im.vector': {},
 'imagewriter': {},
 'inkscape': {'org.inkscape.Inkscape': [48]},
 'inkscape-logo': {},
 'internet-mail': {},
 'internet-mail-symbolic': {},
 'internet-telephony': {},
 'internet-web-browser': {},
 'internet-web-browser-symbolic': {},
 'jdownloader': {'org.jdownloader.JDownloader': [48]},
 'joplin': {'net.cozic.joplin_desktop': [48]},
 'juk': {'org.kde.juk': [48]},
 'juliabackend': {},
 'k3b': {},
 'kaddressbook': {},
 'kaffeine': {},
 'kajongg': {},
 'kalarm': {},
 'kalarm-symbolic': {},
 'kalgebra': {'org.kde.kalgebra': [48]},
 'kalgebrabackend': {},
 'kalzium': {'org.kde.kalzium': [48]},
 'kamoso': {'org.kde.kamoso': [48]},
 'kanagram': {'org.kde.kanagram': [48]},
 'kapman': {'org.kde.kapman': [48]},
 'kapptemplate': {},
 'karbon': {},
 'kate': {},
 'kate-symbolic': {},
 'katomic': {'org.kde.katomic': [48]},
 'kblackbox': {'org.kde.kblackbox': [48]},
 'kblocks': {'org.kde.kblocks': [48]},
 'kblogger': {},
 'kbreakout': {'org.kde.kbreakout': [48]},
 'kbruch': {'org.kde.kbruch': [48]},
 'kcachegrind': {'org.kde.kcachegrind': [48]},
 'kcalc': {},
 'kchart': {},
 'kcolorchooser': {'org.kde.kcolorchooser': [48]},
 'kde': {},
 'kde-frameworks': {},
 'kde-im-log-viewer': {},
 'kde-symbolic': {},
 'kdeapp': {},
 'kdeconnect-symbolic': {},
 'kdenlive': {'org.kde.kdenlive': [48]},
 'kdesrc-build': {},
 'kdesvn': {},
 'kdevelop': {'org.kde.kdevelop': [48]},
 'kdiamond': {'org.kde.kdiamond': [48]},
 'kdiff3': {'org.kde.kdiff3': [48]},
 'kdots': {},
 'keepass': {},
 'keepass2': {},
 'keepassx': {},
 'keepassx2': {},
 'kexi': {},
 'kfind': {'org.kde.kfind': [48]},
 'kfloppy': {},
 'kfontview': {},
 'kfourinline': {'org.kde.kfourinline': [48]},
 'kgeography': {'org.kde.kgeography': [48]},
 'kget': {'org.kde.kget': [48]},
 'kget-symbolic': {},
 'kgpg-symbolic': {},
 'khangman': {'org.kde.khangman': [48]},
 'kig': {'org.kde.kig': [48]},
 'kile': {'org.kde.kile': [48]},
 'kimagemapeditor': {},
 'kipi-dngconverter': {},
 'kipi-expoblending': {},
 'kipi-panorama': {},
 'kirigami-gallery': {},
 'kiriki': {'org.kde.kiriki': [48]},
 'kirogi': {},
 'kiten': {'org.kde.kiten': [48]},
 'kjumpingcube': {'org.kde.kjumpingcube': [48]},
 'kleopatra': {},
 'kleopatra-symbolic': {},
 'klines': {},
 'klipper': {},
 'klipper-symbolic': {},
 'kmag': {},
 'kmahjongg': {},
 'kmail': {},
 'kmail-symbolic': {},
 'kmenuedit': {},
 'kmix': {},
 'kmousetool': {},
 'kmouth': {},
 'kmplayer': {},
 'kmplot': {'org.kde.kmplot': [48]},
 'kmymoney': {},
 'knetattach': {},
 'knights': {'org.kde.knights': [48]},
 'knotes': {},
 'knotes-symbolic': {},
 'kolf': {'org.kde.kolf': [48]},
 'kolourpaint': {'org.kde.kolourpaint': [48]},
 'kompare': {},
 'konqueror': {},
 'kontact': {'org.kde.kontact': [48]},
 'konversation': {'org.kde.konversation': [16, 48]},
 'konversation-symbolic': {},
 'kopete': {'org.kde.kopete': [48]},
 'kopete-symbolic': {},
 'korg-todo': {},
 'korg-todo-symbolic': {},
 'korgac': {},
 'korgac-symbolic': {},
 'korganizer': {},
 'kpat': {},
 'kphotoalbum': {'org.kde.kphotoalbum': [48]},
 'kplato': {},
 'kpresenter': {},
 'krdc': {'org.kde.krdc': [48]},
 'krename': {'org.kde.krename': [48]},
 'krfb': {},
 'kronometer': {'org.kde.kronometer': [48]},
 'kruler': {'org.kde.kruler': [48]},
 'kruler-symbolic': {},
 'krusader_root': {},
 'krusader_user': {},
 'kshisen': {},
 'ksirk': {'org.kde.ksirk': [48]},
 'ksnapshot': {},
 'kspread': {},
 'kstars': {'org.kde.kstars': [48]},
 'ksysguardd': {},
 'kteatime': {'org.kde.kteatime': [48]},
 'kteatime-symbolic': {},
 'ktimer': {},
 'ktimetracker': {'org.kde.ktimetracker': [22, 48, 32]},
 'ktip': {},
 'ktnef': {},
 'ktorrent': {'org.kde.ktorrent': [48]},
 'ktorrent-symbolic': {},
 'ktouch': {'org.kde.ktouch': [48]},
 'ktrip': {'org.kde.ktrip': [48]},
 'kube-mail': {},
 'kuiviewer': {'org.kde.kuiviewer': [48]},
 'kup': {},
 'kup-symbolic': {},
 'kuser': {},
 'kwalletmanager': {'org.kde.kwalletmanager5': [48]},
 'kwalletmanager2': {},
 'kwave': {},
 'kwin': {},
 'kword': {},
 'kwrite': {'org.kde.kwrite': [22, 16, 48, 64, 32]},
 'kxstitch': {'org.kde.kxstitch': [48]},
 'labplot': {'org.kde.labplot2': [48]},
 'labplot2': {},
 'lastpass': {},
 'latte-dock': {},
 'leocad': {'org.leocad.LeoCAD': [48]},
 'libreoffice-base': {'org.libreoffice.LibreOffice.base': [16, 48]},
 'libreoffice-calc': {'org.libreoffice.LibreOffice.calc': [16, 48]},
 'libreoffice-draw': {'org.libreoffice.LibreOffice.draw': [16, 48]},
 'libreoffice-impress': {'org.libreoffice.LibreOffice.impress': [16, 48]},
 'libreoffice-main': {},
 'libreoffice-math': {'org.libreoffice.LibreOffice.math': [16, 48]},
 'libreoffice-startcenter': {'org.libreoffice.LibreOffice.startcenter': [16,
                                                                         48]},
 'libreoffice-writer': {'org.libreoffice.LibreOffice.writer': [16, 48]},
 'linguist': {},
 'logisim': {},
 'lokalize': {'org.kde.lokalize': [48]},
 'luabackend': {},
 'mail-client': {},
 'massif-visualizer': {'org.kde.massif-visualizer': [48]},
 'masterpdfeditor': {'net.codeindustry.MasterPDFEditor': [48]},
 'mathematica': {},
 'matlab': {},
 'maximabackend': {},
 'mendeleydesktop': {'com.elsevier.MendeleyDesktop': [48]},
 'minitube': {'org.tordini.flavio.Minitube': [48]},
 'minuet': {'org.kde.minuet': [48]},
 'mixxx': {},
 'mpv': {'io.mpv.Mpv': [48]},
 'multimedia-volume-control': {},
 'muon': {},
 'muondiscover': {},
 'network-manager': {},
 'nota': {'org.kde.nota': [48]},
 'ntfs-config': {},
 'nylas': {},
 'octave': {},
 'octavebackend': {},
 'octopi': {},
 'office-address-book': {},
 'office-calendar': {},
 'okteta': {'org.kde.okteta': [48]},
 'okular': {'org.kde.okular': [48]},
 'openbravo-erp': {},
 'org.fedoraproject.AnacondaInstaller': {},
 'org.gajim.Gajim': {},
 'org.kde.Ikona': {},
 'org.kde.kongress': {},
 'org.kde.kontrast': {},
 'org.kde.neochat': {},
 'org.suyu_emu.suyu': {},
 'org.xfce.screenshooter': {},
 'parley': {},
 'partitionmanager': {},
 'pcmanfm-qt': {},
 'phonon-gstreamer': {},
 'photolayoutseditor': {},
 'picmi': {'org.kde.picmi': [48]},
 'plan': {},
 'planetkde': {},
 'plank': {},
 'planner': {},
 'planwork': {},
 'plasma-browser-integration': {},
 'plasma-browser-integration-symbolic': {},
 'plasma-media-center': {},
 'plasma-mobile-phone': {},
 'plasma-nano': {},
 'plasma-symbolic': {},
 'plasmadiscover': {},
 'plasmavault': {},
 'plasmavault-symbolic': {},
 'preferences-desktop-font-installer': {},
 'preferences-other-symbolic': {},
 'preferences-plugin-symbolic': {},
 'preferences-system': {},
 'preferences-system-bluetooth-symbolic': {},
 'puremaps': {},
 'pythonbackend': {},
 'q4wine': {'ua.org.brezblock.q4wine': [48]},
 'qalculate': {},
 'qbittorrent': {'org.qbittorrent.qBittorrent': [48]},
 'qdbusviewer': {},
 'qelectrotech': {'org.qelectrotech.QElectroTech': [48]},
 'qtcreator': {},
 'quassel': {},
 'quassel-symbolic': {},
 'quiterss': {},
 'qupzilla': {},
 'r': {},
 'rbackend': {},
 'rekonq': {},
 'ring': {},
 'ring-kde': {},
 'rocs': {},
 'rosegarden': {'com.rosegardenmusic.rosegarden': [48]},
 'sage-notebook': {},
 'sagebackend': {},
 'scanner': {},
 'scribus': {'net.scribus.Scribus': [48]},
 'sharedlib': {},
 'sheets': {},
 'showfoto': {},
 'skanlite': {'org.kde.skanlite': [48]},
 'skanpage': {},
 'skladnik': {},
 'skrooge': {'org.kde.skrooge': [48]},
 'skrooge-black': {},
 'skrooge-initial': {},
 'smartgit': {'com.syntevo.SmartGit': [48]},
 'smb4k': {},
 'smplayer': {'info.smplayer.SMPlayer': [48]},
 'smtube': {},
 'spectacle': {},
 'stage': {},
 'steam': {'com.valvesoftware.Steam': [48]},
 'step': {},
 'sublime-merge': {'com.sublimemerge.App': [48]},
 'sublime-text': {'com.sublimetext.Three': [48]},
 'subtitlecomposer': {},
 'sweeper': {},
 'symboleditor': {},
 'synaptic': {},
 'syncthing': {},
 'synfig_icon': {},
 'system-file-manager': {},
 'system-file-manager-symbolic': {},
 'system-help': {},
 'system-run': {},
 'system-software-install': {},
 'system-software-update': {},
 'systemsettings': {},
 'teamviewer': {},
 'telegram': {'org.telegram.desktop': [48]},
 'telepathy-kde': {},
 'texstudio': {'org.texstudio.TeXstudio': [48]},
 'truecrypt': {},
 'ubiquity': {},
 'ubiquity-kde': {},
 'umbrello': {'org.kde.umbrello': [22, 16, 48, 64, 32]},
 'unetbootin': {},
 'usb-creator-kde': {},
 'utilities-energy-monitor': {},
 'utilities-file-archiver': {},
 'utilities-log-viewer': {},
 'utilities-system-monitor': {},
 'utilities-terminal': {},
 'utilities-terminal-symbolic': {},
 'veracrypt': {},
 'viber': {'com.viber.Viber': [48]},
 'virt-manager': {},
 'virt-manager-symbolic': {},
 'virtualbox': {},
 'vlc': {'org.videolan.VLC': [48]},
 'vlc-symbolic': {},
 'vokoscreen': {},
 'vvave': {'org.kde.vvave': [16, 48]},
 'wayland': {},
 'wine': {'org.winehq.Wine': [48]},
 'wine-symbolic': {},
 'words': {},
 'xchat': {},
 'xine': {},
 'xmind': {},
 'xorg': {},
 'xterm': {},
 'xterm-color': {},
 'yakuake': {},
 'yakuake-symbolic': {},
 'yandex-browser': {},
 'yast': {},
 'yast-control-center': {},
 'yast-installation': {},
 'yast-sw_single': {},
 'yast-upgrade': {},
 'zanshin': {}}
make[3]: Leaving directory '/build/reproducible-path/kf6-breeze-icons-6.11.0/obj-arm-linux-gnueabihf'
[ 25%] Built target create-app-symlinks
make  -f icons/CMakeFiles/breeze-generate-24px-versions.dir/build.make icons/CMakeFiles/breeze-generate-24px-versions.dir/depend
make[3]: Entering directory '/build/reproducible-path/kf6-breeze-icons-6.11.0/obj-arm-linux-gnueabihf'
cd /build/reproducible-path/kf6-breeze-icons-6.11.0/obj-arm-linux-gnueabihf && /usr/bin/cmake -E cmake_depends "Unix Makefiles" /build/reproducible-path/kf6-breeze-icons-6.11.0 /build/reproducible-path/kf6-breeze-icons-6.11.0/icons /build/reproducible-path/kf6-breeze-icons-6.11.0/obj-arm-linux-gnueabihf /build/reproducible-path/kf6-breeze-icons-6.11.0/obj-arm-linux-gnueabihf/icons /build/reproducible-path/kf6-breeze-icons-6.11.0/obj-arm-linux-gnueabihf/icons/CMakeFiles/breeze-generate-24px-versions.dir/DependInfo.cmake "--color="
make[3]: Leaving directory '/build/reproducible-path/kf6-breeze-icons-6.11.0/obj-arm-linux-gnueabihf'
make  -f icons/CMakeFiles/breeze-generate-24px-versions.dir/build.make icons/CMakeFiles/breeze-generate-24px-versions.dir/build
make[3]: Entering directory '/build/reproducible-path/kf6-breeze-icons-6.11.0/obj-arm-linux-gnueabihf'
[ 29%] Generating 24px icons
cd /build/reproducible-path/kf6-breeze-icons-6.11.0/obj-arm-linux-gnueabihf/icons && /usr/bin/python3 /build/reproducible-path/kf6-breeze-icons-6.11.0/generate-24px-versions.py /build/reproducible-path/kf6-breeze-icons-6.11.0/icons /build/reproducible-path/kf6-breeze-icons-6.11.0/obj-arm-linux-gnueabihf/breeze-icons
mations/22/process-working.svg SKIPPED: not square or incorrect viewBox
viewBox="0 0 22 330"
22/preferences-system-network-ethernet.svg SKIPPED: not square or incorrect viewBox
viewBox="0 0 5.8210625 5.8210625"
motes/22/face-confused.svg SKIPPED: not square or incorrect viewBox
viewBox="0 0 5.8208332 5.8208335"
motes/22/face-clown.svg SKIPPED: not square or incorrect viewBox
viewBox="0 0 5.8208332 5.8208335"
motes/22/face-crying.svg SKIPPED: not square or incorrect viewBox
viewBox="0 0 5.8208332 5.8208335"
motes/22/face-pirate.svg SKIPPED: not square or incorrect viewBox
viewBox="0 0 5.8208332 5.8208335"
motes/22/face-smile-big.svg SKIPPED: not square or incorrect viewBox
viewBox="0 0 5.8208332 5.8208335"
motes/22/face-worried.svg SKIPPED: not square or incorrect viewBox
viewBox="0 0 5.8208332 5.8208335"
motes/22/face-devilish.svg SKIPPED: not square or incorrect viewBox
viewBox="0 0 5.8208332 5.8208335"
motes/22/face-angry.svg SKIPPED: not square or incorrect viewBox
viewBox="0 0 5.8208332 5.8208335"
motes/22/face-kiss.svg SKIPPED: not square or incorrect viewBox
viewBox="0 0 5.8208332 5.8208335"
motes/22/face-sleeping.svg SKIPPED: not square or incorrect viewBox
viewBox="0 0 5.8208332 5.8208335"
motes/22/face-angel.svg SKIPPED: not square or incorrect viewBox
viewBox="0 0 5.8208332 5.8208335"
motes/22/face-raspberry.svg SKIPPED: not square or incorrect viewBox
viewBox="0 0 5.8208332 5.8208335"
motes/22/face-surprise.svg SKIPPED: not square or incorrect viewBox
viewBox="0 0 5.8208332 5.8208335"
motes/22/food-cake.svg SKIPPED: not square or incorrect viewBox
viewBox="0 0 5.8208332 5.8208335"
motes/22/face-smile-grin.svg SKIPPED: not square or incorrect viewBox
viewBox="0 0 5.8208332 5.8208335"
motes/22/drink-martini.svg SKIPPED: not square or incorrect viewBox
viewBox="0 0 5.8208332 5.8208335"
motes/22/face-cool.svg SKIPPED: not square or incorrect viewBox
viewBox="0 0 5.8208332 5.8208335"
motes/22/face-ninja.svg SKIPPED: not square or incorrect viewBox
viewBox="0 0 5.8208332 5.8208335"
motes/22/drink-beer.svg SKIPPED: not square or incorrect viewBox
viewBox="0 0 5.8208332 5.8208335"
motes/22/face-laughing.svg SKIPPED: not square or incorrect viewBox
viewBox="0 0 5.8208332 5.8208335"
motes/22/face-smile.svg SKIPPED: not square or incorrect viewBox
viewBox="0 0 5.8208332 5.8208335"
motes/22/face-in-love.svg SKIPPED: not square or incorrect viewBox
viewBox="0 0 5.8208332 5.8208335"
motes/22/face-quiet.svg SKIPPED: not square or incorrect viewBox
viewBox="0 0 5.8208332 5.8208335"
motes/22/face-wink.svg SKIPPED: not square or incorrect viewBox
viewBox="0 0 5.8208332 5.8208335"
motes/22/face-yawn.svg SKIPPED: not square or incorrect viewBox
viewBox="0 0 5.8208332 5.8208335"
motes/22/face-sad.svg SKIPPED: not square or incorrect viewBox
viewBox="0 0 5.8208332 5.8208335"
motes/22/face-hug-left.svg SKIPPED: not square or incorrect viewBox
viewBox="0 0 5.8208332 5.8208335"
motes/22/face-glasses.svg SKIPPED: not square or incorrect viewBox
viewBox="0 0 5.8208332 5.8208335"
motes/22/face-sick.svg SKIPPED: not square or incorrect viewBox
viewBox="0 0 5.8208332 5.8208335"
motes/22/face-plain.svg SKIPPED: not square or incorrect viewBox
viewBox="0 0 5.8208332 5.8208335"
motes/22/face-embarrassed.svg SKIPPED: not square or incorrect viewBox
viewBox="0 0 5.8208332 5.8208335"
motes/22/face-hug-right.svg SKIPPED: not square or incorrect viewBox
viewBox="0 0 5.8208332 5.8208335"
motes/22/face-smirk.svg SKIPPED: not square or incorrect viewBox
viewBox="0 0 5.8208332 5.8208335"
motes/22/face-uncertain.svg SKIPPED: not square or incorrect viewBox
viewBox="0 0 5.8208332 5.8208335"
22/elisa.svg SKIPPED: not square or incorrect viewBox
viewBox="0 0 5.8208 5.8208"
22/hotspot-symbolic.svg SKIPPED: not square or incorrect viewBox
viewBox="0 0 5.821 5.821"
mimetypes/22/application-x-root.svg SKIPPED: not square or incorrect viewBox
viewBox="0 0 5.8208332 5.8208335"
make[3]: Leaving directory '/build/reproducible-path/kf6-breeze-icons-6.11.0/obj-arm-linux-gnueabihf'
[ 29%] Built target breeze-generate-24px-versions
make  -f src/tools/CMakeFiles/generate-symbolic-dark_autogen_timestamp_deps.dir/build.make src/tools/CMakeFiles/generate-symbolic-dark_autogen_timestamp_deps.dir/depend
make[3]: Entering directory '/build/reproducible-path/kf6-breeze-icons-6.11.0/obj-arm-linux-gnueabihf'
cd /build/reproducible-path/kf6-breeze-icons-6.11.0/obj-arm-linux-gnueabihf && /usr/bin/cmake -E cmake_depends "Unix Makefiles" /build/reproducible-path/kf6-breeze-icons-6.11.0 /build/reproducible-path/kf6-breeze-icons-6.11.0/src/tools /build/reproducible-path/kf6-breeze-icons-6.11.0/obj-arm-linux-gnueabihf /build/reproducible-path/kf6-breeze-icons-6.11.0/obj-arm-linux-gnueabihf/src/tools /build/reproducible-path/kf6-breeze-icons-6.11.0/obj-arm-linux-gnueabihf/src/tools/CMakeFiles/generate-symbolic-dark_autogen_timestamp_deps.dir/DependInfo.cmake "--color="
make[3]: Leaving directory '/build/reproducible-path/kf6-breeze-icons-6.11.0/obj-arm-linux-gnueabihf'
make  -f src/tools/CMakeFiles/generate-symbolic-dark_autogen_timestamp_deps.dir/build.make src/tools/CMakeFiles/generate-symbolic-dark_autogen_timestamp_deps.dir/build
make[3]: Entering directory '/build/reproducible-path/kf6-breeze-icons-6.11.0/obj-arm-linux-gnueabihf'
make[3]: Nothing to be done for 'src/tools/CMakeFiles/generate-symbolic-dark_autogen_timestamp_deps.dir/build'.
make[3]: Leaving directory '/build/reproducible-path/kf6-breeze-icons-6.11.0/obj-arm-linux-gnueabihf'
[ 29%] Built target generate-symbolic-dark_autogen_timestamp_deps
make  -f src/tools/CMakeFiles/generate-symbolic-dark_autogen.dir/build.make src/tools/CMakeFiles/generate-symbolic-dark_autogen.dir/depend
make[3]: Entering directory '/build/reproducible-path/kf6-breeze-icons-6.11.0/obj-arm-linux-gnueabihf'
cd /build/reproducible-path/kf6-breeze-icons-6.11.0/obj-arm-linux-gnueabihf && /usr/bin/cmake -E cmake_depends "Unix Makefiles" /build/reproducible-path/kf6-breeze-icons-6.11.0 /build/reproducible-path/kf6-breeze-icons-6.11.0/src/tools /build/reproducible-path/kf6-breeze-icons-6.11.0/obj-arm-linux-gnueabihf /build/reproducible-path/kf6-breeze-icons-6.11.0/obj-arm-linux-gnueabihf/src/tools /build/reproducible-path/kf6-breeze-icons-6.11.0/obj-arm-linux-gnueabihf/src/tools/CMakeFiles/generate-symbolic-dark_autogen.dir/DependInfo.cmake "--color="
make[3]: Leaving directory '/build/reproducible-path/kf6-breeze-icons-6.11.0/obj-arm-linux-gnueabihf'
make  -f src/tools/CMakeFiles/generate-symbolic-dark_autogen.dir/build.make src/tools/CMakeFiles/generate-symbolic-dark_autogen.dir/build
make[3]: Entering directory '/build/reproducible-path/kf6-breeze-icons-6.11.0/obj-arm-linux-gnueabihf'
[ 33%] Automatic MOC for target generate-symbolic-dark
cd /build/reproducible-path/kf6-breeze-icons-6.11.0/obj-arm-linux-gnueabihf/src/tools && /usr/bin/cmake -E cmake_autogen /build/reproducible-path/kf6-breeze-icons-6.11.0/obj-arm-linux-gnueabihf/src/tools/CMakeFiles/generate-symbolic-dark_autogen.dir/AutogenInfo.json None
AutoGen: Refreshing parse cache because it doesn't exist.
AutoMoc: Generating "SRC:/obj-arm-linux-gnueabihf/src/tools/generate-symbolic-dark_autogen/moc_predefs.h", because it doesn't exist.
/usr/bin/c++ -std=c++20 -dM -E -c /usr/share/cmake-3.31/Modules/CMakeCXXCompilerABI.cpp -DQT_CORE_LIB -DQT_NO_CAST_FROM_ASCII -DQT_NO_CAST_FROM_BYTEARRAY -DQT_NO_CAST_TO_ASCII -DQT_NO_DEBUG -DQT_NO_FOREACH -DQT_NO_KEYWORDS -DQT_NO_NARROWING_CONVERSIONS_IN_CONNECT -DQT_NO_URL_CAST_FROM_STRING -DQT_STRICT_ITERATORS -DQT_USE_QSTRINGBUILDER -D_GNU_SOURCE -D_LARGEFILE64_SOURCE -I/build/reproducible-path/kf6-breeze-icons-6.11.0/obj-arm-linux-gnueabihf/src/tools -I/build/reproducible-path/kf6-breeze-icons-6.11.0/src/tools -I/usr/include/arm-linux-gnueabihf/qt6/QtCore -I/usr/include/arm-linux-gnueabihf/qt6 -I/usr/lib/arm-linux-gnueabihf/qt6/mkspecs/linux-g++ -I/usr/include/c++/14 -I/usr/include/arm-linux-gnueabihf/c++/14 -I/usr/include/c++/14/backward -I/usr/lib/gcc/arm-linux-gnueabihf/14/include -I/usr/local/include -I/usr/include/arm-linux-gnueabihf -I/usr/include
AutoGen: Parsing "SRC:/src/tools/generate-symbolic-dark.cpp"
AutoMoc: Generating MOC compilation "SRC:/obj-arm-linux-gnueabihf/src/tools/generate-symbolic-dark_autogen/mocs_compilation.cpp"
AutoMoc: Merging MOC dependencies into "SRC:/obj-arm-linux-gnueabihf/src/tools/generate-symbolic-dark_autogen/deps"
AutoGen: Writing the parse cache file "SRC:/obj-arm-linux-gnueabihf/src/tools/CMakeFiles/generate-symbolic-dark_autogen.dir/ParseCache.txt"
AutoGen: Writing the settings file "SRC:/obj-arm-linux-gnueabihf/src/tools/CMakeFiles/generate-symbolic-dark_autogen.dir/AutogenUsed.txt"
cd /build/reproducible-path/kf6-breeze-icons-6.11.0/obj-arm-linux-gnueabihf/src/tools && /usr/bin/cmake -E touch /build/reproducible-path/kf6-breeze-icons-6.11.0/obj-arm-linux-gnueabihf/src/tools/generate-symbolic-dark_autogen/timestamp
make[3]: Leaving directory '/build/reproducible-path/kf6-breeze-icons-6.11.0/obj-arm-linux-gnueabihf'
[ 33%] Built target generate-symbolic-dark_autogen
make  -f src/tools/CMakeFiles/generate-symbolic-dark.dir/build.make src/tools/CMakeFiles/generate-symbolic-dark.dir/depend
make[3]: Entering directory '/build/reproducible-path/kf6-breeze-icons-6.11.0/obj-arm-linux-gnueabihf'
cd /build/reproducible-path/kf6-breeze-icons-6.11.0/obj-arm-linux-gnueabihf && /usr/bin/cmake -E cmake_depends "Unix Makefiles" /build/reproducible-path/kf6-breeze-icons-6.11.0 /build/reproducible-path/kf6-breeze-icons-6.11.0/src/tools /build/reproducible-path/kf6-breeze-icons-6.11.0/obj-arm-linux-gnueabihf /build/reproducible-path/kf6-breeze-icons-6.11.0/obj-arm-linux-gnueabihf/src/tools /build/reproducible-path/kf6-breeze-icons-6.11.0/obj-arm-linux-gnueabihf/src/tools/CMakeFiles/generate-symbolic-dark.dir/DependInfo.cmake "--color="
Dependencies file "src/tools/generate-symbolic-dark_autogen/deps" is newer than depends file "/build/reproducible-path/kf6-breeze-icons-6.11.0/obj-arm-linux-gnueabihf/src/tools/CMakeFiles/generate-symbolic-dark.dir/compiler_depend.internal".
Consolidate compiler generated dependencies of target generate-symbolic-dark
make[3]: Leaving directory '/build/reproducible-path/kf6-breeze-icons-6.11.0/obj-arm-linux-gnueabihf'
make  -f src/tools/CMakeFiles/generate-symbolic-dark.dir/build.make src/tools/CMakeFiles/generate-symbolic-dark.dir/build
make[3]: Entering directory '/build/reproducible-path/kf6-breeze-icons-6.11.0/obj-arm-linux-gnueabihf'
[ 37%] Building CXX object src/tools/CMakeFiles/generate-symbolic-dark.dir/generate-symbolic-dark_autogen/mocs_compilation.cpp.o
cd /build/reproducible-path/kf6-breeze-icons-6.11.0/obj-arm-linux-gnueabihf/src/tools && /usr/bin/c++ -DQT_CORE_LIB -DQT_NO_CAST_FROM_ASCII -DQT_NO_CAST_FROM_BYTEARRAY -DQT_NO_CAST_TO_ASCII -DQT_NO_DEBUG -DQT_NO_FOREACH -DQT_NO_KEYWORDS -DQT_NO_NARROWING_CONVERSIONS_IN_CONNECT -DQT_NO_URL_CAST_FROM_STRING -DQT_STRICT_ITERATORS -DQT_USE_QSTRINGBUILDER -D_GNU_SOURCE -D_LARGEFILE64_SOURCE -I/build/reproducible-path/kf6-breeze-icons-6.11.0/obj-arm-linux-gnueabihf/src/tools -I/build/reproducible-path/kf6-breeze-icons-6.11.0/src/tools -I/build/reproducible-path/kf6-breeze-icons-6.11.0/obj-arm-linux-gnueabihf/src/tools/generate-symbolic-dark_autogen/include -isystem /usr/include/arm-linux-gnueabihf/qt6/QtCore -isystem /usr/include/arm-linux-gnueabihf/qt6 -isystem /usr/lib/arm-linux-gnueabihf/qt6/mkspecs/linux-g++ -g -O2 -ffile-prefix-map=/build/reproducible-path/kf6-breeze-icons-6.11.0=. -fstack-protector-strong -fstack-clash-protection -Wformat -Werror=format-security -D_LARGEFILE_SOURCE -D_FILE_OFFSET_BITS=64 -D_TIME_BITS=64 -Wdate-time -D_FORTIFY_SOURCE=2 -fno-operator-names -fno-exceptions -Wall -Wextra -Wcast-align -Wchar-subscripts -Wformat-security -Wno-long-long -Wpointer-arith -Wundef -Wnon-virtual-dtor -Woverloaded-virtual -Werror=return-type -Werror=init-self -Werror=undef -Wvla -Wdate-time -Wsuggest-override -Wlogical-op -pedantic -Wzero-as-null-pointer-constant -Wmissing-include-dirs -std=c++20 -fPIE -fvisibility=hidden -fvisibility-inlines-hidden -MD -MT src/tools/CMakeFiles/generate-symbolic-dark.dir/generate-symbolic-dark_autogen/mocs_compilation.cpp.o -MF CMakeFiles/generate-symbolic-dark.dir/generate-symbolic-dark_autogen/mocs_compilation.cpp.o.d -o CMakeFiles/generate-symbolic-dark.dir/generate-symbolic-dark_autogen/mocs_compilation.cpp.o -c /build/reproducible-path/kf6-breeze-icons-6.11.0/obj-arm-linux-gnueabihf/src/tools/generate-symbolic-dark_autogen/mocs_compilation.cpp
[ 41%] Building CXX object src/tools/CMakeFiles/generate-symbolic-dark.dir/generate-symbolic-dark.cpp.o
cd /build/reproducible-path/kf6-breeze-icons-6.11.0/obj-arm-linux-gnueabihf/src/tools && /usr/bin/c++ -DQT_CORE_LIB -DQT_NO_CAST_FROM_ASCII -DQT_NO_CAST_FROM_BYTEARRAY -DQT_NO_CAST_TO_ASCII -DQT_NO_DEBUG -DQT_NO_FOREACH -DQT_NO_KEYWORDS -DQT_NO_NARROWING_CONVERSIONS_IN_CONNECT -DQT_NO_URL_CAST_FROM_STRING -DQT_STRICT_ITERATORS -DQT_USE_QSTRINGBUILDER -D_GNU_SOURCE -D_LARGEFILE64_SOURCE -I/build/reproducible-path/kf6-breeze-icons-6.11.0/obj-arm-linux-gnueabihf/src/tools -I/build/reproducible-path/kf6-breeze-icons-6.11.0/src/tools -I/build/reproducible-path/kf6-breeze-icons-6.11.0/obj-arm-linux-gnueabihf/src/tools/generate-symbolic-dark_autogen/include -isystem /usr/include/arm-linux-gnueabihf/qt6/QtCore -isystem /usr/include/arm-linux-gnueabihf/qt6 -isystem /usr/lib/arm-linux-gnueabihf/qt6/mkspecs/linux-g++ -g -O2 -ffile-prefix-map=/build/reproducible-path/kf6-breeze-icons-6.11.0=. -fstack-protector-strong -fstack-clash-protection -Wformat -Werror=format-security -D_LARGEFILE_SOURCE -D_FILE_OFFSET_BITS=64 -D_TIME_BITS=64 -Wdate-time -D_FORTIFY_SOURCE=2 -fno-operator-names -fno-exceptions -Wall -Wextra -Wcast-align -Wchar-subscripts -Wformat-security -Wno-long-long -Wpointer-arith -Wundef -Wnon-virtual-dtor -Woverloaded-virtual -Werror=return-type -Werror=init-self -Werror=undef -Wvla -Wdate-time -Wsuggest-override -Wlogical-op -pedantic -Wzero-as-null-pointer-constant -Wmissing-include-dirs -std=c++20 -fPIE -fvisibility=hidden -fvisibility-inlines-hidden -MD -MT src/tools/CMakeFiles/generate-symbolic-dark.dir/generate-symbolic-dark.cpp.o -MF CMakeFiles/generate-symbolic-dark.dir/generate-symbolic-dark.cpp.o.d -o CMakeFiles/generate-symbolic-dark.dir/generate-symbolic-dark.cpp.o -c /build/reproducible-path/kf6-breeze-icons-6.11.0/src/tools/generate-symbolic-dark.cpp
[ 45%] Linking CXX executable ../../bin/generate-symbolic-dark
cd /build/reproducible-path/kf6-breeze-icons-6.11.0/obj-arm-linux-gnueabihf/src/tools && /usr/bin/cmake -E cmake_link_script CMakeFiles/generate-symbolic-dark.dir/link.txt --verbose=1
/usr/bin/c++ -g -O2 -ffile-prefix-map=/build/reproducible-path/kf6-breeze-icons-6.11.0=. -fstack-protector-strong -fstack-clash-protection -Wformat -Werror=format-security -D_LARGEFILE_SOURCE -D_FILE_OFFSET_BITS=64 -D_TIME_BITS=64 -Wdate-time -D_FORTIFY_SOURCE=2 -fno-operator-names -fno-exceptions -Wall -Wextra -Wcast-align -Wchar-subscripts -Wformat-security -Wno-long-long -Wpointer-arith -Wundef -Wnon-virtual-dtor -Woverloaded-virtual -Werror=return-type -Werror=init-self -Werror=undef -Wvla -Wdate-time -Wsuggest-override -Wlogical-op -pedantic -Wzero-as-null-pointer-constant -Wmissing-include-dirs -Wl,--enable-new-dtags -Wl,-z,relro -Wl,-z,now "CMakeFiles/generate-symbolic-dark.dir/generate-symbolic-dark_autogen/mocs_compilation.cpp.o" "CMakeFiles/generate-symbolic-dark.dir/generate-symbolic-dark.cpp.o" -o ../../bin/generate-symbolic-dark  /usr/lib/arm-linux-gnueabihf/libQt6Core.so.6.8.2
make[3]: Leaving directory '/build/reproducible-path/kf6-breeze-icons-6.11.0/obj-arm-linux-gnueabihf'
[ 50%] Built target generate-symbolic-dark
make  -f icons-dark/CMakeFiles/breeze-generate-symbolic-dark.dir/build.make icons-dark/CMakeFiles/breeze-generate-symbolic-dark.dir/depend
make[3]: Entering directory '/build/reproducible-path/kf6-breeze-icons-6.11.0/obj-arm-linux-gnueabihf'
cd /build/reproducible-path/kf6-breeze-icons-6.11.0/obj-arm-linux-gnueabihf && /usr/bin/cmake -E cmake_depends "Unix Makefiles" /build/reproducible-path/kf6-breeze-icons-6.11.0 /build/reproducible-path/kf6-breeze-icons-6.11.0/icons-dark /build/reproducible-path/kf6-breeze-icons-6.11.0/obj-arm-linux-gnueabihf /build/reproducible-path/kf6-breeze-icons-6.11.0/obj-arm-linux-gnueabihf/icons-dark /build/reproducible-path/kf6-breeze-icons-6.11.0/obj-arm-linux-gnueabihf/icons-dark/CMakeFiles/breeze-generate-symbolic-dark.dir/DependInfo.cmake "--color="
make[3]: Leaving directory '/build/reproducible-path/kf6-breeze-icons-6.11.0/obj-arm-linux-gnueabihf'
make  -f icons-dark/CMakeFiles/breeze-generate-symbolic-dark.dir/build.make icons-dark/CMakeFiles/breeze-generate-symbolic-dark.dir/build
make[3]: Entering directory '/build/reproducible-path/kf6-breeze-icons-6.11.0/obj-arm-linux-gnueabihf'
[ 54%] Generating symbolic dark icons
cd /build/reproducible-path/kf6-breeze-icons-6.11.0/obj-arm-linux-gnueabihf/icons-dark && ../bin/generate-symbolic-dark /build/reproducible-path/kf6-breeze-icons-6.11.0/icons /build/reproducible-path/kf6-breeze-icons-6.11.0/obj-arm-linux-gnueabihf/breeze-icons-dark
Detected locale "C" with character encoding "ANSI_X3.4-1968", which is not UTF-8.
Qt depends on a UTF-8 locale, and has switched to "C.UTF-8" instead.
If this causes problems, reconfigure your locale. See the locale(1) manual
for more information.
make[3]: Leaving directory '/build/reproducible-path/kf6-breeze-icons-6.11.0/obj-arm-linux-gnueabihf'
[ 54%] Built target breeze-generate-symbolic-dark
make  -f icons-dark/CMakeFiles/breeze-generate-24px-versions-dark.dir/build.make icons-dark/CMakeFiles/breeze-generate-24px-versions-dark.dir/depend
make[3]: Entering directory '/build/reproducible-path/kf6-breeze-icons-6.11.0/obj-arm-linux-gnueabihf'
cd /build/reproducible-path/kf6-breeze-icons-6.11.0/obj-arm-linux-gnueabihf && /usr/bin/cmake -E cmake_depends "Unix Makefiles" /build/reproducible-path/kf6-breeze-icons-6.11.0 /build/reproducible-path/kf6-breeze-icons-6.11.0/icons-dark /build/reproducible-path/kf6-breeze-icons-6.11.0/obj-arm-linux-gnueabihf /build/reproducible-path/kf6-breeze-icons-6.11.0/obj-arm-linux-gnueabihf/icons-dark /build/reproducible-path/kf6-breeze-icons-6.11.0/obj-arm-linux-gnueabihf/icons-dark/CMakeFiles/breeze-generate-24px-versions-dark.dir/DependInfo.cmake "--color="
make[3]: Leaving directory '/build/reproducible-path/kf6-breeze-icons-6.11.0/obj-arm-linux-gnueabihf'
make  -f icons-dark/CMakeFiles/breeze-generate-24px-versions-dark.dir/build.make icons-dark/CMakeFiles/breeze-generate-24px-versions-dark.dir/build
make[3]: Entering directory '/build/reproducible-path/kf6-breeze-icons-6.11.0/obj-arm-linux-gnueabihf'
[ 58%] Generating 24px icons-dark
cd /build/reproducible-path/kf6-breeze-icons-6.11.0/obj-arm-linux-gnueabihf/icons-dark && /usr/bin/python3 /build/reproducible-path/kf6-breeze-icons-6.11.0/generate-24px-versions.py /build/reproducible-path/kf6-breeze-icons-6.11.0/icons-dark /build/reproducible-path/kf6-breeze-icons-6.11.0/obj-arm-linux-gnueabihf/breeze-icons-dark /build/reproducible-path/kf6-breeze-icons-6.11.0/obj-arm-linux-gnueabihf/breeze-icons-dark
22/process-working.svg SKIPPED: not square or incorrect viewBox
viewBox="0 0 22 330"
22/hotspot-symbolic.svg SKIPPED: not square or incorrect viewBox
viewBox="0 0 5.821 5.821"
make[3]: Leaving directory '/build/reproducible-path/kf6-breeze-icons-6.11.0/obj-arm-linux-gnueabihf'
[ 58%] Built target breeze-generate-24px-versions-dark
make  -f src/tools/CMakeFiles/qrcAlias_autogen_timestamp_deps.dir/build.make src/tools/CMakeFiles/qrcAlias_autogen_timestamp_deps.dir/depend
make[3]: Entering directory '/build/reproducible-path/kf6-breeze-icons-6.11.0/obj-arm-linux-gnueabihf'
cd /build/reproducible-path/kf6-breeze-icons-6.11.0/obj-arm-linux-gnueabihf && /usr/bin/cmake -E cmake_depends "Unix Makefiles" /build/reproducible-path/kf6-breeze-icons-6.11.0 /build/reproducible-path/kf6-breeze-icons-6.11.0/src/tools /build/reproducible-path/kf6-breeze-icons-6.11.0/obj-arm-linux-gnueabihf /build/reproducible-path/kf6-breeze-icons-6.11.0/obj-arm-linux-gnueabihf/src/tools /build/reproducible-path/kf6-breeze-icons-6.11.0/obj-arm-linux-gnueabihf/src/tools/CMakeFiles/qrcAlias_autogen_timestamp_deps.dir/DependInfo.cmake "--color="
make[3]: Leaving directory '/build/reproducible-path/kf6-breeze-icons-6.11.0/obj-arm-linux-gnueabihf'
make  -f src/tools/CMakeFiles/qrcAlias_autogen_timestamp_deps.dir/build.make src/tools/CMakeFiles/qrcAlias_autogen_timestamp_deps.dir/build
make[3]: Entering directory '/build/reproducible-path/kf6-breeze-icons-6.11.0/obj-arm-linux-gnueabihf'
make[3]: Nothing to be done for 'src/tools/CMakeFiles/qrcAlias_autogen_timestamp_deps.dir/build'.
make[3]: Leaving directory '/build/reproducible-path/kf6-breeze-icons-6.11.0/obj-arm-linux-gnueabihf'
[ 58%] Built target qrcAlias_autogen_timestamp_deps
make  -f src/tools/CMakeFiles/qrcAlias_autogen.dir/build.make src/tools/CMakeFiles/qrcAlias_autogen.dir/depend
make[3]: Entering directory '/build/reproducible-path/kf6-breeze-icons-6.11.0/obj-arm-linux-gnueabihf'
cd /build/reproducible-path/kf6-breeze-icons-6.11.0/obj-arm-linux-gnueabihf && /usr/bin/cmake -E cmake_depends "Unix Makefiles" /build/reproducible-path/kf6-breeze-icons-6.11.0 /build/reproducible-path/kf6-breeze-icons-6.11.0/src/tools /build/reproducible-path/kf6-breeze-icons-6.11.0/obj-arm-linux-gnueabihf /build/reproducible-path/kf6-breeze-icons-6.11.0/obj-arm-linux-gnueabihf/src/tools /build/reproducible-path/kf6-breeze-icons-6.11.0/obj-arm-linux-gnueabihf/src/tools/CMakeFiles/qrcAlias_autogen.dir/DependInfo.cmake "--color="
make[3]: Leaving directory '/build/reproducible-path/kf6-breeze-icons-6.11.0/obj-arm-linux-gnueabihf'
make  -f src/tools/CMakeFiles/qrcAlias_autogen.dir/build.make src/tools/CMakeFiles/qrcAlias_autogen.dir/build
make[3]: Entering directory '/build/reproducible-path/kf6-breeze-icons-6.11.0/obj-arm-linux-gnueabihf'
[ 62%] Automatic MOC for target qrcAlias
cd /build/reproducible-path/kf6-breeze-icons-6.11.0/obj-arm-linux-gnueabihf/src/tools && /usr/bin/cmake -E cmake_autogen /build/reproducible-path/kf6-breeze-icons-6.11.0/obj-arm-linux-gnueabihf/src/tools/CMakeFiles/qrcAlias_autogen.dir/AutogenInfo.json None
AutoGen: Refreshing parse cache because it doesn't exist.
AutoMoc: Generating "SRC:/obj-arm-linux-gnueabihf/src/tools/qrcAlias_autogen/moc_predefs.h", because it doesn't exist.
/usr/bin/c++ -std=c++20 -dM -E -c /usr/share/cmake-3.31/Modules/CMakeCXXCompilerABI.cpp -DQT_CORE_LIB -DQT_NO_CAST_FROM_ASCII -DQT_NO_CAST_FROM_BYTEARRAY -DQT_NO_CAST_TO_ASCII -DQT_NO_DEBUG -DQT_NO_FOREACH -DQT_NO_KEYWORDS -DQT_NO_NARROWING_CONVERSIONS_IN_CONNECT -DQT_NO_URL_CAST_FROM_STRING -DQT_STRICT_ITERATORS -DQT_USE_QSTRINGBUILDER -D_GNU_SOURCE -D_LARGEFILE64_SOURCE -I/build/reproducible-path/kf6-breeze-icons-6.11.0/obj-arm-linux-gnueabihf/src/tools -I/build/reproducible-path/kf6-breeze-icons-6.11.0/src/tools -I/usr/include/arm-linux-gnueabihf/qt6/QtCore -I/usr/include/arm-linux-gnueabihf/qt6 -I/usr/lib/arm-linux-gnueabihf/qt6/mkspecs/linux-g++ -I/usr/include/c++/14 -I/usr/include/arm-linux-gnueabihf/c++/14 -I/usr/include/c++/14/backward -I/usr/lib/gcc/arm-linux-gnueabihf/14/include -I/usr/local/include -I/usr/include/arm-linux-gnueabihf -I/usr/include
AutoGen: Parsing "SRC:/src/tools/qrcAlias.cpp"
AutoMoc: Generating MOC compilation "SRC:/obj-arm-linux-gnueabihf/src/tools/qrcAlias_autogen/mocs_compilation.cpp"
AutoMoc: Merging MOC dependencies into "SRC:/obj-arm-linux-gnueabihf/src/tools/qrcAlias_autogen/deps"
AutoGen: Writing the parse cache file "SRC:/obj-arm-linux-gnueabihf/src/tools/CMakeFiles/qrcAlias_autogen.dir/ParseCache.txt"
AutoGen: Writing the settings file "SRC:/obj-arm-linux-gnueabihf/src/tools/CMakeFiles/qrcAlias_autogen.dir/AutogenUsed.txt"
cd /build/reproducible-path/kf6-breeze-icons-6.11.0/obj-arm-linux-gnueabihf/src/tools && /usr/bin/cmake -E touch /build/reproducible-path/kf6-breeze-icons-6.11.0/obj-arm-linux-gnueabihf/src/tools/qrcAlias_autogen/timestamp
make[3]: Leaving directory '/build/reproducible-path/kf6-breeze-icons-6.11.0/obj-arm-linux-gnueabihf'
[ 62%] Built target qrcAlias_autogen
make  -f src/tools/CMakeFiles/qrcAlias.dir/build.make src/tools/CMakeFiles/qrcAlias.dir/depend
make[3]: Entering directory '/build/reproducible-path/kf6-breeze-icons-6.11.0/obj-arm-linux-gnueabihf'
cd /build/reproducible-path/kf6-breeze-icons-6.11.0/obj-arm-linux-gnueabihf && /usr/bin/cmake -E cmake_depends "Unix Makefiles" /build/reproducible-path/kf6-breeze-icons-6.11.0 /build/reproducible-path/kf6-breeze-icons-6.11.0/src/tools /build/reproducible-path/kf6-breeze-icons-6.11.0/obj-arm-linux-gnueabihf /build/reproducible-path/kf6-breeze-icons-6.11.0/obj-arm-linux-gnueabihf/src/tools /build/reproducible-path/kf6-breeze-icons-6.11.0/obj-arm-linux-gnueabihf/src/tools/CMakeFiles/qrcAlias.dir/DependInfo.cmake "--color="
Dependencies file "src/tools/qrcAlias_autogen/deps" is newer than depends file "/build/reproducible-path/kf6-breeze-icons-6.11.0/obj-arm-linux-gnueabihf/src/tools/CMakeFiles/qrcAlias.dir/compiler_depend.internal".
Consolidate compiler generated dependencies of target qrcAlias
make[3]: Leaving directory '/build/reproducible-path/kf6-breeze-icons-6.11.0/obj-arm-linux-gnueabihf'
make  -f src/tools/CMakeFiles/qrcAlias.dir/build.make src/tools/CMakeFiles/qrcAlias.dir/build
make[3]: Entering directory '/build/reproducible-path/kf6-breeze-icons-6.11.0/obj-arm-linux-gnueabihf'
[ 66%] Building CXX object src/tools/CMakeFiles/qrcAlias.dir/qrcAlias_autogen/mocs_compilation.cpp.o
cd /build/reproducible-path/kf6-breeze-icons-6.11.0/obj-arm-linux-gnueabihf/src/tools && /usr/bin/c++ -DQT_CORE_LIB -DQT_NO_CAST_FROM_ASCII -DQT_NO_CAST_FROM_BYTEARRAY -DQT_NO_CAST_TO_ASCII -DQT_NO_DEBUG -DQT_NO_FOREACH -DQT_NO_KEYWORDS -DQT_NO_NARROWING_CONVERSIONS_IN_CONNECT -DQT_NO_URL_CAST_FROM_STRING -DQT_STRICT_ITERATORS -DQT_USE_QSTRINGBUILDER -D_GNU_SOURCE -D_LARGEFILE64_SOURCE -I/build/reproducible-path/kf6-breeze-icons-6.11.0/obj-arm-linux-gnueabihf/src/tools -I/build/reproducible-path/kf6-breeze-icons-6.11.0/src/tools -I/build/reproducible-path/kf6-breeze-icons-6.11.0/obj-arm-linux-gnueabihf/src/tools/qrcAlias_autogen/include -isystem /usr/include/arm-linux-gnueabihf/qt6/QtCore -isystem /usr/include/arm-linux-gnueabihf/qt6 -isystem /usr/lib/arm-linux-gnueabihf/qt6/mkspecs/linux-g++ -g -O2 -ffile-prefix-map=/build/reproducible-path/kf6-breeze-icons-6.11.0=. -fstack-protector-strong -fstack-clash-protection -Wformat -Werror=format-security -D_LARGEFILE_SOURCE -D_FILE_OFFSET_BITS=64 -D_TIME_BITS=64 -Wdate-time -D_FORTIFY_SOURCE=2 -fno-operator-names -fno-exceptions -Wall -Wextra -Wcast-align -Wchar-subscripts -Wformat-security -Wno-long-long -Wpointer-arith -Wundef -Wnon-virtual-dtor -Woverloaded-virtual -Werror=return-type -Werror=init-self -Werror=undef -Wvla -Wdate-time -Wsuggest-override -Wlogical-op -pedantic -Wzero-as-null-pointer-constant -Wmissing-include-dirs -std=c++20 -fPIE -fvisibility=hidden -fvisibility-inlines-hidden -MD -MT src/tools/CMakeFiles/qrcAlias.dir/qrcAlias_autogen/mocs_compilation.cpp.o -MF CMakeFiles/qrcAlias.dir/qrcAlias_autogen/mocs_compilation.cpp.o.d -o CMakeFiles/qrcAlias.dir/qrcAlias_autogen/mocs_compilation.cpp.o -c /build/reproducible-path/kf6-breeze-icons-6.11.0/obj-arm-linux-gnueabihf/src/tools/qrcAlias_autogen/mocs_compilation.cpp
[ 70%] Building CXX object src/tools/CMakeFiles/qrcAlias.dir/qrcAlias.cpp.o
cd /build/reproducible-path/kf6-breeze-icons-6.11.0/obj-arm-linux-gnueabihf/src/tools && /usr/bin/c++ -DQT_CORE_LIB -DQT_NO_CAST_FROM_ASCII -DQT_NO_CAST_FROM_BYTEARRAY -DQT_NO_CAST_TO_ASCII -DQT_NO_DEBUG -DQT_NO_FOREACH -DQT_NO_KEYWORDS -DQT_NO_NARROWING_CONVERSIONS_IN_CONNECT -DQT_NO_URL_CAST_FROM_STRING -DQT_STRICT_ITERATORS -DQT_USE_QSTRINGBUILDER -D_GNU_SOURCE -D_LARGEFILE64_SOURCE -I/build/reproducible-path/kf6-breeze-icons-6.11.0/obj-arm-linux-gnueabihf/src/tools -I/build/reproducible-path/kf6-breeze-icons-6.11.0/src/tools -I/build/reproducible-path/kf6-breeze-icons-6.11.0/obj-arm-linux-gnueabihf/src/tools/qrcAlias_autogen/include -isystem /usr/include/arm-linux-gnueabihf/qt6/QtCore -isystem /usr/include/arm-linux-gnueabihf/qt6 -isystem /usr/lib/arm-linux-gnueabihf/qt6/mkspecs/linux-g++ -g -O2 -ffile-prefix-map=/build/reproducible-path/kf6-breeze-icons-6.11.0=. -fstack-protector-strong -fstack-clash-protection -Wformat -Werror=format-security -D_LARGEFILE_SOURCE -D_FILE_OFFSET_BITS=64 -D_TIME_BITS=64 -Wdate-time -D_FORTIFY_SOURCE=2 -fno-operator-names -fno-exceptions -Wall -Wextra -Wcast-align -Wchar-subscripts -Wformat-security -Wno-long-long -Wpointer-arith -Wundef -Wnon-virtual-dtor -Woverloaded-virtual -Werror=return-type -Werror=init-self -Werror=undef -Wvla -Wdate-time -Wsuggest-override -Wlogical-op -pedantic -Wzero-as-null-pointer-constant -Wmissing-include-dirs -std=c++20 -fPIE -fvisibility=hidden -fvisibility-inlines-hidden -MD -MT src/tools/CMakeFiles/qrcAlias.dir/qrcAlias.cpp.o -MF CMakeFiles/qrcAlias.dir/qrcAlias.cpp.o.d -o CMakeFiles/qrcAlias.dir/qrcAlias.cpp.o -c /build/reproducible-path/kf6-breeze-icons-6.11.0/src/tools/qrcAlias.cpp
[ 75%] Linking CXX executable ../../bin/qrcAlias
cd /build/reproducible-path/kf6-breeze-icons-6.11.0/obj-arm-linux-gnueabihf/src/tools && /usr/bin/cmake -E cmake_link_script CMakeFiles/qrcAlias.dir/link.txt --verbose=1
/usr/bin/c++ -g -O2 -ffile-prefix-map=/build/reproducible-path/kf6-breeze-icons-6.11.0=. -fstack-protector-strong -fstack-clash-protection -Wformat -Werror=format-security -D_LARGEFILE_SOURCE -D_FILE_OFFSET_BITS=64 -D_TIME_BITS=64 -Wdate-time -D_FORTIFY_SOURCE=2 -fno-operator-names -fno-exceptions -Wall -Wextra -Wcast-align -Wchar-subscripts -Wformat-security -Wno-long-long -Wpointer-arith -Wundef -Wnon-virtual-dtor -Woverloaded-virtual -Werror=return-type -Werror=init-self -Werror=undef -Wvla -Wdate-time -Wsuggest-override -Wlogical-op -pedantic -Wzero-as-null-pointer-constant -Wmissing-include-dirs -Wl,--enable-new-dtags -Wl,-z,relro -Wl,-z,now CMakeFiles/qrcAlias.dir/qrcAlias_autogen/mocs_compilation.cpp.o CMakeFiles/qrcAlias.dir/qrcAlias.cpp.o -o ../../bin/qrcAlias  /usr/lib/arm-linux-gnueabihf/libQt6Core.so.6.8.2
make[3]: Leaving directory '/build/reproducible-path/kf6-breeze-icons-6.11.0/obj-arm-linux-gnueabihf'
[ 79%] Built target qrcAlias
make  -f src/lib/CMakeFiles/KF6BreezeIcons.dir/build.make src/lib/CMakeFiles/KF6BreezeIcons.dir/depend
make[3]: Entering directory '/build/reproducible-path/kf6-breeze-icons-6.11.0/obj-arm-linux-gnueabihf'
[ 83%] Generating breeze-icons.qrc
cd /build/reproducible-path/kf6-breeze-icons-6.11.0/obj-arm-linux-gnueabihf/src/lib && ../../bin/qrcAlias -o /build/reproducible-path/kf6-breeze-icons-6.11.0/obj-arm-linux-gnueabihf/src/lib/breeze-icons.qrc /build/reproducible-path/kf6-breeze-icons-6.11.0/icons /build/reproducible-path/kf6-breeze-icons-6.11.0/obj-arm-linux-gnueabihf/breeze-icons
Detected locale "C" with character encoding "ANSI_X3.4-1968", which is not UTF-8.
Qt depends on a UTF-8 locale, and has switched to "C.UTF-8" instead.
If this causes problems, reconfigure your locale. See the locale(1) manual
for more information.
cd /build/reproducible-path/kf6-breeze-icons-6.11.0/obj-arm-linux-gnueabihf/src/lib && ../../bin/qrcAlias -o /build/reproducible-path/kf6-breeze-icons-6.11.0/obj-arm-linux-gnueabihf/src/lib/breeze-icons.qrc.dark.dummy /build/reproducible-path/kf6-breeze-icons-6.11.0/icons-dark /build/reproducible-path/kf6-breeze-icons-6.11.0/obj-arm-linux-gnueabihf/breeze-icons-dark
Detected locale "C" with character encoding "ANSI_X3.4-1968", which is not UTF-8.
Qt depends on a UTF-8 locale, and has switched to "C.UTF-8" instead.
If this causes problems, reconfigure your locale. See the locale(1) manual
for more information.
cd /build/reproducible-path/kf6-breeze-icons-6.11.0/obj-arm-linux-gnueabihf/src/lib && /usr/lib/qt6/libexec/rcc --binary -o /build/reproducible-path/kf6-breeze-icons-6.11.0/obj-arm-linux-gnueabihf/src/lib/breeze-icons.rcc /build/reproducible-path/kf6-breeze-icons-6.11.0/obj-arm-linux-gnueabihf/src/lib/breeze-icons.qrc
Detected locale "C" with character encoding "ANSI_X3.4-1968", which is not UTF-8.
Qt depends on a UTF-8 locale, and has switched to "C.UTF-8" instead.
If this causes problems, reconfigure your locale. See the locale(1) manual
for more information.
[ 87%] Generating qrc_breeze-icons.cpp
cd /build/reproducible-path/kf6-breeze-icons-6.11.0/obj-arm-linux-gnueabihf/src/lib && /usr/lib/qt6/libexec/rcc --root /icons/breeze --name breeze-icons --output /build/reproducible-path/kf6-breeze-icons-6.11.0/obj-arm-linux-gnueabihf/src/lib/qrc_breeze-icons.cpp /build/reproducible-path/kf6-breeze-icons-6.11.0/obj-arm-linux-gnueabihf/src/lib/breeze-icons.qrc
Detected locale "C" with character encoding "ANSI_X3.4-1968", which is not UTF-8.
Qt depends on a UTF-8 locale, and has switched to "C.UTF-8" instead.
If this causes problems, reconfigure your locale. See the locale(1) manual
for more information.
cd /build/reproducible-path/kf6-breeze-icons-6.11.0/obj-arm-linux-gnueabihf && /usr/bin/cmake -E cmake_depends "Unix Makefiles" /build/reproducible-path/kf6-breeze-icons-6.11.0 /build/reproducible-path/kf6-breeze-icons-6.11.0/src/lib /build/reproducible-path/kf6-breeze-icons-6.11.0/obj-arm-linux-gnueabihf /build/reproducible-path/kf6-breeze-icons-6.11.0/obj-arm-linux-gnueabihf/src/lib /build/reproducible-path/kf6-breeze-icons-6.11.0/obj-arm-linux-gnueabihf/src/lib/CMakeFiles/KF6BreezeIcons.dir/DependInfo.cmake "--color="
make[3]: Leaving directory '/build/reproducible-path/kf6-breeze-icons-6.11.0/obj-arm-linux-gnueabihf'
make  -f src/lib/CMakeFiles/KF6BreezeIcons.dir/build.make src/lib/CMakeFiles/KF6BreezeIcons.dir/build
make[3]: Entering directory '/build/reproducible-path/kf6-breeze-icons-6.11.0/obj-arm-linux-gnueabihf'
[ 91%] Building CXX object src/lib/CMakeFiles/KF6BreezeIcons.dir/qrc_breeze-icons.cpp.o
cd /build/reproducible-path/kf6-breeze-icons-6.11.0/obj-arm-linux-gnueabihf/src/lib && /usr/bin/c++ -DKF6BreezeIcons_EXPORTS -DQT_CORE_LIB -DQT_GUI_LIB -DQT_NO_CAST_FROM_ASCII -DQT_NO_CAST_FROM_BYTEARRAY -DQT_NO_CAST_TO_ASCII -DQT_NO_DEBUG -DQT_NO_FOREACH -DQT_NO_KEYWORDS -DQT_NO_NARROWING_CONVERSIONS_IN_CONNECT -DQT_NO_URL_CAST_FROM_STRING -DQT_STRICT_ITERATORS -DQT_USE_QSTRINGBUILDER -D_GNU_SOURCE -D_LARGEFILE64_SOURCE -I/build/reproducible-path/kf6-breeze-icons-6.11.0/obj-arm-linux-gnueabihf/src/lib -I/build/reproducible-path/kf6-breeze-icons-6.11.0/src/lib -isystem /usr/include/arm-linux-gnueabihf/qt6/QtGui -isystem /usr/include/arm-linux-gnueabihf/qt6 -isystem /usr/include/arm-linux-gnueabihf/qt6/QtCore -isystem /usr/lib/arm-linux-gnueabihf/qt6/mkspecs/linux-g++ -g -O2 -ffile-prefix-map=/build/reproducible-path/kf6-breeze-icons-6.11.0=. -fstack-protector-strong -fstack-clash-protection -Wformat -Werror=format-security -D_LARGEFILE_SOURCE -D_FILE_OFFSET_BITS=64 -D_TIME_BITS=64 -Wdate-time -D_FORTIFY_SOURCE=2 -fno-operator-names -fno-exceptions -Wall -Wextra -Wcast-align -Wchar-subscripts -Wformat-security -Wno-long-long -Wpointer-arith -Wundef -Wnon-virtual-dtor -Woverloaded-virtual -Werror=return-type -Werror=init-self -Werror=undef -Wvla -Wdate-time -Wsuggest-override -Wlogical-op -pedantic -Wzero-as-null-pointer-constant -Wmissing-include-dirs -std=c++20 -fPIC -fvisibility=hidden -fvisibility-inlines-hidden -MD -MT src/lib/CMakeFiles/KF6BreezeIcons.dir/qrc_breeze-icons.cpp.o -MF CMakeFiles/KF6BreezeIcons.dir/qrc_breeze-icons.cpp.o.d -o CMakeFiles/KF6BreezeIcons.dir/qrc_breeze-icons.cpp.o -c /build/reproducible-path/kf6-breeze-icons-6.11.0/obj-arm-linux-gnueabihf/src/lib/qrc_breeze-icons.cpp
virtual memory exhausted: Cannot allocate memory
make[3]: *** [src/lib/CMakeFiles/KF6BreezeIcons.dir/build.make:93: src/lib/CMakeFiles/KF6BreezeIcons.dir/qrc_breeze-icons.cpp.o] Error 1
make[3]: Leaving directory '/build/reproducible-path/kf6-breeze-icons-6.11.0/obj-arm-linux-gnueabihf'
make[2]: *** [CMakeFiles/Makefile2:755: src/lib/CMakeFiles/KF6BreezeIcons.dir/all] Error 2
make[2]: Leaving directory '/build/reproducible-path/kf6-breeze-icons-6.11.0/obj-arm-linux-gnueabihf'
make[1]: *** [Makefile:149: all] Error 2
make[1]: Leaving directory '/build/reproducible-path/kf6-breeze-icons-6.11.0/obj-arm-linux-gnueabihf'
dh_auto_build: error: cd obj-arm-linux-gnueabihf && make -j1 "INSTALL=install --strip-program=true" VERBOSE=1 returned exit code 2
make: *** [debian/rules:6: binary] Error 25
dpkg-buildpackage: error: debian/rules binary subprocess returned exit status 2
I: copying local configuration
E: Failed autobuilding of package
I: unmounting dev/ptmx filesystem
I: unmounting dev/pts filesystem
I: unmounting dev/shm filesystem
I: unmounting proc filesystem
I: unmounting sys filesystem
I: cleaning the build env 
I: removing directory /srv/workspace/pbuilder/25425 and its subdirectories
Tue Mar 18 04:11:34 UTC 2025  W: No second build log, what happened?