Wed Mar  5 01:31:04 UTC 2025  I: starting to build bpftune/unstable/armhf on jenkins on '2025-03-05 01:30'
Wed Mar  5 01:31:04 UTC 2025  I: The jenkins build log is/was available at https://jenkins.debian.net/userContent/reproducible/debian/build_service/armhf_11/10254/console.log
Wed Mar  5 01:31:04 UTC 2025  I: Downloading source for unstable/bpftune=0.0~git20250121.d38eac6-1
--2025-03-05 01:31:04--  http://deb.debian.org/debian/pool/main/b/bpftune/bpftune_0.0%7egit20250121.d38eac6-1.dsc
Connecting to 46.16.76.132:3128... connected.
Proxy request sent, awaiting response... 200 OK
Length: 2177 (2.1K) [text/prs.lines.tag]
Saving to: ‘bpftune_0.0~git20250121.d38eac6-1.dsc’

     0K ..                                                    100%  317M=0s

2025-03-05 01:31:04 (317 MB/s) - ‘bpftune_0.0~git20250121.d38eac6-1.dsc’ saved [2177/2177]

Wed Mar  5 01:31:04 UTC 2025  I: bpftune_0.0~git20250121.d38eac6-1.dsc
-----BEGIN PGP SIGNED MESSAGE-----
Hash: SHA512

Format: 3.0 (quilt)
Source: bpftune
Binary: bpftune, libbpftune0, libbpftune-dev
Architecture: any
Version: 0.0~git20250121.d38eac6-1
Maintainer: Sudip Mukherjee <sudipm.mukherjee@gmail.com>
Homepage: https://github.com/oracle/bpftune/tree/main
Standards-Version: 4.7.0
Vcs-Browser: https://salsa.debian.org/debian/bpftune
Vcs-Git: https://salsa.debian.org/debian/bpftune.git
Build-Depends: debhelper-compat (= 13), python3-docutils, libbpf-dev, libcap-dev, clang, llvm, bpftool, libnl-3-dev, libnl-route-3-dev, iperf3
Package-List:
 bpftune deb admin optional arch=any
 libbpftune-dev deb libdevel optional arch=any
 libbpftune0 deb libs optional arch=any
Checksums-Sha1:
 bdff7d494dd02f537365f343b317b8a6e7bdd815 808120 bpftune_0.0~git20250121.d38eac6.orig.tar.xz
 d5dec3063865b18ed7e4550b5c5e03c30bdd6f24 4004 bpftune_0.0~git20250121.d38eac6-1.debian.tar.xz
Checksums-Sha256:
 30787e18d060589270c66379a889e2e3acc619f58e75eaf2cfa2f2dd77daebb0 808120 bpftune_0.0~git20250121.d38eac6.orig.tar.xz
 7cd082d5894d0a980e14f2130ae3f1a828f6bc158cc6357adf65098d1ccc3733 4004 bpftune_0.0~git20250121.d38eac6-1.debian.tar.xz
Files:
 c9d1439fd18f53eb8ca2ecff69b1951d 808120 bpftune_0.0~git20250121.d38eac6.orig.tar.xz
 36b569f4aebee8ea75b5602e17f7cdb5 4004 bpftune_0.0~git20250121.d38eac6-1.debian.tar.xz

-----BEGIN PGP SIGNATURE-----

iQIzBAEBCgAdFiEEuDQJkCg9jZvBlJrHR5mjUUbRKzUFAmevoSYACgkQR5mjUUbR
KzXVPw/+NI7CFxIzIzbR2W+rO2qNhVjky7laaHJ09sAUFzWaus4U2+0CWrYSw0PS
QyDG9ZPe2OUJb4opO0kqrlynwerJ1Runs0s08U8T2mrIaxQAcLcvlRQ1GEFkl68/
MUu9kGHOy+EmD0FBOWSKi/Oqfs6C5Q8kY8l/wBpUFiarGJJaOvqDgRBH+qoqakLR
SpfPGYsb8hxJU7BBJeST2sehpsXOjuus76FFYRVd7AFyAtBfLxILxL5BRqUEHeI2
1Vf9HriOdWH9PraplcFrV0WczCkd6WbS0XK3GBJ+yTkPW6D6Q4SCd0DQ2Uco/ONd
03d4W9/nF+mSX/5E46ApwSwEhcLtvlF640+2j4URtl1+/LnqJob4/gTRv3zr7+em
koZA5JEqk0aL9CyuAy15QwM4QlgTiWnZ2EgopflogUb+pmePpyunMo91nuOkG56c
XsBR/i8xRqIUn5moVgGeNQ4zVQq2FKZ6D6Cmh1+KpQp0bR3pTWVMmyZbJDWUYNmQ
2qf1+5zEgkajiJMFC4Z0dYqWtOO8AMH6EU+DFIKMZ61RMRh3bah9nSfz1C3emT1D
O1YIJ1BgNO5mdTqKjgAo3WparB1wDoa6I639J6j6aXe2q2cJCl8KyRTa1P1iYuqT
hivuAF5khP39LThTUiKIaMNOmwHOo5T5YEHMk4BmLKRpvW6Mj+Y=
=G+U1
-----END PGP SIGNATURE-----
Wed Mar  5 01:31:04 UTC 2025  I: Checking whether the package is not for us
Wed Mar  5 01:31:04 UTC 2025  I: Starting 1st build on remote node wbq0-armhf-rb.debian.net.
Wed Mar  5 01:31:04 UTC 2025  I: Preparing to do remote build '1' on wbq0-armhf-rb.debian.net.
Wed Mar  5 01:34:52 UTC 2025  I: Deleting $TMPDIR on wbq0-armhf-rb.debian.net.
I: pbuilder: network access will be disabled during build
I: Current time: Tue Mar  4 13:31:12 -12 2025
I: pbuilder-time-stamp: 1741138272
I: Building the build Environment
I: extracting base tarball [/var/cache/pbuilder/unstable-reproducible-base.tgz]
I: copying local configuration
W: --override-config is not set; not updating apt.conf Read the manpage for details.
I: mounting /proc filesystem
I: mounting /sys filesystem
I: creating /{dev,run}/shm
I: mounting /dev/pts filesystem
I: redirecting /dev/ptmx to /dev/pts/ptmx
I: policy-rc.d already exists
I: Copying source file
I: copying [bpftune_0.0~git20250121.d38eac6-1.dsc]
I: copying [./bpftune_0.0~git20250121.d38eac6.orig.tar.xz]
I: copying [./bpftune_0.0~git20250121.d38eac6-1.debian.tar.xz]
I: Extracting source
dpkg-source: warning: cannot verify inline signature for ./bpftune_0.0~git20250121.d38eac6-1.dsc: unsupported subcommand
dpkg-source: info: extracting bpftune in bpftune-0.0~git20250121.d38eac6
dpkg-source: info: unpacking bpftune_0.0~git20250121.d38eac6.orig.tar.xz
dpkg-source: info: unpacking bpftune_0.0~git20250121.d38eac6-1.debian.tar.xz
dpkg-source: info: using patch list from debian/patches/series
dpkg-source: info: applying remove-local.patch
I: Not using root during the build.
I: Installing the build-deps
I: user script /srv/workspace/pbuilder/9175/tmp/hooks/D02_print_environment starting
I: set
  BUILDDIR='/build/reproducible-path'
  BUILDUSERGECOS='first user,first room,first work-phone,first home-phone,first other'
  BUILDUSERNAME='pbuilder1'
  BUILD_ARCH='armhf'
  DEBIAN_FRONTEND='noninteractive'
  DEB_BUILD_OPTIONS='buildinfo=+all reproducible=+all parallel=3 '
  DISTRIBUTION='unstable'
  HOME='/root'
  HOST_ARCH='armhf'
  IFS=' 	
  '
  INVOCATION_ID='6543e7d3793241f4b79e34d6bc51abc8'
  LANG='C'
  LANGUAGE='en_US:en'
  LC_ALL='C'
  MAIL='/var/mail/root'
  OPTIND='1'
  PATH='/usr/sbin:/usr/bin:/sbin:/bin:/usr/games'
  PBCURRENTCOMMANDLINEOPERATION='build'
  PBUILDER_OPERATION='build'
  PBUILDER_PKGDATADIR='/usr/share/pbuilder'
  PBUILDER_PKGLIBDIR='/usr/lib/pbuilder'
  PBUILDER_SYSCONFDIR='/etc'
  PPID='9175'
  PS1='# '
  PS2='> '
  PS4='+ '
  PWD='/'
  SHELL='/bin/bash'
  SHLVL='2'
  SUDO_COMMAND='/usr/bin/timeout -k 18.1h 18h /usr/bin/ionice -c 3 /usr/bin/nice /usr/sbin/pbuilder --build --configfile /srv/reproducible-results/rbuild-debian/r-b-build.Qhl0WzUz/pbuilderrc_EshP --distribution unstable --hookdir /etc/pbuilder/first-build-hooks --debbuildopts -b --basetgz /var/cache/pbuilder/unstable-reproducible-base.tgz --buildresult /srv/reproducible-results/rbuild-debian/r-b-build.Qhl0WzUz/b1 --logfile b1/build.log bpftune_0.0~git20250121.d38eac6-1.dsc'
  SUDO_GID='113'
  SUDO_UID='107'
  SUDO_USER='jenkins'
  TERM='unknown'
  TZ='/usr/share/zoneinfo/Etc/GMT+12'
  USER='root'
  _='/usr/bin/systemd-run'
  http_proxy='http://10.0.0.15:3142/'
I: uname -a
  Linux wbq0 6.1.0-31-armmp #1 SMP Debian 6.1.128-1 (2025-02-07) armv7l GNU/Linux
I: ls -l /bin
  lrwxrwxrwx 1 root root 7 Nov 22 14:40 /bin -> usr/bin
I: user script /srv/workspace/pbuilder/9175/tmp/hooks/D02_print_environment finished
 -> Attempting to satisfy build-dependencies
 -> Creating pbuilder-satisfydepends-dummy package
Package: pbuilder-satisfydepends-dummy
Version: 0.invalid.0
Architecture: armhf
Maintainer: Debian Pbuilder Team <pbuilder-maint@lists.alioth.debian.org>
Description: Dummy package to satisfy dependencies with aptitude - created by pbuilder
 This package was created automatically by pbuilder to satisfy the
 build-dependencies of the package being currently built.
Depends: debhelper-compat (= 13), python3-docutils, libbpf-dev, libcap-dev, clang, llvm, bpftool, libnl-3-dev, libnl-route-3-dev, iperf3
dpkg-deb: building package 'pbuilder-satisfydepends-dummy' in '/tmp/satisfydepends-aptitude/pbuilder-satisfydepends-dummy.deb'.
Selecting previously unselected package pbuilder-satisfydepends-dummy.
(Reading database ... 19508 files and directories currently installed.)
Preparing to unpack .../pbuilder-satisfydepends-dummy.deb ...
Unpacking pbuilder-satisfydepends-dummy (0.invalid.0) ...
dpkg: pbuilder-satisfydepends-dummy: dependency problems, but configuring anyway as you requested:
 pbuilder-satisfydepends-dummy depends on debhelper-compat (= 13); however:
  Package debhelper-compat is not installed.
 pbuilder-satisfydepends-dummy depends on python3-docutils; however:
  Package python3-docutils is not installed.
 pbuilder-satisfydepends-dummy depends on libbpf-dev; however:
  Package libbpf-dev is not installed.
 pbuilder-satisfydepends-dummy depends on libcap-dev; however:
  Package libcap-dev is not installed.
 pbuilder-satisfydepends-dummy depends on clang; however:
  Package clang is not installed.
 pbuilder-satisfydepends-dummy depends on llvm; however:
  Package llvm is not installed.
 pbuilder-satisfydepends-dummy depends on bpftool; however:
  Package bpftool is not installed.
 pbuilder-satisfydepends-dummy depends on libnl-3-dev; however:
  Package libnl-3-dev is not installed.
 pbuilder-satisfydepends-dummy depends on libnl-route-3-dev; however:
  Package libnl-route-3-dev is not installed.
 pbuilder-satisfydepends-dummy depends on iperf3; however:
  Package iperf3 is not installed.

Setting up pbuilder-satisfydepends-dummy (0.invalid.0) ...
Reading package lists...
Building dependency tree...
Reading state information...
Initializing package states...
Writing extended state information...
Building tag database...
pbuilder-satisfydepends-dummy is already installed at the requested version (0.invalid.0)
pbuilder-satisfydepends-dummy is already installed at the requested version (0.invalid.0)
The following NEW packages will be installed:
  autoconf{a} automake{a} autopoint{a} autotools-dev{a} bpftool{a} bsdextrautils{a} clang{a} clang-19{a} debhelper{a} dh-autoreconf{a} dh-strip-nondeterminism{a} docutils-common{a} dwz{a} file{a} gettext{a} gettext-base{a} groff-base{a} intltool-debian{a} iperf3{a} libarchive-zip-perl{a} libbpf-dev{a} libbpf1{a} libbrotli1{a} libcap-dev{a} libclang-common-19-dev{a} libclang-cpp19{a} libclang1-19{a} libcom-err2{a} libcurl4t64{a} libdebhelper-perl{a} libedit2{a} libelf-dev{a} libelf1t64{a} libexpat1{a} libffi8{a} libfile-stripnondeterminism-perl{a} libgc1{a} libgnutls30t64{a} libgssapi-krb5-2{a} libicu72{a} libidn2-0{a} libiperf0{a} libk5crypto3{a} libkeyutils1{a} libkrb5-3{a} libkrb5support0{a} libldap2{a} libllvm19{a} libmagic-mgc{a} libmagic1t64{a} libnghttp2-14{a} libnghttp3-9{a} libnl-3-200{a} libnl-3-dev{a} libnl-route-3-200{a} libnl-route-3-dev{a} libobjc-14-dev{a} libobjc4{a} libp11-kit0{a} libpfm4{a} libpipeline1{a} libpsl5t64{a} libpython3-stdlib{a} libpython3.13-minimal{a} libpython3.13-stdlib{a} libreadline8t64{a} librtmp1{a} libsasl2-2{a} libsasl2-modules-db{a} libsctp1{a} libssh2-1t64{a} libtasn1-6{a} libtool{a} libuchardet0{a} libunistring5{a} libxml2{a} libz3-4{a} libzstd-dev{a} llvm{a} llvm-19{a} llvm-19-linker-tools{a} llvm-19-runtime{a} llvm-runtime{a} m4{a} man-db{a} media-types{a} netbase{a} po-debconf{a} python3{a} python3-docutils{a} python3-minimal{a} python3-roman{a} python3.13{a} python3.13-minimal{a} readline-common{a} sensible-utils{a} sgml-base{a} tzdata{a} xml-core{a} zlib1g-dev{a} 
The following packages are RECOMMENDED but will NOT be installed:
  binfmt-support ca-certificates curl krb5-locales libarchive-cpio-perl libclang-rt-19-dev libldap-common libltdl-dev libmail-sendmail-perl libpaper-utils libsasl2-modules llvm-19-dev lynx publicsuffix python3-pil python3-pygments systemd wget 
0 packages upgraded, 100 newly installed, 0 to remove and 0 not upgraded.
Need to get 101 MB of archives. After unpacking 429 MB will be used.
Writing extended state information...
Get: 1 http://deb.debian.org/debian unstable/main armhf libsctp1 armhf 1.0.21+dfsg-1 [25.1 kB]
Get: 2 http://deb.debian.org/debian unstable/main armhf libiperf0 armhf 3.18-2 [92.0 kB]
Get: 3 http://deb.debian.org/debian unstable/main armhf iperf3 armhf 3.18-2 [37.0 kB]
Get: 4 http://deb.debian.org/debian unstable/main armhf libpython3.13-minimal armhf 3.13.2-1 [845 kB]
Get: 5 http://deb.debian.org/debian unstable/main armhf libexpat1 armhf 2.6.4-1 [83.5 kB]
Get: 6 http://deb.debian.org/debian unstable/main armhf python3.13-minimal armhf 3.13.2-1 [1842 kB]
Get: 7 http://deb.debian.org/debian unstable/main armhf python3-minimal armhf 3.13.2-2 [27.1 kB]
Get: 8 http://deb.debian.org/debian unstable/main armhf media-types all 12.0.0 [28.9 kB]
Get: 9 http://deb.debian.org/debian unstable/main armhf netbase all 6.4 [12.8 kB]
Get: 10 http://deb.debian.org/debian unstable/main armhf tzdata all 2025a-2 [259 kB]
Get: 11 http://deb.debian.org/debian unstable/main armhf libffi8 armhf 3.4.7-1 [20.3 kB]
Get: 12 http://deb.debian.org/debian unstable/main armhf readline-common all 8.2-6 [69.4 kB]
Get: 13 http://deb.debian.org/debian unstable/main armhf libreadline8t64 armhf 8.2-6 [146 kB]
Get: 14 http://deb.debian.org/debian unstable/main armhf libpython3.13-stdlib armhf 3.13.2-1 [1853 kB]
Get: 15 http://deb.debian.org/debian unstable/main armhf python3.13 armhf 3.13.2-1 [745 kB]
Get: 16 http://deb.debian.org/debian unstable/main armhf libpython3-stdlib armhf 3.13.2-2 [10.1 kB]
Get: 17 http://deb.debian.org/debian unstable/main armhf python3 armhf 3.13.2-2 [28.1 kB]
Get: 18 http://deb.debian.org/debian unstable/main armhf sgml-base all 1.31 [15.4 kB]
Get: 19 http://deb.debian.org/debian unstable/main armhf sensible-utils all 0.0.24 [24.8 kB]
Get: 20 http://deb.debian.org/debian unstable/main armhf libmagic-mgc armhf 1:5.45-3+b1 [314 kB]
Get: 21 http://deb.debian.org/debian unstable/main armhf libmagic1t64 armhf 1:5.45-3+b1 [98.5 kB]
Get: 22 http://deb.debian.org/debian unstable/main armhf file armhf 1:5.45-3+b1 [42.3 kB]
Get: 23 http://deb.debian.org/debian unstable/main armhf gettext-base armhf 0.23.1-1 [238 kB]
Get: 24 http://deb.debian.org/debian unstable/main armhf libuchardet0 armhf 0.0.8-1+b2 [65.6 kB]
Get: 25 http://deb.debian.org/debian unstable/main armhf groff-base armhf 1.23.0-7 [1095 kB]
Get: 26 http://deb.debian.org/debian unstable/main armhf bsdextrautils armhf 2.40.4-5 [84.9 kB]
Get: 27 http://deb.debian.org/debian unstable/main armhf libpipeline1 armhf 1.5.8-1 [35.0 kB]
Get: 28 http://deb.debian.org/debian unstable/main armhf man-db armhf 2.13.0-1 [1382 kB]
Get: 29 http://deb.debian.org/debian unstable/main armhf m4 armhf 1.4.19-5 [272 kB]
Get: 30 http://deb.debian.org/debian unstable/main armhf autoconf all 2.72-3 [493 kB]
Get: 31 http://deb.debian.org/debian unstable/main armhf autotools-dev all 20220109.1 [51.6 kB]
Get: 32 http://deb.debian.org/debian unstable/main armhf automake all 1:1.17-3 [862 kB]
Get: 33 http://deb.debian.org/debian unstable/main armhf autopoint all 0.23.1-1 [770 kB]
Get: 34 http://deb.debian.org/debian unstable/main armhf libelf1t64 armhf 0.192-4 [184 kB]
Get: 35 http://deb.debian.org/debian unstable/main armhf bpftool armhf 7.5.0+6.12.17-1 [1224 kB]
Get: 36 http://deb.debian.org/debian unstable/main armhf libedit2 armhf 3.1-20250104-1 [78.0 kB]
Get: 37 http://deb.debian.org/debian unstable/main armhf libicu72 armhf 72.1-6 [9086 kB]
Get: 38 http://deb.debian.org/debian unstable/main armhf libxml2 armhf 2.12.7+dfsg+really2.9.14-0.2+b2 [605 kB]
Get: 39 http://deb.debian.org/debian unstable/main armhf libz3-4 armhf 4.13.3-1 [7252 kB]
Get: 40 http://deb.debian.org/debian unstable/main armhf libllvm19 armhf 1:19.1.7-1+b1 [23.8 MB]
Get: 41 http://deb.debian.org/debian unstable/main armhf libclang-cpp19 armhf 1:19.1.7-1+b1 [11.6 MB]
Get: 42 http://deb.debian.org/debian unstable/main armhf libgc1 armhf 1:8.2.8-1 [236 kB]
Get: 43 http://deb.debian.org/debian unstable/main armhf libobjc4 armhf 14.2.0-17 [34.5 kB]
Get: 44 http://deb.debian.org/debian unstable/main armhf libobjc-14-dev armhf 14.2.0-17 [162 kB]
Get: 45 http://deb.debian.org/debian unstable/main armhf libclang-common-19-dev armhf 1:19.1.7-1+b1 [738 kB]
Get: 46 http://deb.debian.org/debian unstable/main armhf llvm-19-linker-tools armhf 1:19.1.7-1+b1 [1045 kB]
Get: 47 http://deb.debian.org/debian unstable/main armhf libclang1-19 armhf 1:19.1.7-1+b1 [6612 kB]
Get: 48 http://deb.debian.org/debian unstable/main armhf clang-19 armhf 1:19.1.7-1+b1 [111 kB]
Get: 49 http://deb.debian.org/debian unstable/main armhf clang armhf 1:19.0-63 [6244 B]
Get: 50 http://deb.debian.org/debian unstable/main armhf libdebhelper-perl all 13.24.1 [90.9 kB]
Get: 51 http://deb.debian.org/debian unstable/main armhf libtool all 2.5.4-3 [539 kB]
Get: 52 http://deb.debian.org/debian unstable/main armhf dh-autoreconf all 20 [17.1 kB]
Get: 53 http://deb.debian.org/debian unstable/main armhf libarchive-zip-perl all 1.68-1 [104 kB]
Get: 54 http://deb.debian.org/debian unstable/main armhf libfile-stripnondeterminism-perl all 1.14.1-2 [19.7 kB]
Get: 55 http://deb.debian.org/debian unstable/main armhf dh-strip-nondeterminism all 1.14.1-2 [8620 B]
Get: 56 http://deb.debian.org/debian unstable/main armhf dwz armhf 0.15-1+b2 [106 kB]
Get: 57 http://deb.debian.org/debian unstable/main armhf libunistring5 armhf 1.3-1 [444 kB]
Get: 58 http://deb.debian.org/debian unstable/main armhf gettext armhf 0.23.1-1 [1560 kB]
Get: 59 http://deb.debian.org/debian unstable/main armhf intltool-debian all 0.35.0+20060710.6 [22.9 kB]
Get: 60 http://deb.debian.org/debian unstable/main armhf po-debconf all 1.0.21+nmu1 [248 kB]
Get: 61 http://deb.debian.org/debian unstable/main armhf debhelper all 13.24.1 [920 kB]
Get: 62 http://deb.debian.org/debian unstable/main armhf xml-core all 0.19 [20.1 kB]
Get: 63 http://deb.debian.org/debian unstable/main armhf docutils-common all 0.21.2+dfsg-2 [128 kB]
Get: 64 http://deb.debian.org/debian unstable/main armhf libbpf1 armhf 1:1.5.0-2 [147 kB]
Get: 65 http://deb.debian.org/debian unstable/main armhf zlib1g-dev armhf 1:1.3.dfsg+really1.3.1-1+b1 [905 kB]
Get: 66 http://deb.debian.org/debian unstable/main armhf libzstd-dev armhf 1.5.6+dfsg-2 [326 kB]
Get: 67 http://deb.debian.org/debian unstable/main armhf libelf-dev armhf 0.192-4 [87.6 kB]
Get: 68 http://deb.debian.org/debian unstable/main armhf libbpf-dev armhf 1:1.5.0-2 [240 kB]
Get: 69 http://deb.debian.org/debian unstable/main armhf libbrotli1 armhf 1.1.0-2+b7 [284 kB]
Get: 70 http://deb.debian.org/debian unstable/main armhf libcap-dev armhf 1:2.73-4 [401 kB]
Get: 71 http://deb.debian.org/debian unstable/main armhf libcom-err2 armhf 1.47.2-1 [23.3 kB]
Get: 72 http://deb.debian.org/debian unstable/main armhf libkrb5support0 armhf 1.21.3-4 [30.3 kB]
Get: 73 http://deb.debian.org/debian unstable/main armhf libk5crypto3 armhf 1.21.3-4 [75.8 kB]
Get: 74 http://deb.debian.org/debian unstable/main armhf libkeyutils1 armhf 1.6.3-4 [8096 B]
Get: 75 http://deb.debian.org/debian unstable/main armhf libkrb5-3 armhf 1.21.3-4 [285 kB]
Get: 76 http://deb.debian.org/debian unstable/main armhf libgssapi-krb5-2 armhf 1.21.3-4 [116 kB]
Get: 77 http://deb.debian.org/debian unstable/main armhf libidn2-0 armhf 2.3.7-2+b1 [125 kB]
Get: 78 http://deb.debian.org/debian unstable/main armhf libsasl2-modules-db armhf 2.1.28+dfsg1-9 [18.5 kB]
Get: 79 http://deb.debian.org/debian unstable/main armhf libsasl2-2 armhf 2.1.28+dfsg1-9 [50.4 kB]
Get: 80 http://deb.debian.org/debian unstable/main armhf libldap2 armhf 2.6.9+dfsg-1 [167 kB]
Get: 81 http://deb.debian.org/debian unstable/main armhf libnghttp2-14 armhf 1.64.0-1 [62.9 kB]
Get: 82 http://deb.debian.org/debian unstable/main armhf libnghttp3-9 armhf 1.8.0-1 [59.9 kB]
Get: 83 http://deb.debian.org/debian unstable/main armhf libpsl5t64 armhf 0.21.2-1.1+b1 [55.8 kB]
Get: 84 http://deb.debian.org/debian unstable/main armhf libp11-kit0 armhf 0.25.5-3 [385 kB]
Get: 85 http://deb.debian.org/debian unstable/main armhf libtasn1-6 armhf 4.20.0-2 [44.4 kB]
Get: 86 http://deb.debian.org/debian unstable/main armhf libgnutls30t64 armhf 3.8.9-2 [1382 kB]
Get: 87 http://deb.debian.org/debian unstable/main armhf librtmp1 armhf 2.4+20151223.gitfa8646d.1-2+b5 [53.2 kB]
Get: 88 http://deb.debian.org/debian unstable/main armhf libssh2-1t64 armhf 1.11.1-1 [227 kB]
Get: 89 http://deb.debian.org/debian unstable/main armhf libcurl4t64 armhf 8.12.1-3 [320 kB]
Get: 90 http://deb.debian.org/debian unstable/main armhf libnl-3-200 armhf 3.7.0-0.3+b1 [52.0 kB]
Get: 91 http://deb.debian.org/debian unstable/main armhf libnl-3-dev armhf 3.7.0-0.3+b1 [94.6 kB]
Get: 92 http://deb.debian.org/debian unstable/main armhf libnl-route-3-200 armhf 3.7.0-0.3+b1 [154 kB]
Get: 93 http://deb.debian.org/debian unstable/main armhf libnl-route-3-dev armhf 3.7.0-0.3+b1 [181 kB]
Get: 94 http://deb.debian.org/debian unstable/main armhf libpfm4 armhf 4.13.0+git83-g91970fe-1 [56.5 kB]
Get: 95 http://deb.debian.org/debian unstable/main armhf llvm-19-runtime armhf 1:19.1.7-1+b1 [499 kB]
Get: 96 http://deb.debian.org/debian unstable/main armhf llvm-runtime armhf 1:19.0-63 [5904 B]
Get: 97 http://deb.debian.org/debian unstable/main armhf llvm-19 armhf 1:19.1.7-1+b1 [15.0 MB]
Get: 98 http://deb.debian.org/debian unstable/main armhf llvm armhf 1:19.0-63 [8328 B]
Get: 99 http://deb.debian.org/debian unstable/main armhf python3-roman all 5.0-1 [10.6 kB]
Get: 100 http://deb.debian.org/debian unstable/main armhf python3-docutils all 0.21.2+dfsg-2 [403 kB]
Fetched 101 MB in 11s (9310 kB/s)
Preconfiguring packages ...
Selecting previously unselected package libsctp1:armhf.
(Reading database ... 
(Reading database ... 5%
(Reading database ... 10%
(Reading database ... 15%
(Reading database ... 20%
(Reading database ... 25%
(Reading database ... 30%
(Reading database ... 35%
(Reading database ... 40%
(Reading database ... 45%
(Reading database ... 50%
(Reading database ... 55%
(Reading database ... 60%
(Reading database ... 65%
(Reading database ... 70%
(Reading database ... 75%
(Reading database ... 80%
(Reading database ... 85%
(Reading database ... 90%
(Reading database ... 95%
(Reading database ... 100%
(Reading database ... 19508 files and directories currently installed.)
Preparing to unpack .../0-libsctp1_1.0.21+dfsg-1_armhf.deb ...
Unpacking libsctp1:armhf (1.0.21+dfsg-1) ...
Selecting previously unselected package libiperf0:armhf.
Preparing to unpack .../1-libiperf0_3.18-2_armhf.deb ...
Unpacking libiperf0:armhf (3.18-2) ...
Selecting previously unselected package iperf3.
Preparing to unpack .../2-iperf3_3.18-2_armhf.deb ...
Unpacking iperf3 (3.18-2) ...
Selecting previously unselected package libpython3.13-minimal:armhf.
Preparing to unpack .../3-libpython3.13-minimal_3.13.2-1_armhf.deb ...
Unpacking libpython3.13-minimal:armhf (3.13.2-1) ...
Selecting previously unselected package libexpat1:armhf.
Preparing to unpack .../4-libexpat1_2.6.4-1_armhf.deb ...
Unpacking libexpat1:armhf (2.6.4-1) ...
Selecting previously unselected package python3.13-minimal.
Preparing to unpack .../5-python3.13-minimal_3.13.2-1_armhf.deb ...
Unpacking python3.13-minimal (3.13.2-1) ...
Setting up libpython3.13-minimal:armhf (3.13.2-1) ...
Setting up libexpat1:armhf (2.6.4-1) ...
Setting up python3.13-minimal (3.13.2-1) ...
Selecting previously unselected package python3-minimal.
(Reading database ... 
(Reading database ... 5%
(Reading database ... 10%
(Reading database ... 15%
(Reading database ... 20%
(Reading database ... 25%
(Reading database ... 30%
(Reading database ... 35%
(Reading database ... 40%
(Reading database ... 45%
(Reading database ... 50%
(Reading database ... 55%
(Reading database ... 60%
(Reading database ... 65%
(Reading database ... 70%
(Reading database ... 75%
(Reading database ... 80%
(Reading database ... 85%
(Reading database ... 90%
(Reading database ... 95%
(Reading database ... 100%
(Reading database ... 19869 files and directories currently installed.)
Preparing to unpack .../0-python3-minimal_3.13.2-2_armhf.deb ...
Unpacking python3-minimal (3.13.2-2) ...
Selecting previously unselected package media-types.
Preparing to unpack .../1-media-types_12.0.0_all.deb ...
Unpacking media-types (12.0.0) ...
Selecting previously unselected package netbase.
Preparing to unpack .../2-netbase_6.4_all.deb ...
Unpacking netbase (6.4) ...
Selecting previously unselected package tzdata.
Preparing to unpack .../3-tzdata_2025a-2_all.deb ...
Unpacking tzdata (2025a-2) ...
Selecting previously unselected package libffi8:armhf.
Preparing to unpack .../4-libffi8_3.4.7-1_armhf.deb ...
Unpacking libffi8:armhf (3.4.7-1) ...
Selecting previously unselected package readline-common.
Preparing to unpack .../5-readline-common_8.2-6_all.deb ...
Unpacking readline-common (8.2-6) ...
Selecting previously unselected package libreadline8t64:armhf.
Preparing to unpack .../6-libreadline8t64_8.2-6_armhf.deb ...
Adding 'diversion of /lib/arm-linux-gnueabihf/libhistory.so.8 to /lib/arm-linux-gnueabihf/libhistory.so.8.usr-is-merged by libreadline8t64'
Adding 'diversion of /lib/arm-linux-gnueabihf/libhistory.so.8.2 to /lib/arm-linux-gnueabihf/libhistory.so.8.2.usr-is-merged by libreadline8t64'
Adding 'diversion of /lib/arm-linux-gnueabihf/libreadline.so.8 to /lib/arm-linux-gnueabihf/libreadline.so.8.usr-is-merged by libreadline8t64'
Adding 'diversion of /lib/arm-linux-gnueabihf/libreadline.so.8.2 to /lib/arm-linux-gnueabihf/libreadline.so.8.2.usr-is-merged by libreadline8t64'
Unpacking libreadline8t64:armhf (8.2-6) ...
Selecting previously unselected package libpython3.13-stdlib:armhf.
Preparing to unpack .../7-libpython3.13-stdlib_3.13.2-1_armhf.deb ...
Unpacking libpython3.13-stdlib:armhf (3.13.2-1) ...
Selecting previously unselected package python3.13.
Preparing to unpack .../8-python3.13_3.13.2-1_armhf.deb ...
Unpacking python3.13 (3.13.2-1) ...
Selecting previously unselected package libpython3-stdlib:armhf.
Preparing to unpack .../9-libpython3-stdlib_3.13.2-2_armhf.deb ...
Unpacking libpython3-stdlib:armhf (3.13.2-2) ...
Setting up python3-minimal (3.13.2-2) ...
Selecting previously unselected package python3.
(Reading database ... 
(Reading database ... 5%
(Reading database ... 10%
(Reading database ... 15%
(Reading database ... 20%
(Reading database ... 25%
(Reading database ... 30%
(Reading database ... 35%
(Reading database ... 40%
(Reading database ... 45%
(Reading database ... 50%
(Reading database ... 55%
(Reading database ... 60%
(Reading database ... 65%
(Reading database ... 70%
(Reading database ... 75%
(Reading database ... 80%
(Reading database ... 85%
(Reading database ... 90%
(Reading database ... 95%
(Reading database ... 100%
(Reading database ... 20879 files and directories currently installed.)
Preparing to unpack .../00-python3_3.13.2-2_armhf.deb ...
Unpacking python3 (3.13.2-2) ...
Selecting previously unselected package sgml-base.
Preparing to unpack .../01-sgml-base_1.31_all.deb ...
Unpacking sgml-base (1.31) ...
Selecting previously unselected package sensible-utils.
Preparing to unpack .../02-sensible-utils_0.0.24_all.deb ...
Unpacking sensible-utils (0.0.24) ...
Selecting previously unselected package libmagic-mgc.
Preparing to unpack .../03-libmagic-mgc_1%3a5.45-3+b1_armhf.deb ...
Unpacking libmagic-mgc (1:5.45-3+b1) ...
Selecting previously unselected package libmagic1t64:armhf.
Preparing to unpack .../04-libmagic1t64_1%3a5.45-3+b1_armhf.deb ...
Unpacking libmagic1t64:armhf (1:5.45-3+b1) ...
Selecting previously unselected package file.
Preparing to unpack .../05-file_1%3a5.45-3+b1_armhf.deb ...
Unpacking file (1:5.45-3+b1) ...
Selecting previously unselected package gettext-base.
Preparing to unpack .../06-gettext-base_0.23.1-1_armhf.deb ...
Unpacking gettext-base (0.23.1-1) ...
Selecting previously unselected package libuchardet0:armhf.
Preparing to unpack .../07-libuchardet0_0.0.8-1+b2_armhf.deb ...
Unpacking libuchardet0:armhf (0.0.8-1+b2) ...
Selecting previously unselected package groff-base.
Preparing to unpack .../08-groff-base_1.23.0-7_armhf.deb ...
Unpacking groff-base (1.23.0-7) ...
Selecting previously unselected package bsdextrautils.
Preparing to unpack .../09-bsdextrautils_2.40.4-5_armhf.deb ...
Unpacking bsdextrautils (2.40.4-5) ...
Selecting previously unselected package libpipeline1:armhf.
Preparing to unpack .../10-libpipeline1_1.5.8-1_armhf.deb ...
Unpacking libpipeline1:armhf (1.5.8-1) ...
Selecting previously unselected package man-db.
Preparing to unpack .../11-man-db_2.13.0-1_armhf.deb ...
Unpacking man-db (2.13.0-1) ...
Selecting previously unselected package m4.
Preparing to unpack .../12-m4_1.4.19-5_armhf.deb ...
Unpacking m4 (1.4.19-5) ...
Selecting previously unselected package autoconf.
Preparing to unpack .../13-autoconf_2.72-3_all.deb ...
Unpacking autoconf (2.72-3) ...
Selecting previously unselected package autotools-dev.
Preparing to unpack .../14-autotools-dev_20220109.1_all.deb ...
Unpacking autotools-dev (20220109.1) ...
Selecting previously unselected package automake.
Preparing to unpack .../15-automake_1%3a1.17-3_all.deb ...
Unpacking automake (1:1.17-3) ...
Selecting previously unselected package autopoint.
Preparing to unpack .../16-autopoint_0.23.1-1_all.deb ...
Unpacking autopoint (0.23.1-1) ...
Selecting previously unselected package libelf1t64:armhf.
Preparing to unpack .../17-libelf1t64_0.192-4_armhf.deb ...
Unpacking libelf1t64:armhf (0.192-4) ...
Selecting previously unselected package bpftool.
Preparing to unpack .../18-bpftool_7.5.0+6.12.17-1_armhf.deb ...
Unpacking bpftool (7.5.0+6.12.17-1) ...
Selecting previously unselected package libedit2:armhf.
Preparing to unpack .../19-libedit2_3.1-20250104-1_armhf.deb ...
Unpacking libedit2:armhf (3.1-20250104-1) ...
Selecting previously unselected package libicu72:armhf.
Preparing to unpack .../20-libicu72_72.1-6_armhf.deb ...
Unpacking libicu72:armhf (72.1-6) ...
Selecting previously unselected package libxml2:armhf.
Preparing to unpack .../21-libxml2_2.12.7+dfsg+really2.9.14-0.2+b2_armhf.deb ...
Unpacking libxml2:armhf (2.12.7+dfsg+really2.9.14-0.2+b2) ...
Selecting previously unselected package libz3-4:armhf.
Preparing to unpack .../22-libz3-4_4.13.3-1_armhf.deb ...
Unpacking libz3-4:armhf (4.13.3-1) ...
Selecting previously unselected package libllvm19:armhf.
Preparing to unpack .../23-libllvm19_1%3a19.1.7-1+b1_armhf.deb ...
Unpacking libllvm19:armhf (1:19.1.7-1+b1) ...
Selecting previously unselected package libclang-cpp19.
Preparing to unpack .../24-libclang-cpp19_1%3a19.1.7-1+b1_armhf.deb ...
Unpacking libclang-cpp19 (1:19.1.7-1+b1) ...
Selecting previously unselected package libgc1:armhf.
Preparing to unpack .../25-libgc1_1%3a8.2.8-1_armhf.deb ...
Unpacking libgc1:armhf (1:8.2.8-1) ...
Selecting previously unselected package libobjc4:armhf.
Preparing to unpack .../26-libobjc4_14.2.0-17_armhf.deb ...
Unpacking libobjc4:armhf (14.2.0-17) ...
Selecting previously unselected package libobjc-14-dev:armhf.
Preparing to unpack .../27-libobjc-14-dev_14.2.0-17_armhf.deb ...
Unpacking libobjc-14-dev:armhf (14.2.0-17) ...
Selecting previously unselected package libclang-common-19-dev:armhf.
Preparing to unpack .../28-libclang-common-19-dev_1%3a19.1.7-1+b1_armhf.deb ...
Unpacking libclang-common-19-dev:armhf (1:19.1.7-1+b1) ...
Selecting previously unselected package llvm-19-linker-tools.
Preparing to unpack .../29-llvm-19-linker-tools_1%3a19.1.7-1+b1_armhf.deb ...
Unpacking llvm-19-linker-tools (1:19.1.7-1+b1) ...
Selecting previously unselected package libclang1-19.
Preparing to unpack .../30-libclang1-19_1%3a19.1.7-1+b1_armhf.deb ...
Unpacking libclang1-19 (1:19.1.7-1+b1) ...
Selecting previously unselected package clang-19.
Preparing to unpack .../31-clang-19_1%3a19.1.7-1+b1_armhf.deb ...
Unpacking clang-19 (1:19.1.7-1+b1) ...
Selecting previously unselected package clang.
Preparing to unpack .../32-clang_1%3a19.0-63_armhf.deb ...
Unpacking clang (1:19.0-63) ...
Selecting previously unselected package libdebhelper-perl.
Preparing to unpack .../33-libdebhelper-perl_13.24.1_all.deb ...
Unpacking libdebhelper-perl (13.24.1) ...
Selecting previously unselected package libtool.
Preparing to unpack .../34-libtool_2.5.4-3_all.deb ...
Unpacking libtool (2.5.4-3) ...
Selecting previously unselected package dh-autoreconf.
Preparing to unpack .../35-dh-autoreconf_20_all.deb ...
Unpacking dh-autoreconf (20) ...
Selecting previously unselected package libarchive-zip-perl.
Preparing to unpack .../36-libarchive-zip-perl_1.68-1_all.deb ...
Unpacking libarchive-zip-perl (1.68-1) ...
Selecting previously unselected package libfile-stripnondeterminism-perl.
Preparing to unpack .../37-libfile-stripnondeterminism-perl_1.14.1-2_all.deb ...
Unpacking libfile-stripnondeterminism-perl (1.14.1-2) ...
Selecting previously unselected package dh-strip-nondeterminism.
Preparing to unpack .../38-dh-strip-nondeterminism_1.14.1-2_all.deb ...
Unpacking dh-strip-nondeterminism (1.14.1-2) ...
Selecting previously unselected package dwz.
Preparing to unpack .../39-dwz_0.15-1+b2_armhf.deb ...
Unpacking dwz (0.15-1+b2) ...
Selecting previously unselected package libunistring5:armhf.
Preparing to unpack .../40-libunistring5_1.3-1_armhf.deb ...
Unpacking libunistring5:armhf (1.3-1) ...
Selecting previously unselected package gettext.
Preparing to unpack .../41-gettext_0.23.1-1_armhf.deb ...
Unpacking gettext (0.23.1-1) ...
Selecting previously unselected package intltool-debian.
Preparing to unpack .../42-intltool-debian_0.35.0+20060710.6_all.deb ...
Unpacking intltool-debian (0.35.0+20060710.6) ...
Selecting previously unselected package po-debconf.
Preparing to unpack .../43-po-debconf_1.0.21+nmu1_all.deb ...
Unpacking po-debconf (1.0.21+nmu1) ...
Selecting previously unselected package debhelper.
Preparing to unpack .../44-debhelper_13.24.1_all.deb ...
Unpacking debhelper (13.24.1) ...
Selecting previously unselected package xml-core.
Preparing to unpack .../45-xml-core_0.19_all.deb ...
Unpacking xml-core (0.19) ...
Selecting previously unselected package docutils-common.
Preparing to unpack .../46-docutils-common_0.21.2+dfsg-2_all.deb ...
Unpacking docutils-common (0.21.2+dfsg-2) ...
Selecting previously unselected package libbpf1:armhf.
Preparing to unpack .../47-libbpf1_1%3a1.5.0-2_armhf.deb ...
Unpacking libbpf1:armhf (1:1.5.0-2) ...
Selecting previously unselected package zlib1g-dev:armhf.
Preparing to unpack .../48-zlib1g-dev_1%3a1.3.dfsg+really1.3.1-1+b1_armhf.deb ...
Unpacking zlib1g-dev:armhf (1:1.3.dfsg+really1.3.1-1+b1) ...
Selecting previously unselected package libzstd-dev:armhf.
Preparing to unpack .../49-libzstd-dev_1.5.6+dfsg-2_armhf.deb ...
Unpacking libzstd-dev:armhf (1.5.6+dfsg-2) ...
Selecting previously unselected package libelf-dev:armhf.
Preparing to unpack .../50-libelf-dev_0.192-4_armhf.deb ...
Unpacking libelf-dev:armhf (0.192-4) ...
Selecting previously unselected package libbpf-dev:armhf.
Preparing to unpack .../51-libbpf-dev_1%3a1.5.0-2_armhf.deb ...
Unpacking libbpf-dev:armhf (1:1.5.0-2) ...
Selecting previously unselected package libbrotli1:armhf.
Preparing to unpack .../52-libbrotli1_1.1.0-2+b7_armhf.deb ...
Unpacking libbrotli1:armhf (1.1.0-2+b7) ...
Selecting previously unselected package libcap-dev:armhf.
Preparing to unpack .../53-libcap-dev_1%3a2.73-4_armhf.deb ...
Unpacking libcap-dev:armhf (1:2.73-4) ...
Selecting previously unselected package libcom-err2:armhf.
Preparing to unpack .../54-libcom-err2_1.47.2-1_armhf.deb ...
Unpacking libcom-err2:armhf (1.47.2-1) ...
Selecting previously unselected package libkrb5support0:armhf.
Preparing to unpack .../55-libkrb5support0_1.21.3-4_armhf.deb ...
Unpacking libkrb5support0:armhf (1.21.3-4) ...
Selecting previously unselected package libk5crypto3:armhf.
Preparing to unpack .../56-libk5crypto3_1.21.3-4_armhf.deb ...
Unpacking libk5crypto3:armhf (1.21.3-4) ...
Selecting previously unselected package libkeyutils1:armhf.
Preparing to unpack .../57-libkeyutils1_1.6.3-4_armhf.deb ...
Unpacking libkeyutils1:armhf (1.6.3-4) ...
Selecting previously unselected package libkrb5-3:armhf.
Preparing to unpack .../58-libkrb5-3_1.21.3-4_armhf.deb ...
Unpacking libkrb5-3:armhf (1.21.3-4) ...
Selecting previously unselected package libgssapi-krb5-2:armhf.
Preparing to unpack .../59-libgssapi-krb5-2_1.21.3-4_armhf.deb ...
Unpacking libgssapi-krb5-2:armhf (1.21.3-4) ...
Selecting previously unselected package libidn2-0:armhf.
Preparing to unpack .../60-libidn2-0_2.3.7-2+b1_armhf.deb ...
Unpacking libidn2-0:armhf (2.3.7-2+b1) ...
Selecting previously unselected package libsasl2-modules-db:armhf.
Preparing to unpack .../61-libsasl2-modules-db_2.1.28+dfsg1-9_armhf.deb ...
Unpacking libsasl2-modules-db:armhf (2.1.28+dfsg1-9) ...
Selecting previously unselected package libsasl2-2:armhf.
Preparing to unpack .../62-libsasl2-2_2.1.28+dfsg1-9_armhf.deb ...
Unpacking libsasl2-2:armhf (2.1.28+dfsg1-9) ...
Selecting previously unselected package libldap2:armhf.
Preparing to unpack .../63-libldap2_2.6.9+dfsg-1_armhf.deb ...
Unpacking libldap2:armhf (2.6.9+dfsg-1) ...
Selecting previously unselected package libnghttp2-14:armhf.
Preparing to unpack .../64-libnghttp2-14_1.64.0-1_armhf.deb ...
Unpacking libnghttp2-14:armhf (1.64.0-1) ...
Selecting previously unselected package libnghttp3-9:armhf.
Preparing to unpack .../65-libnghttp3-9_1.8.0-1_armhf.deb ...
Unpacking libnghttp3-9:armhf (1.8.0-1) ...
Selecting previously unselected package libpsl5t64:armhf.
Preparing to unpack .../66-libpsl5t64_0.21.2-1.1+b1_armhf.deb ...
Unpacking libpsl5t64:armhf (0.21.2-1.1+b1) ...
Selecting previously unselected package libp11-kit0:armhf.
Preparing to unpack .../67-libp11-kit0_0.25.5-3_armhf.deb ...
Unpacking libp11-kit0:armhf (0.25.5-3) ...
Selecting previously unselected package libtasn1-6:armhf.
Preparing to unpack .../68-libtasn1-6_4.20.0-2_armhf.deb ...
Unpacking libtasn1-6:armhf (4.20.0-2) ...
Selecting previously unselected package libgnutls30t64:armhf.
Preparing to unpack .../69-libgnutls30t64_3.8.9-2_armhf.deb ...
Unpacking libgnutls30t64:armhf (3.8.9-2) ...
Selecting previously unselected package librtmp1:armhf.
Preparing to unpack .../70-librtmp1_2.4+20151223.gitfa8646d.1-2+b5_armhf.deb ...
Unpacking librtmp1:armhf (2.4+20151223.gitfa8646d.1-2+b5) ...
Selecting previously unselected package libssh2-1t64:armhf.
Preparing to unpack .../71-libssh2-1t64_1.11.1-1_armhf.deb ...
Unpacking libssh2-1t64:armhf (1.11.1-1) ...
Selecting previously unselected package libcurl4t64:armhf.
Preparing to unpack .../72-libcurl4t64_8.12.1-3_armhf.deb ...
Unpacking libcurl4t64:armhf (8.12.1-3) ...
Selecting previously unselected package libnl-3-200:armhf.
Preparing to unpack .../73-libnl-3-200_3.7.0-0.3+b1_armhf.deb ...
Unpacking libnl-3-200:armhf (3.7.0-0.3+b1) ...
Selecting previously unselected package libnl-3-dev:armhf.
Preparing to unpack .../74-libnl-3-dev_3.7.0-0.3+b1_armhf.deb ...
Unpacking libnl-3-dev:armhf (3.7.0-0.3+b1) ...
Selecting previously unselected package libnl-route-3-200:armhf.
Preparing to unpack .../75-libnl-route-3-200_3.7.0-0.3+b1_armhf.deb ...
Unpacking libnl-route-3-200:armhf (3.7.0-0.3+b1) ...
Selecting previously unselected package libnl-route-3-dev:armhf.
Preparing to unpack .../76-libnl-route-3-dev_3.7.0-0.3+b1_armhf.deb ...
Unpacking libnl-route-3-dev:armhf (3.7.0-0.3+b1) ...
Selecting previously unselected package libpfm4:armhf.
Preparing to unpack .../77-libpfm4_4.13.0+git83-g91970fe-1_armhf.deb ...
Unpacking libpfm4:armhf (4.13.0+git83-g91970fe-1) ...
Selecting previously unselected package llvm-19-runtime.
Preparing to unpack .../78-llvm-19-runtime_1%3a19.1.7-1+b1_armhf.deb ...
Unpacking llvm-19-runtime (1:19.1.7-1+b1) ...
Selecting previously unselected package llvm-runtime:armhf.
Preparing to unpack .../79-llvm-runtime_1%3a19.0-63_armhf.deb ...
Unpacking llvm-runtime:armhf (1:19.0-63) ...
Selecting previously unselected package llvm-19.
Preparing to unpack .../80-llvm-19_1%3a19.1.7-1+b1_armhf.deb ...
Unpacking llvm-19 (1:19.1.7-1+b1) ...
Selecting previously unselected package llvm.
Preparing to unpack .../81-llvm_1%3a19.0-63_armhf.deb ...
Unpacking llvm (1:19.0-63) ...
Selecting previously unselected package python3-roman.
Preparing to unpack .../82-python3-roman_5.0-1_all.deb ...
Unpacking python3-roman (5.0-1) ...
Selecting previously unselected package python3-docutils.
Preparing to unpack .../83-python3-docutils_0.21.2+dfsg-2_all.deb ...
Unpacking python3-docutils (0.21.2+dfsg-2) ...
Setting up media-types (12.0.0) ...
Setting up libpipeline1:armhf (1.5.8-1) ...
Setting up libkeyutils1:armhf (1.6.3-4) ...
Setting up libicu72:armhf (72.1-6) ...
Setting up libzstd-dev:armhf (1.5.6+dfsg-2) ...
Setting up bsdextrautils (2.40.4-5) ...
Setting up libmagic-mgc (1:5.45-3+b1) ...
Setting up libclang-common-19-dev:armhf (1:19.1.7-1+b1) ...
Setting up libarchive-zip-perl (1.68-1) ...
Setting up libdebhelper-perl (13.24.1) ...
Setting up libbrotli1:armhf (1.1.0-2+b7) ...
Setting up libedit2:armhf (3.1-20250104-1) ...
Setting up libmagic1t64:armhf (1:5.45-3+b1) ...
Setting up libnghttp2-14:armhf (1.64.0-1) ...
Setting up gettext-base (0.23.1-1) ...
Setting up m4 (1.4.19-5) ...
Setting up libcom-err2:armhf (1.47.2-1) ...
Setting up file (1:5.45-3+b1) ...
Setting up libelf1t64:armhf (0.192-4) ...
Setting up libkrb5support0:armhf (1.21.3-4) ...
Setting up libsasl2-modules-db:armhf (2.1.28+dfsg1-9) ...
Setting up tzdata (2025a-2) ...

Current default time zone: 'Etc/UTC'
Local time is now:      Wed Mar  5 01:33:50 UTC 2025.
Universal Time is now:  Wed Mar  5 01:33:50 UTC 2025.
Run 'dpkg-reconfigure tzdata' if you wish to change it.

Setting up autotools-dev (20220109.1) ...
Setting up libz3-4:armhf (4.13.3-1) ...
Setting up libpfm4:armhf (4.13.0+git83-g91970fe-1) ...
Setting up libunistring5:armhf (1.3-1) ...
Setting up autopoint (0.23.1-1) ...
Setting up libk5crypto3:armhf (1.21.3-4) ...
Setting up libgc1:armhf (1:8.2.8-1) ...
Setting up libsasl2-2:armhf (2.1.28+dfsg1-9) ...
Setting up autoconf (2.72-3) ...
Setting up libnghttp3-9:armhf (1.8.0-1) ...
Setting up zlib1g-dev:armhf (1:1.3.dfsg+really1.3.1-1+b1) ...
Setting up libffi8:armhf (3.4.7-1) ...
Setting up dwz (0.15-1+b2) ...
Setting up libsctp1:armhf (1.0.21+dfsg-1) ...
Setting up sensible-utils (0.0.24) ...
Setting up libuchardet0:armhf (0.0.8-1+b2) ...
Setting up libnl-3-200:armhf (3.7.0-0.3+b1) ...
Setting up libtasn1-6:armhf (4.20.0-2) ...
Setting up netbase (6.4) ...
Setting up sgml-base (1.31) ...
Setting up libkrb5-3:armhf (1.21.3-4) ...
Setting up libssh2-1t64:armhf (1.11.1-1) ...
Setting up libcap-dev:armhf (1:2.73-4) ...
Setting up readline-common (8.2-6) ...
Setting up libxml2:armhf (2.12.7+dfsg+really2.9.14-0.2+b2) ...
Setting up libldap2:armhf (2.6.9+dfsg-1) ...
Setting up libbpf1:armhf (1:1.5.0-2) ...
Setting up automake (1:1.17-3) ...
update-alternatives: using /usr/bin/automake-1.17 to provide /usr/bin/automake (automake) in auto mode
Setting up libfile-stripnondeterminism-perl (1.14.1-2) ...
Setting up libllvm19:armhf (1:19.1.7-1+b1) ...
Setting up gettext (0.23.1-1) ...
Setting up libclang1-19 (1:19.1.7-1+b1) ...
Setting up libtool (2.5.4-3) ...
Setting up bpftool (7.5.0+6.12.17-1) ...
Setting up libobjc4:armhf (14.2.0-17) ...
Setting up libidn2-0:armhf (2.3.7-2+b1) ...
Setting up libobjc-14-dev:armhf (14.2.0-17) ...
Setting up intltool-debian (0.35.0+20060710.6) ...
Setting up libnl-route-3-200:armhf (3.7.0-0.3+b1) ...
Setting up dh-autoreconf (20) ...
Setting up libp11-kit0:armhf (0.25.5-3) ...
Setting up libiperf0:armhf (3.18-2) ...
Setting up libgssapi-krb5-2:armhf (1.21.3-4) ...
Setting up libelf-dev:armhf (0.192-4) ...
Setting up libreadline8t64:armhf (8.2-6) ...
Setting up dh-strip-nondeterminism (1.14.1-2) ...
Setting up libnl-3-dev:armhf (3.7.0-0.3+b1) ...
Setting up groff-base (1.23.0-7) ...
Setting up xml-core (0.19) ...
Setting up llvm-19-linker-tools (1:19.1.7-1+b1) ...
Setting up llvm-19-runtime (1:19.1.7-1+b1) ...
Setting up libpython3.13-stdlib:armhf (3.13.2-1) ...
Setting up libpython3-stdlib:armhf (3.13.2-2) ...
Setting up libclang-cpp19 (1:19.1.7-1+b1) ...
Setting up libgnutls30t64:armhf (3.8.9-2) ...
Setting up libbpf-dev:armhf (1:1.5.0-2) ...
Setting up python3.13 (3.13.2-1) ...
Setting up iperf3 (3.18-2) ...
useradd: Warning: missing or non-executable shell '/usr/sbin/nologin'
Setting up po-debconf (1.0.21+nmu1) ...
Setting up libpsl5t64:armhf (0.21.2-1.1+b1) ...
Setting up python3 (3.13.2-2) ...
Setting up man-db (2.13.0-1) ...
Not building database; man-db/auto-update is not 'true'.
Setting up clang-19 (1:19.1.7-1+b1) ...
Setting up libnl-route-3-dev:armhf (3.7.0-0.3+b1) ...
Setting up python3-roman (5.0-1) ...
Setting up librtmp1:armhf (2.4+20151223.gitfa8646d.1-2+b5) ...
Setting up clang (1:19.0-63) ...
Setting up llvm-runtime:armhf (1:19.0-63) ...
Setting up libcurl4t64:armhf (8.12.1-3) ...
Setting up debhelper (13.24.1) ...
Setting up llvm-19 (1:19.1.7-1+b1) ...
Setting up llvm (1:19.0-63) ...
Processing triggers for libc-bin (2.41-3) ...
Processing triggers for sgml-base (1.31) ...
Setting up docutils-common (0.21.2+dfsg-2) ...
Processing triggers for sgml-base (1.31) ...
Setting up python3-docutils (0.21.2+dfsg-2) ...
Reading package lists...
Building dependency tree...
Reading state information...
Reading extended state information...
Initializing package states...
Writing extended state information...
Building tag database...
 -> Finished parsing the build-deps
I: Building the package
I: Running cd /build/reproducible-path/bpftune-0.0~git20250121.d38eac6/ && env PATH="/usr/sbin:/usr/bin:/sbin:/bin:/usr/games" HOME="/nonexistent/first-build" dpkg-buildpackage -us -uc -b && env PATH="/usr/sbin:/usr/bin:/sbin:/bin:/usr/games" HOME="/nonexistent/first-build" dpkg-genchanges -S  > ../bpftune_0.0~git20250121.d38eac6-1_source.changes
dpkg-buildpackage: info: source package bpftune
dpkg-buildpackage: info: source version 0.0~git20250121.d38eac6-1
dpkg-buildpackage: info: source distribution unstable
dpkg-buildpackage: info: source changed by Sudip Mukherjee <sudipm.mukherjee@gmail.com>
 dpkg-source --before-build .
dpkg-buildpackage: info: host architecture armhf
 debian/rules clean
dh clean
   dh_auto_clean
	make -j3 distclean
make[1]: Entering directory '/build/reproducible-path/bpftune-0.0~git20250121.d38eac6'
cd src; make clean
cd docs; make clean
cd test; make clean
make[2]: Entering directory '/build/reproducible-path/bpftune-0.0~git20250121.d38eac6/src'
make[2]: Entering directory '/build/reproducible-path/bpftune-0.0~git20250121.d38eac6/docs'
make[2]: Entering directory '/build/reproducible-path/bpftune-0.0~git20250121.d38eac6/test'
cd strategy; make clean
make[2]: git: No such file or directory
make[2]: Leaving directory '/build/reproducible-path/bpftune-0.0~git20250121.d38eac6/docs'
cd src; make distclean
make[3]: Entering directory '/build/reproducible-path/bpftune-0.0~git20250121.d38eac6/test/strategy'
make[2]: Entering directory '/build/reproducible-path/bpftune-0.0~git20250121.d38eac6/src'
make[2]: git: No such file or directory
make[2]: Leaving directory '/build/reproducible-path/bpftune-0.0~git20250121.d38eac6/src'
make[3]: Leaving directory '/build/reproducible-path/bpftune-0.0~git20250121.d38eac6/test/strategy'
rm -f conn_bomb
make[2]: Leaving directory '/build/reproducible-path/bpftune-0.0~git20250121.d38eac6/test'
make[2]: Leaving directory '/build/reproducible-path/bpftune-0.0~git20250121.d38eac6/src'
make[1]: Leaving directory '/build/reproducible-path/bpftune-0.0~git20250121.d38eac6'
   dh_clean
rm -f src/*.plist
 debian/rules binary
dh binary
   dh_update_autotools_config
   dh_autoreconf
   dh_auto_configure
   dh_auto_build
	make -j3 "INSTALL=install --strip-program=true"
make[1]: Entering directory '/build/reproducible-path/bpftune-0.0~git20250121.d38eac6'
cd src; make
cd docs; make man
make[2]: Entering directory '/build/reproducible-path/bpftune-0.0~git20250121.d38eac6/src'
make[2]: Entering directory '/build/reproducible-path/bpftune-0.0~git20250121.d38eac6/docs'
make[2]: git: No such file or directory
( cat bpftune.rst ; printf "%b"  "\nSEE ALSO\n========\n\t**bpf**\ (2), **bpftune**\ (8),\n" ) | rst2man --verbose > bpftune.8
( cat bpftune-sysctl.rst ; printf "%b"  "\nSEE ALSO\n========\n\t**bpf**\ (2), **bpftune**\ (8),\n" ) | rst2man --verbose > bpftune-sysctl.8
clang -g -fno-stack-protector -Wall -D__TARGET_ARCH_arm -O2 -target bpf \
	-I../include -I/usr/include -I/usr/local/include -I/usr/include/libnl3 -I../include/uapi -c tcp_buffer_tuner.bpf.c -o tcp_buffer_tuner.bpf.o
( cat bpftune-tcp-conn.rst ; printf "%b"  "\nSEE ALSO\n========\n\t**bpf**\ (2), **bpftune**\ (8),\n" ) | rst2man --verbose > bpftune-tcp-conn.8
( cat bpftune-neigh.rst ; printf "%b"  "\nSEE ALSO\n========\n\t**bpf**\ (2), **bpftune**\ (8),\n" ) | rst2man --verbose > bpftune-neigh.8
In file included from tcp_buffer_tuner.bpf.c:20:
In file included from ../include/bpftune/bpftune.bpf.h:42:
In file included from /usr/include/bpf/bpf_helpers.h:11:
/usr/include/bpf/bpf_helper_defs.h:86:90: error: unknown type name '__u64'
   86 | static long (* const bpf_map_update_elem)(void *map, const void *key, const void *value, __u64 flags) = (void *) 2;
      |                                                                                          ^
/usr/include/bpf/bpf_helper_defs.h:110:49: error: unknown type name '__u32'
  110 | static long (* const bpf_probe_read)(void *dst, __u32 size, const void *unsafe_ptr) = (void *) 4;
      |                                                 ^
/usr/include/bpf/bpf_helper_defs.h:122:14: error: function cannot return function type 'int (void)'
  122 | static __u64 (* const bpf_ktime_get_ns)(void) = (void *) 5;
      |              ^
/usr/include/bpf/bpf_helper_defs.h:122:8: error: illegal initializer (only variables can be initialized)
  122 | static __u64 (* const bpf_ktime_get_ns)(void) = (void *) 5;
      |        ^
/usr/include/bpf/bpf_helper_defs.h:185:57: error: unknown type name '__u32'
  185 | static long (* const bpf_trace_printk)(const char *fmt, __u32 fmt_size, ...) = (void *) 6;
      |                                                         ^
/usr/include/bpf/bpf_helper_defs.h:201:14: error: function cannot return function type 'int (void)'
  201 | static __u32 (* const bpf_get_prandom_u32)(void) = (void *) 7;
      |              ^
/usr/include/bpf/bpf_helper_defs.h:201:8: error: illegal initializer (only variables can be initialized)
  201 | static __u32 (* const bpf_get_prandom_u32)(void) = (void *) 7;
      |        ^
/usr/include/bpf/bpf_helper_defs.h:214:29: error: function cannot return function type 'int (void)'
  214 | static __bpf_fastcall __u32 (* const bpf_get_smp_processor_id)(void) = (void *) 8;
      |                             ^
/usr/include/bpf/bpf_helper_defs.h:214:23: error: illegal initializer (only variables can be initialized)
  214 | static __bpf_fastcall __u32 (* const bpf_get_smp_processor_id)(void) = (void *) 8;
      |                       ^
/usr/include/bpf/bpf_helper_defs.h:235:66: error: unknown type name '__u32'
  235 | static long (* const bpf_skb_store_bytes)(struct __sk_buff *skb, __u32 offset, const void *from, __u32 len, __u64 flags) = (void *) 9;
      |                                                                  ^
/usr/include/bpf/bpf_helper_defs.h:235:98: error: unknown type name '__u32'
  235 | static long (* const bpf_skb_store_bytes)(struct __sk_buff *skb, __u32 offset, const void *from, __u32 len, __u64 flags) = (void *) 9;
      |                                                                                                  ^
/usr/include/bpf/bpf_helper_defs.h:235:109: error: unknown type name '__u64'
  235 | static long (* const bpf_skb_store_bytes)(struct __sk_buff *skb, __u32 offset, const void *from, __u32 len, __u64 flags) = (void *) 9;
      |                                                                                                             ^
/usr/include/bpf/bpf_helper_defs.h:264:66: error: unknown type name '__u32'
  264 | static long (* const bpf_l3_csum_replace)(struct __sk_buff *skb, __u32 offset, __u64 from, __u64 to, __u64 size) = (void *) 10;
      |                                                                  ^
/usr/include/bpf/bpf_helper_defs.h:264:80: error: unknown type name '__u64'
  264 | static long (* const bpf_l3_csum_replace)(struct __sk_buff *skb, __u32 offset, __u64 from, __u64 to, __u64 size) = (void *) 10;
      |                                                                                ^
/usr/include/bpf/bpf_helper_defs.h:264:92: error: unknown type name '__u64'
  264 | static long (* const bpf_l3_csum_replace)(struct __sk_buff *skb, __u32 offset, __u64 from, __u64 to, __u64 size) = (void *) 10;
      |                                                                                            ^
/usr/include/bpf/bpf_helper_defs.h:264:102: error: unknown type name '__u64'
  264 | static long (* const bpf_l3_csum_replace)(struct __sk_buff *skb, __u32 offset, __u64 from, __u64 to, __u64 size) = (void *) 10;
      |                                                                                                      ^
/usr/include/bpf/bpf_helper_defs.h:300:66: error: unknown type name '__u32'
  300 | static long (* const bpf_l4_csum_replace)(struct __sk_buff *skb, __u32 offset, __u64 from, __u64 to, __u64 flags) = (void *) 11;
      |                                                                  ^
/usr/include/bpf/bpf_helper_defs.h:300:80: error: unknown type name '__u64'
  300 | static long (* const bpf_l4_csum_replace)(struct __sk_buff *skb, __u32 offset, __u64 from, __u64 to, __u64 flags) = (void *) 11;
      |                                                                                ^
/usr/include/bpf/bpf_helper_defs.h:300:92: error: unknown type name '__u64'
  300 | static long (* const bpf_l4_csum_replace)(struct __sk_buff *skb, __u32 offset, __u64 from, __u64 to, __u64 flags) = (void *) 11;
      |                                                                                            ^
fatal error: too many errors emitted, stopping now [-ferror-limit=]
20 errors generated.
make[2]: *** [Makefile:183: tcp_buffer_tuner.bpf.o] Error 1
make[2]: Leaving directory '/build/reproducible-path/bpftune-0.0~git20250121.d38eac6/src'
make[1]: *** [Makefile:41: srcdir] Error 2
make[1]: *** Waiting for unfinished jobs....
( cat bpftune-tcp-buffer.rst ; printf "%b"  "\nSEE ALSO\n========\n\t**bpf**\ (2), **bpftune**\ (8),\n" ) | rst2man --verbose > bpftune-tcp-buffer.8
( cat bpftune-netns.rst ; printf "%b"  "\nSEE ALSO\n========\n\t**bpf**\ (2), **bpftune**\ (8),\n" ) | rst2man --verbose > bpftune-netns.8
( cat bpftune-net-buffer.rst ; printf "%b"  "\nSEE ALSO\n========\n\t**bpf**\ (2), **bpftune**\ (8),\n" ) | rst2man --verbose > bpftune-net-buffer.8
( cat bpftune-ip-frag.rst ; printf "%b"  "\nSEE ALSO\n========\n\t**bpf**\ (2), **bpftune**\ (8),\n" ) | rst2man --verbose > bpftune-ip-frag.8
make[2]: Leaving directory '/build/reproducible-path/bpftune-0.0~git20250121.d38eac6/docs'
make[1]: Leaving directory '/build/reproducible-path/bpftune-0.0~git20250121.d38eac6'
dh_auto_build: error: make -j3 "INSTALL=install --strip-program=true" returned exit code 2
make: *** [debian/rules:24: binary] Error 25
dpkg-buildpackage: error: debian/rules binary subprocess returned exit status 2
I: copying local configuration
E: Failed autobuilding of package
I: unmounting dev/ptmx filesystem
I: unmounting dev/pts filesystem
I: unmounting dev/shm filesystem
I: unmounting proc filesystem
I: unmounting sys filesystem
I: cleaning the build env 
I: removing directory /srv/workspace/pbuilder/9175 and its subdirectories
Wed Mar  5 01:34:55 UTC 2025  W: No second build log, what happened?