Wed Jan  8 09:32:00 UTC 2025  I: starting to build vitables/unstable/arm64 on jenkins on '2025-01-08 09:31'
Wed Jan  8 09:32:00 UTC 2025  I: The jenkins build log is/was available at https://jenkins.debian.net/userContent/reproducible/debian/build_service/arm64_9/55296/console.log
Wed Jan  8 09:32:00 UTC 2025  I: Downloading source for unstable/vitables=3.0.3-1
--2025-01-08 09:32:01--  http://deb.debian.org/debian/pool/main/v/vitables/vitables_3.0.3-1.dsc
Connecting to 46.16.76.132:3128... connected.
Proxy request sent, awaiting response... 200 OK
Length: 2247 (2.2K) [text/prs.lines.tag]
Saving to: ‘vitables_3.0.3-1.dsc’

     0K ..                                                    100%  329M=0s

2025-01-08 09:32:01 (329 MB/s) - ‘vitables_3.0.3-1.dsc’ saved [2247/2247]

Wed Jan  8 09:32:01 UTC 2025  I: vitables_3.0.3-1.dsc
-----BEGIN PGP SIGNED MESSAGE-----
Hash: SHA512

Format: 3.0 (quilt)
Source: vitables
Binary: vitables
Architecture: all
Version: 3.0.3-1
Maintainer: Debian Science Maintainers <debian-science-maintainers@lists.alioth.debian.org>
Uploaders: Dmitrijs Ledkovs <dmitrij.ledkov@gmail.com>, Picca Frédéric-Emmanuel <picca@debian.org>, Benda Xu <orv@debian.org>
Homepage: http://vitables.org/
Standards-Version: 4.7.0
Vcs-Browser: https://salsa.debian.org/science-team/vitables
Vcs-Git: https://salsa.debian.org/science-team/vitables.git
Build-Depends: debhelper-compat (= 13), dh-python, pybuild-plugin-pyproject, pyqt6-dev-tools, python3, python3-hatchling, python3-numpy, python3-pkg-resources, python3-pyqt6, python3-pytest, python3-pytest-xvfb, python3-qtpy, python3-sphinx, python3-sphinxcontrib.qthelp, python3-tables
Package-List:
 vitables deb science optional arch=all
Checksums-Sha1:
 0f07270cc7908d1f7db41b7f1816096706cf3f61 2105578 vitables_3.0.3.orig.tar.gz
 36b05f4c4cc62e72822208d8bb4edc26fdb21cff 4892 vitables_3.0.3-1.debian.tar.xz
Checksums-Sha256:
 9f1747ff3ccc2963ece3252519bbc88216c85b66c12c819e96b8d71d92aab31e 2105578 vitables_3.0.3.orig.tar.gz
 debf7915420fc9de61bdf6e44f7d494b6a73a2927271bd5a31f484dcb4a5fb35 4892 vitables_3.0.3-1.debian.tar.xz
Files:
 aa97bd8744d95bf3e76740c838267b76 2105578 vitables_3.0.3.orig.tar.gz
 7f72618f9365e482c5381fc41ea59535 4892 vitables_3.0.3-1.debian.tar.xz

-----BEGIN PGP SIGNATURE-----

iQIzBAEBCgAdFiEEkOLSwa0Uaht+u4kdu8F+uxOW8vcFAmd86iAACgkQu8F+uxOW
8vfpkRAAjX8vuofut6S4e3YW7oqXlQbPXX2qsZOSeacgMOFfyyW8jJOB2NGcs6OQ
YdK2RgWgHn8KhhGeb/4H6fnKlxO9X4N1enIInbbeI1XpxmZB8Jg+dYzCmUX0uylX
VR0aJzyRz1WoxUEL1fMv5GpClnACmZqMcGN9uDPvGJrwdLQI+Av68E936XiHe/w5
xfPC612OlvfEcTb4DI0zwaA2UxlOvEOX06xywOUO2gkXKpvqm1vKnZuQDZSaEvwM
GoP1+R5YxSkQsd1UNghiINhzGUj+TO/j9B7ANjSCIwstxZMtsqxYscNGGOXnbo+6
EIcRifDGjogYHYPPZq3kJZhrHYD5fipQmfA2kRChZJ+x9CaCh8IYHufeYRYq2+lR
Zjp3CiU20W3PN6VOQoaXMNrJRSFTnKJr/TgQQQiR+w/JLpZXZkJO3gStNc0htd2A
0vjQx6jVvRr5B9/vhvRNLbWCOiwBTFanjDvPiNmtNNoBwu4Ljsl/lOwFKBIqUyC/
QD3XqXrj20Kas2QusDK1UUhn3IJNr9QZzVagfQbRG4EAV58aUmPg6Bo76HESU3Pp
vRHDNIvF75NGyqgyqilfcv1i1oBGPdt6jn2wv8oiGVk0NUwg5if0CyhQ9Edj31Cj
m4/9RvfyLO9ePHB2llJoMLsXNlHMfcnB5xBjKW08YORmNH1fYJU=
=bNek
-----END PGP SIGNATURE-----
Wed Jan  8 09:32:01 UTC 2025  I: Checking whether the package is not for us
Wed Jan  8 09:32:01 UTC 2025  I: Starting 1st build on remote node codethink03-arm64.debian.net.
Wed Jan  8 09:32:01 UTC 2025  I: Preparing to do remote build '1' on codethink03-arm64.debian.net.
Wed Jan  8 09:33:38 UTC 2025  I: Deleting $TMPDIR on codethink03-arm64.debian.net.
I: pbuilder: network access will be disabled during build
I: Current time: Tue Feb 10 03:55:03 -12 2026
I: pbuilder-time-stamp: 1770738903
I: Building the build Environment
I: extracting base tarball [/var/cache/pbuilder/unstable-reproducible-base.tgz]
I: copying local configuration
W: --override-config is not set; not updating apt.conf Read the manpage for details.
I: mounting /proc filesystem
I: mounting /sys filesystem
I: creating /{dev,run}/shm
I: mounting /dev/pts filesystem
I: redirecting /dev/ptmx to /dev/pts/ptmx
I: policy-rc.d already exists
I: Copying source file
I: copying [vitables_3.0.3-1.dsc]
I: copying [./vitables_3.0.3.orig.tar.gz]
I: copying [./vitables_3.0.3-1.debian.tar.xz]
I: Extracting source
dpkg-source: warning: cannot verify inline signature for ./vitables_3.0.3-1.dsc: unsupported subcommand
dpkg-source: info: extracting vitables in vitables-3.0.3
dpkg-source: info: unpacking vitables_3.0.3.orig.tar.gz
dpkg-source: info: unpacking vitables_3.0.3-1.debian.tar.xz
dpkg-source: info: using patch list from debian/patches/series
dpkg-source: info: applying 0001-vtsite.py-use-debian-doc-and-icons-paths.patch
dpkg-source: info: applying 0002-Separate-sdist-and-wheel-inclusions-correctly.patch
I: Not using root during the build.
I: Installing the build-deps
I: user script /srv/workspace/pbuilder/3686440/tmp/hooks/D02_print_environment starting
I: set
  BUILDDIR='/build/reproducible-path'
  BUILDUSERGECOS='first user,first room,first work-phone,first home-phone,first other'
  BUILDUSERNAME='pbuilder1'
  BUILD_ARCH='arm64'
  DEBIAN_FRONTEND='noninteractive'
  DEB_BUILD_OPTIONS='buildinfo=+all reproducible=+all parallel=12 '
  DISTRIBUTION='unstable'
  HOME='/root'
  HOST_ARCH='arm64'
  IFS=' 	
  '
  INVOCATION_ID='e0b41af71aac4c9faee7b16e24670ac3'
  LANG='C'
  LANGUAGE='en_US:en'
  LC_ALL='C'
  MAIL='/var/mail/root'
  OPTIND='1'
  PATH='/usr/sbin:/usr/bin:/sbin:/bin:/usr/games'
  PBCURRENTCOMMANDLINEOPERATION='build'
  PBUILDER_OPERATION='build'
  PBUILDER_PKGDATADIR='/usr/share/pbuilder'
  PBUILDER_PKGLIBDIR='/usr/lib/pbuilder'
  PBUILDER_SYSCONFDIR='/etc'
  PPID='3686440'
  PS1='# '
  PS2='> '
  PS4='+ '
  PWD='/'
  SHELL='/bin/bash'
  SHLVL='2'
  SUDO_COMMAND='/usr/bin/timeout -k 18.1h 18h /usr/bin/ionice -c 3 /usr/bin/nice /usr/sbin/pbuilder --build --configfile /srv/reproducible-results/rbuild-debian/r-b-build.4Lx1zIfc/pbuilderrc_2GFB --distribution unstable --hookdir /etc/pbuilder/first-build-hooks --debbuildopts -b --basetgz /var/cache/pbuilder/unstable-reproducible-base.tgz --buildresult /srv/reproducible-results/rbuild-debian/r-b-build.4Lx1zIfc/b1 --logfile b1/build.log vitables_3.0.3-1.dsc'
  SUDO_GID='109'
  SUDO_UID='104'
  SUDO_USER='jenkins'
  TERM='unknown'
  TZ='/usr/share/zoneinfo/Etc/GMT+12'
  USER='root'
  _='/usr/bin/systemd-run'
  http_proxy='http://192.168.101.4:3128'
I: uname -a
  Linux codethink03-arm64 6.1.0-28-cloud-arm64 #1 SMP Debian 6.1.119-1 (2024-11-22) aarch64 GNU/Linux
I: ls -l /bin
  lrwxrwxrwx 1 root root 7 Nov 22  2024 /bin -> usr/bin
I: user script /srv/workspace/pbuilder/3686440/tmp/hooks/D02_print_environment finished
 -> Attempting to satisfy build-dependencies
 -> Creating pbuilder-satisfydepends-dummy package
Package: pbuilder-satisfydepends-dummy
Version: 0.invalid.0
Architecture: arm64
Maintainer: Debian Pbuilder Team <pbuilder-maint@lists.alioth.debian.org>
Description: Dummy package to satisfy dependencies with aptitude - created by pbuilder
 This package was created automatically by pbuilder to satisfy the
 build-dependencies of the package being currently built.
Depends: debhelper-compat (= 13), dh-python, pybuild-plugin-pyproject, pyqt6-dev-tools, python3, python3-hatchling, python3-numpy, python3-pkg-resources, python3-pyqt6, python3-pytest, python3-pytest-xvfb, python3-qtpy, python3-sphinx, python3-sphinxcontrib.qthelp, python3-tables
dpkg-deb: building package 'pbuilder-satisfydepends-dummy' in '/tmp/satisfydepends-aptitude/pbuilder-satisfydepends-dummy.deb'.
Selecting previously unselected package pbuilder-satisfydepends-dummy.
(Reading database ... 19966 files and directories currently installed.)
Preparing to unpack .../pbuilder-satisfydepends-dummy.deb ...
Unpacking pbuilder-satisfydepends-dummy (0.invalid.0) ...
dpkg: pbuilder-satisfydepends-dummy: dependency problems, but configuring anyway as you requested:
 pbuilder-satisfydepends-dummy depends on debhelper-compat (= 13); however:
  Package debhelper-compat is not installed.
 pbuilder-satisfydepends-dummy depends on dh-python; however:
  Package dh-python is not installed.
 pbuilder-satisfydepends-dummy depends on pybuild-plugin-pyproject; however:
  Package pybuild-plugin-pyproject is not installed.
 pbuilder-satisfydepends-dummy depends on pyqt6-dev-tools; however:
  Package pyqt6-dev-tools is not installed.
 pbuilder-satisfydepends-dummy depends on python3; however:
  Package python3 is not installed.
 pbuilder-satisfydepends-dummy depends on python3-hatchling; however:
  Package python3-hatchling is not installed.
 pbuilder-satisfydepends-dummy depends on python3-numpy; however:
  Package python3-numpy is not installed.
 pbuilder-satisfydepends-dummy depends on python3-pkg-resources; however:
  Package python3-pkg-resources is not installed.
 pbuilder-satisfydepends-dummy depends on python3-pyqt6; however:
  Package python3-pyqt6 is not installed.
 pbuilder-satisfydepends-dummy depends on python3-pytest; however:
  Package python3-pytest is not installed.
 pbuilder-satisfydepends-dummy depends on python3-pytest-xvfb; however:
  Package python3-pytest-xvfb is not installed.
 pbuilder-satisfydepends-dummy depends on python3-qtpy; however:
  Package python3-qtpy is not installed.
 pbuilder-satisfydepends-dummy depends on python3-sphinx; however:
  Package python3-sphinx is not installed.
 pbuilder-satisfydepends-dummy depends on python3-sphinxcontrib.qthelp; however:
  Package python3-sphinxcontrib.qthelp is not installed.
 pbuilder-satisfydepends-dummy depends on python3-tables; however:
  Package python3-tables is not installed.

Setting up pbuilder-satisfydepends-dummy (0.invalid.0) ...
Reading package lists...
Building dependency tree...
Reading state information...
Initializing package states...
Writing extended state information...
Building tag database...
pbuilder-satisfydepends-dummy is already installed at the requested version (0.invalid.0)
pbuilder-satisfydepends-dummy is already installed at the requested version (0.invalid.0)
The following NEW packages will be installed:
  autoconf{a} automake{a} autopoint{a} autotools-dev{a} bsdextrautils{a} ca-certificates{a} debhelper{a} dh-autoreconf{a} dh-python{a} dh-strip-nondeterminism{a} docutils-common{a} dwz{a} file{a} fontconfig{a} fontconfig-config{a} fonts-dejavu-core{a} fonts-dejavu-mono{a} gettext{a} gettext-base{a} groff-base{a} intltool-debian{a} iso-codes{a} libaec0{a} libarchive-zip-perl{a} libasyncns0{a} libavahi-client3{a} libavahi-common-data{a} libavahi-common3{a} libb2-1{a} libblas3{a} libblosc1{a} libblosc2-4{a} libbrotli1{a} libcap2-bin{a} libcom-err2{a} libcups2t64{a} libcurl3t64-gnutls{a} libcurl4t64{a} libdbus-1-3{a} libdebhelper-perl{a} libdouble-conversion3{a} libdrm-amdgpu1{a} libdrm-common{a} libdrm-radeon1{a} libdrm2{a} libduktape207{a} libdw1t64{a} libedit2{a} libegl-mesa0{a} libegl1{a} libelf1t64{a} libevdev2{a} libexpat1{a} libffi8{a} libfile-stripnondeterminism-perl{a} libflac12t64{a} libfontconfig1{a} libfontenc1{a} libfreetype6{a} libgbm1{a} libgcrypt20{a} libgfortran5{a} libgl1{a} libgl1-mesa-dri{a} libglapi-mesa{a} libglib2.0-0t64{a} libglvnd0{a} libglx-mesa0{a} libglx0{a} libgnutls30t64{a} libgpg-error0{a} libgraphite2-3{a} libgssapi-krb5-2{a} libgstreamer-plugins-base1.0-0{a} libgstreamer1.0-0{a} libgudev-1.0-0{a} libharfbuzz0b{a} libhdf5-310{a} libhyphen0{a} libice6{a} libicu72{a} libidn2-0{a} libinput-bin{a} libinput10{a} libjpeg62-turbo{a} libjs-jquery{a} libjs-sphinxdoc{a} libjs-underscore{a} libjson-perl{a} libk5crypto3{a} libkeyutils1{a} libkrb5-3{a} libkrb5support0{a} liblapack3{a} libldap-2.5-0{a} libllvm19{a} liblzo2-2{a} libmagic-mgc{a} libmagic1t64{a} libmd4c0{a} libmp3lame0{a} libmpg123-0t64{a} libmtdev1t64{a} libnghttp2-14{a} libnghttp3-9{a} libngtcp2-16{a} libngtcp2-crypto-gnutls8{a} libogg0{a} libopengl0{a} libopus0{a} liborc-0.4-0t64{a} libp11-kit0{a} libpcre2-16-0{a} libpipeline1{a} libpixman-1-0{a} libpng16-16t64{a} libproxy1v5{a} libpsl5t64{a} libpulse0{a} libpython3-stdlib{a} libpython3.13{a} libpython3.13-minimal{a} libpython3.13-stdlib{a} libqt5charts5{a} libqt5core5t64{a} libqt5dbus5t64{a} libqt5designer5{a} libqt5gui5t64{a} libqt5help5{a} libqt5location5{a} libqt5multimedia5{a} libqt5multimediawidgets5{a} libqt5network5t64{a} libqt5opengl5t64{a} libqt5positioning5{a} libqt5positioningquick5{a} libqt5printsupport5t64{a} libqt5qml5{a} libqt5qmlmodels5{a} libqt5quick5{a} libqt5quickwidgets5{a} libqt5remoteobjects5{a} libqt5sensors5{a} libqt5serialport5{a} libqt5sql5t64{a} libqt5svg5{a} libqt5test5t64{a} libqt5texttospeech5{a} libqt5webchannel5{a} libqt5webkit5{a} libqt5websockets5{a} libqt5widgets5t64{a} libqt5xml5t64{a} libqt5xmlpatterns5{a} libqt6core6t64{a} libqt6dbus6{a} libqt6gui6{a} libqt6network6{a} libqt6opengl6{a} libqt6openglwidgets6{a} libqt6printsupport6{a} libqt6sql6{a} libqt6test6{a} libqt6widgets6{a} libqt6xml6{a} libreadline8t64{a} librtmp1{a} libsasl2-2{a} libsasl2-modules-db{a} libsensors-config{a} libsensors5{a} libsharpyuv0{a} libsm6{a} libsnappy1v5{a} libsndfile1{a} libssh2-1t64{a} libsz2{a} libtasn1-6{a} libtool{a} libts0t64{a} libuchardet0{a} libunistring5{a} libunwind8{a} libvorbis0a{a} libvorbisenc2{a} libvulkan1{a} libwacom-common{a} libwacom9{a} libwayland-client0{a} libwayland-server0{a} libwebp7{a} libwoff1{a} libx11-6{a} libx11-data{a} libx11-xcb1{a} libxau6{a} libxaw7{a} libxcb-cursor0{a} libxcb-dri2-0{a} libxcb-dri3-0{a} libxcb-glx0{a} libxcb-icccm4{a} libxcb-image0{a} libxcb-keysyms1{a} libxcb-present0{a} libxcb-randr0{a} libxcb-render-util0{a} libxcb-render0{a} libxcb-shape0{a} libxcb-shm0{a} libxcb-sync1{a} libxcb-util1{a} libxcb-xfixes0{a} libxcb-xinerama0{a} libxcb-xinput0{a} libxcb-xkb1{a} libxcb1{a} libxdmcp6{a} libxext6{a} libxfixes3{a} libxfont2{a} libxkbcommon-x11-0{a} libxkbcommon0{a} libxkbfile1{a} libxml2{a} libxmu6{a} libxmuu1{a} libxpm4{a} libxrandr2{a} libxrender1{a} libxshmfence1{a} libxslt1.1{a} libxt6t64{a} libxxf86vm1{a} libz3-4{a} m4{a} man-db{a} media-types{a} mesa-libgallium{a} netbase{a} openssl{a} po-debconf{a} pybuild-plugin-pyproject{a} pyqt6-dev-tools{a} python-babel-localedata{a} python-tables-data{a} python3{a} python3-alabaster{a} python3-autocommand{a} python3-babel{a} python3-build{a} python3-certifi{a} python3-chardet{a} python3-charset-normalizer{a} python3-cpuinfo{a} python3-defusedxml{a} python3-docutils{a} python3-easyprocess{a} python3-hatchling{a} python3-idna{a} python3-imagesize{a} python3-inflect{a} python3-iniconfig{a} python3-installer{a} python3-jaraco.context{a} python3-jaraco.functools{a} python3-jaraco.text{a} python3-jinja2{a} python3-markupsafe{a} python3-minimal{a} python3-more-itertools{a} python3-numexpr{a} python3-numpy{a} python3-packaging{a} python3-pathspec{a} python3-pkg-resources{a} python3-pluggy{a} python3-pygments{a} python3-pyproject-hooks{a} python3-pyqt5{a} python3-pyqt5.qtchart{a} python3-pyqt5.qtmultimedia{a} python3-pyqt5.qtopengl{a} python3-pyqt5.qtpositioning{a} python3-pyqt5.qtquick{a} python3-pyqt5.qtremoteobjects{a} python3-pyqt5.qtsensors{a} python3-pyqt5.qtserialport{a} python3-pyqt5.qtsql{a} python3-pyqt5.qtsvg{a} python3-pyqt5.qttexttospeech{a} python3-pyqt5.qtwebchannel{a} python3-pyqt5.qtwebkit{a} python3-pyqt5.qtwebsockets{a} python3-pyqt5.qtxmlpatterns{a} python3-pyqt5.sip{a} python3-pyqt6{a} python3-pyqt6.sip{a} python3-pytest{a} python3-pytest-xvfb{a} python3-pyvirtualdisplay{a} python3-qtpy{a} python3-requests{a} python3-roman{a} python3-setuptools{a} python3-snowballstemmer{a} python3-sphinx{a} python3-sphinxcontrib.qthelp{a} python3-tables{a} python3-tables-lib{a} python3-toml{a} python3-trove-classifiers{a} python3-typeguard{a} python3-typing-extensions{a} python3-urllib3{a} python3-wheel{a} python3-zipp{a} python3.13{a} python3.13-minimal{a} readline-common{a} sensible-utils{a} sgml-base{a} shared-mime-info{a} sphinx-common{a} tzdata{a} x11-common{a} x11-xkb-utils{a} xauth{a} xkb-data{a} xml-core{a} xserver-common{a} xvfb{a} 
The following packages are RECOMMENDED but will NOT be installed:
  curl dbus geoclue-2.0 gstreamer1.0-plugins-base javascript-common krb5-locales libarchive-cpio-perl libglib2.0-data libgpg-error-l10n libjson-xs-perl libldap-common libltdl-dev libmail-sendmail-perl libpam-cap libpaper-utils libqt5sql5-ibase libqt5sql5-mysql libqt5sql5-odbc libqt5sql5-psql libqt5sql5-sqlite libqt5sql5-tds libqt6sql6-ibase libqt6sql6-mysql libqt6sql6-odbc libqt6sql6-psql libqt6sql6-sqlite libsasl2-modules lynx mesa-vulkan-drivers publicsuffix python3-pil python3-pyqt5.qtwebengine qt5-gtk-platformtheme qt6-gtk-platformtheme qt6-qpa-plugins qt6-svg-plugins qt6-translations-l10n qt6-wayland qtspeech5-flite-plugin qtspeech5-speechd-plugin qttranslations5-l10n qtwayland5 wget xdg-user-dirs xfonts-base 
0 packages upgraded, 332 newly installed, 0 to remove and 0 not upgraded.
Need to get 168 MB of archives. After unpacking 733 MB will be used.
Writing extended state information...
Get: 1 http://deb.debian.org/debian unstable/main arm64 libffi8 arm64 3.4.6-1 [20.9 kB]
Get: 2 http://deb.debian.org/debian unstable/main arm64 libglib2.0-0t64 arm64 2.82.4-1 [1411 kB]
Get: 3 http://deb.debian.org/debian unstable/main arm64 libdrm-common all 2.4.123-1 [8084 B]
Get: 4 http://deb.debian.org/debian unstable/main arm64 libdrm2 arm64 2.4.123-1 [38.0 kB]
Get: 5 http://deb.debian.org/debian unstable/main arm64 libelf1t64 arm64 0.192-4 [189 kB]
Get: 6 http://deb.debian.org/debian unstable/main arm64 libdw1t64 arm64 0.192-4 [237 kB]
Get: 7 http://deb.debian.org/debian unstable/main arm64 libunwind8 arm64 1.6.2-3.1 [47.7 kB]
Get: 8 http://deb.debian.org/debian unstable/main arm64 libcap2-bin arm64 1:2.66-5+b1 [34.3 kB]
Get: 9 http://deb.debian.org/debian unstable/main arm64 libgstreamer1.0-0 arm64 1.24.10-2 [1279 kB]
Get: 10 http://deb.debian.org/debian unstable/main arm64 liborc-0.4-0t64 arm64 1:0.4.40-1 [171 kB]
Get: 11 http://deb.debian.org/debian unstable/main arm64 iso-codes all 4.17.0-1 [3055 kB]
Get: 12 http://deb.debian.org/debian unstable/main arm64 libgstreamer-plugins-base1.0-0 arm64 1.24.11-1 [908 kB]
Get: 13 http://deb.debian.org/debian unstable/main arm64 libhyphen0 arm64 2.8.8-7+b2 [30.2 kB]
Get: 14 http://deb.debian.org/debian unstable/main arm64 libicu72 arm64 72.1-5+b1 [9239 kB]
Get: 15 http://deb.debian.org/debian unstable/main arm64 libjpeg62-turbo arm64 1:2.1.5-3+b1 [173 kB]
Get: 16 http://deb.debian.org/debian unstable/main arm64 libpng16-16t64 arm64 1.6.44-3 [273 kB]
Get: 17 http://deb.debian.org/debian unstable/main arm64 libxml2 arm64 2.12.7+dfsg+really2.9.14-0.2+b1 [630 kB]
Get: 18 http://deb.debian.org/debian unstable/main arm64 shared-mime-info arm64 2.4-5+b1 [755 kB]
Get: 19 http://deb.debian.org/debian unstable/main arm64 libdouble-conversion3 arm64 3.3.0-1+b2 [37.3 kB]
Get: 20 http://deb.debian.org/debian unstable/main arm64 libpcre2-16-0 arm64 10.44-5 [230 kB]
Get: 21 http://deb.debian.org/debian unstable/main arm64 libqt5core5t64 arm64 5.15.15+dfsg-2 [1733 kB]
Get: 22 http://deb.debian.org/debian unstable/main arm64 libexpat1 arm64 2.6.4-1 [90.7 kB]
Get: 23 http://deb.debian.org/debian unstable/main arm64 libbrotli1 arm64 1.1.0-2+b6 [297 kB]
Get: 24 http://deb.debian.org/debian unstable/main arm64 libfreetype6 arm64 2.13.3+dfsg-1 [422 kB]
Get: 25 http://deb.debian.org/debian unstable/main arm64 fonts-dejavu-mono all 2.37-8 [489 kB]
Get: 26 http://deb.debian.org/debian unstable/main arm64 fonts-dejavu-core all 2.37-8 [840 kB]
Get: 27 http://deb.debian.org/debian unstable/main arm64 fontconfig-config arm64 2.15.0-1.1+b1 [318 kB]
Get: 28 http://deb.debian.org/debian unstable/main arm64 libfontconfig1 arm64 2.15.0-1.1+b1 [387 kB]
Get: 29 http://deb.debian.org/debian unstable/main arm64 fontconfig arm64 2.15.0-1.1+b1 [463 kB]
Get: 30 http://deb.debian.org/debian unstable/main arm64 libglvnd0 arm64 1.7.0-1+b2 [41.6 kB]
Get: 31 http://deb.debian.org/debian unstable/main arm64 libwayland-server0 arm64 1.23.0-1+b1 [33.4 kB]
Get: 32 http://deb.debian.org/debian unstable/main arm64 libxau6 arm64 1:1.0.11-1 [20.6 kB]
Get: 33 http://deb.debian.org/debian unstable/main arm64 libxdmcp6 arm64 1:1.1.5-1 [27.8 kB]
Get: 34 http://deb.debian.org/debian unstable/main arm64 libxcb1 arm64 1.17.0-2+b1 [143 kB]
Get: 35 http://deb.debian.org/debian unstable/main arm64 libxcb-randr0 arm64 1.17.0-2+b1 [117 kB]
Get: 36 http://deb.debian.org/debian unstable/main arm64 libdrm-amdgpu1 arm64 2.4.123-1 [21.6 kB]
Get: 37 http://deb.debian.org/debian unstable/main arm64 libdrm-radeon1 arm64 2.4.123-1 [21.3 kB]
Get: 38 http://deb.debian.org/debian unstable/main arm64 libglapi-mesa arm64 24.2.8-1 [48.2 kB]
Get: 39 http://deb.debian.org/debian unstable/main arm64 libedit2 arm64 3.1-20240808-1 [89.2 kB]
Get: 40 http://deb.debian.org/debian unstable/main arm64 libz3-4 arm64 4.13.3-1 [7507 kB]
Get: 41 http://deb.debian.org/debian unstable/main arm64 libllvm19 arm64 1:19.1.6-1 [23.3 MB]
Get: 42 http://deb.debian.org/debian unstable/main arm64 libsensors-config all 1:3.6.0-10 [14.6 kB]
Get: 43 http://deb.debian.org/debian unstable/main arm64 libsensors5 arm64 1:3.6.0-10+b1 [34.3 kB]
Get: 44 http://deb.debian.org/debian unstable/main arm64 libx11-data all 2:1.8.10-2 [337 kB]
Get: 45 http://deb.debian.org/debian unstable/main arm64 libx11-6 arm64 2:1.8.10-2 [789 kB]
Get: 46 http://deb.debian.org/debian unstable/main arm64 libx11-xcb1 arm64 2:1.8.10-2 [241 kB]
Get: 47 http://deb.debian.org/debian unstable/main arm64 libxcb-dri2-0 arm64 1.17.0-2+b1 [107 kB]
Get: 48 http://deb.debian.org/debian unstable/main arm64 libxcb-dri3-0 arm64 1.17.0-2+b1 [107 kB]
Get: 49 http://deb.debian.org/debian unstable/main arm64 libxcb-present0 arm64 1.17.0-2+b1 [106 kB]
Get: 50 http://deb.debian.org/debian unstable/main arm64 libxcb-sync1 arm64 1.17.0-2+b1 [109 kB]
Get: 51 http://deb.debian.org/debian unstable/main arm64 libxcb-xfixes0 arm64 1.17.0-2+b1 [110 kB]
Get: 52 http://deb.debian.org/debian unstable/main arm64 libxshmfence1 arm64 1.3-1+b3 [9104 B]
Get: 53 http://deb.debian.org/debian unstable/main arm64 mesa-libgallium arm64 24.2.8-1 [7689 kB]
Get: 54 http://deb.debian.org/debian unstable/main arm64 libgbm1 arm64 24.2.8-1 [42.0 kB]
Get: 55 http://deb.debian.org/debian unstable/main arm64 libwayland-client0 arm64 1.23.0-1+b1 [26.0 kB]
Get: 56 http://deb.debian.org/debian unstable/main arm64 libxcb-shm0 arm64 1.17.0-2+b1 [105 kB]
Get: 57 http://deb.debian.org/debian unstable/main arm64 libegl-mesa0 arm64 24.2.8-1 [124 kB]
Get: 58 http://deb.debian.org/debian unstable/main arm64 libegl1 arm64 1.7.0-1+b2 [34.0 kB]
Get: 59 http://deb.debian.org/debian unstable/main arm64 libxcb-glx0 arm64 1.17.0-2+b1 [123 kB]
Get: 60 http://deb.debian.org/debian unstable/main arm64 libxext6 arm64 2:1.3.4-1+b3 [49.2 kB]
Get: 61 http://deb.debian.org/debian unstable/main arm64 libxfixes3 arm64 1:6.0.0-2+b3 [20.4 kB]
Get: 62 http://deb.debian.org/debian unstable/main arm64 libxxf86vm1 arm64 1:1.1.4-1+b4 [19.2 kB]
Get: 63 http://deb.debian.org/debian unstable/main arm64 libvulkan1 arm64 1.3.296.0-1 [123 kB]
Get: 64 http://deb.debian.org/debian unstable/main arm64 libgl1-mesa-dri arm64 24.2.8-1 [43.6 kB]
Get: 65 http://deb.debian.org/debian unstable/main arm64 libglx-mesa0 arm64 24.2.8-1 [152 kB]
Get: 66 http://deb.debian.org/debian unstable/main arm64 libglx0 arm64 1.7.0-1+b2 [31.1 kB]
Get: 67 http://deb.debian.org/debian unstable/main arm64 libgl1 arm64 1.7.0-1+b2 [90.9 kB]
Get: 68 http://deb.debian.org/debian unstable/main arm64 libgraphite2-3 arm64 1.3.14-2+b1 [70.4 kB]
Get: 69 http://deb.debian.org/debian unstable/main arm64 libharfbuzz0b arm64 10.1.0-2 [443 kB]
Get: 70 http://deb.debian.org/debian unstable/main arm64 x11-common all 1:7.7+23.1 [216 kB]
Get: 71 http://deb.debian.org/debian unstable/main arm64 libice6 arm64 2:1.1.1-1 [62.1 kB]
Get: 72 http://deb.debian.org/debian unstable/main arm64 libevdev2 arm64 1.13.3+dfsg-1 [30.6 kB]
Get: 73 http://deb.debian.org/debian unstable/main arm64 libmtdev1t64 arm64 1.1.6-1.2+b1 [22.5 kB]
Get: 74 http://deb.debian.org/debian unstable/main arm64 libgudev-1.0-0 arm64 238-5+b1 [14.0 kB]
Get: 75 http://deb.debian.org/debian unstable/main arm64 libwacom-common all 2.13.0-1 [98.0 kB]
Get: 76 http://deb.debian.org/debian unstable/main arm64 libwacom9 arm64 2.13.0-1 [22.9 kB]
Get: 77 http://deb.debian.org/debian unstable/main arm64 libinput-bin arm64 1.26.2-1 [25.4 kB]
Get: 78 http://deb.debian.org/debian unstable/main arm64 libinput10 arm64 1.26.2-1 [118 kB]
Get: 79 http://deb.debian.org/debian unstable/main arm64 libmd4c0 arm64 0.5.2-2+b1 [46.1 kB]
Get: 80 http://deb.debian.org/debian unstable/main arm64 libdbus-1-3 arm64 1.16.0-1 [168 kB]
Get: 81 http://deb.debian.org/debian unstable/main arm64 libqt5dbus5t64 arm64 5.15.15+dfsg-2 [206 kB]
Get: 82 http://deb.debian.org/debian unstable/main arm64 libkrb5support0 arm64 1.21.3-3 [32.1 kB]
Get: 83 http://deb.debian.org/debian unstable/main arm64 libcom-err2 arm64 1.47.2-1 [23.9 kB]
Get: 84 http://deb.debian.org/debian unstable/main arm64 libk5crypto3 arm64 1.21.3-3 [80.8 kB]
Get: 85 http://deb.debian.org/debian unstable/main arm64 libkeyutils1 arm64 1.6.3-4 [9352 B]
Get: 86 http://deb.debian.org/debian unstable/main arm64 libkrb5-3 arm64 1.21.3-3 [310 kB]
Get: 87 http://deb.debian.org/debian unstable/main arm64 libgssapi-krb5-2 arm64 1.21.3-3 [126 kB]
Get: 88 http://deb.debian.org/debian unstable/main arm64 libqt5network5t64 arm64 5.15.15+dfsg-2 [650 kB]
Get: 89 http://deb.debian.org/debian unstable/main arm64 libsm6 arm64 2:1.2.4-1 [34.2 kB]
Get: 90 http://deb.debian.org/debian unstable/main arm64 libxcb-icccm4 arm64 0.4.2-1 [27.2 kB]
Get: 91 http://deb.debian.org/debian unstable/main arm64 libxcb-util1 arm64 0.4.0-1+b2 [22.6 kB]
Get: 92 http://deb.debian.org/debian unstable/main arm64 libxcb-image0 arm64 0.4.0-2+b2 [21.9 kB]
Get: 93 http://deb.debian.org/debian unstable/main arm64 libxcb-keysyms1 arm64 0.4.0-1+b3 [15.8 kB]
Get: 94 http://deb.debian.org/debian unstable/main arm64 libxcb-render0 arm64 1.17.0-2+b1 [115 kB]
Get: 95 http://deb.debian.org/debian unstable/main arm64 libxcb-render-util0 arm64 0.3.9-1+b2 [17.5 kB]
Get: 96 http://deb.debian.org/debian unstable/main arm64 libxcb-shape0 arm64 1.17.0-2+b1 [106 kB]
Get: 97 http://deb.debian.org/debian unstable/main arm64 libxcb-xinerama0 arm64 1.17.0-2+b1 [105 kB]
Get: 98 http://deb.debian.org/debian unstable/main arm64 libxcb-xinput0 arm64 1.17.0-2+b1 [130 kB]
Get: 99 http://deb.debian.org/debian unstable/main arm64 libxcb-xkb1 arm64 1.17.0-2+b1 [129 kB]
Get: 100 http://deb.debian.org/debian unstable/main arm64 xkb-data all 2.42-1 [790 kB]
Get: 101 http://deb.debian.org/debian unstable/main arm64 libxkbcommon0 arm64 1.7.0-2 [106 kB]
Get: 102 http://deb.debian.org/debian unstable/main arm64 libxkbcommon-x11-0 arm64 1.7.0-2 [15.2 kB]
Get: 103 http://deb.debian.org/debian unstable/main arm64 libxrender1 arm64 1:0.9.10-1.1+b3 [27.2 kB]
Get: 104 http://deb.debian.org/debian unstable/main arm64 libqt5gui5t64 arm64 5.15.15+dfsg-2 [3196 kB]
Get: 105 http://deb.debian.org/debian unstable/main arm64 libqt5positioning5 arm64 5.15.15+dfsg-2 [192 kB]
Get: 106 http://deb.debian.org/debian unstable/main arm64 libavahi-common-data arm64 0.8-16 [112 kB]
Get: 107 http://deb.debian.org/debian unstable/main arm64 libavahi-common3 arm64 0.8-16 [43.3 kB]
Get: 108 http://deb.debian.org/debian unstable/main arm64 libavahi-client3 arm64 0.8-16 [46.7 kB]
Get: 109 http://deb.debian.org/debian unstable/main arm64 libunistring5 arm64 1.3-1 [449 kB]
Get: 110 http://deb.debian.org/debian unstable/main arm64 libidn2-0 arm64 2.3.7-2+b1 [127 kB]
Get: 111 http://deb.debian.org/debian unstable/main arm64 libp11-kit0 arm64 0.25.5-3 [409 kB]
Get: 112 http://deb.debian.org/debian unstable/main arm64 libtasn1-6 arm64 4.19.0-3+b3 [46.9 kB]
Get: 113 http://deb.debian.org/debian unstable/main arm64 libgnutls30t64 arm64 3.8.8-2 [1363 kB]
Get: 114 http://deb.debian.org/debian unstable/main arm64 libcups2t64 arm64 2.4.10-2+b1 [236 kB]
Get: 115 http://deb.debian.org/debian unstable/main arm64 libqt5widgets5t64 arm64 5.15.15+dfsg-2 [2287 kB]
Get: 116 http://deb.debian.org/debian unstable/main arm64 libqt5printsupport5t64 arm64 5.15.15+dfsg-2 [198 kB]
Get: 117 http://deb.debian.org/debian unstable/main arm64 libqt5qml5 arm64 5.15.15+dfsg-3 [1289 kB]
Get: 118 http://deb.debian.org/debian unstable/main arm64 libqt5qmlmodels5 arm64 5.15.15+dfsg-3 [185 kB]
Get: 119 http://deb.debian.org/debian unstable/main arm64 libqt5quick5 arm64 5.15.15+dfsg-3 [1522 kB]
Get: 120 http://deb.debian.org/debian unstable/main arm64 libqt5sensors5 arm64 5.15.15-2 [109 kB]
Get: 121 http://deb.debian.org/debian unstable/main arm64 libqt5webchannel5 arm64 5.15.15-2 [56.3 kB]
Get: 122 http://deb.debian.org/debian unstable/main arm64 libsharpyuv0 arm64 1.4.0-0.1+b1 [112 kB]
Get: 123 http://deb.debian.org/debian unstable/main arm64 libwebp7 arm64 1.4.0-0.1+b1 [268 kB]
Get: 124 http://deb.debian.org/debian unstable/main arm64 libwoff1 arm64 1.0.2-2+b2 [41.7 kB]
Get: 125 http://deb.debian.org/debian unstable/main arm64 libgpg-error0 arm64 1.51-3 [78.5 kB]
Get: 126 http://deb.debian.org/debian unstable/main arm64 libgcrypt20 arm64 1.11.0-7 [742 kB]
Get: 127 http://deb.debian.org/debian unstable/main arm64 libxslt1.1 arm64 1.1.35-1.1+b1 [222 kB]
Get: 128 http://deb.debian.org/debian unstable/main arm64 libqt5webkit5 arm64 5.212.0~alpha4-41 [10.5 MB]
Get: 129 http://deb.debian.org/debian unstable/main arm64 libpython3.13-minimal arm64 3.13.1-3 [852 kB]
Get: 130 http://deb.debian.org/debian unstable/main arm64 python3.13-minimal arm64 3.13.1-3 [1990 kB]
Get: 131 http://deb.debian.org/debian unstable/main arm64 python3-minimal arm64 3.13.1-1 [27.0 kB]
Get: 132 http://deb.debian.org/debian unstable/main arm64 media-types all 10.1.0 [26.9 kB]
Get: 133 http://deb.debian.org/debian unstable/main arm64 netbase all 6.4 [12.8 kB]
Get: 134 http://deb.debian.org/debian unstable/main arm64 tzdata all 2024b-4 [256 kB]
Get: 135 http://deb.debian.org/debian unstable/main arm64 readline-common all 8.2-6 [69.4 kB]
Get: 136 http://deb.debian.org/debian unstable/main arm64 libreadline8t64 arm64 8.2-6 [159 kB]
Get: 137 http://deb.debian.org/debian unstable/main arm64 libpython3.13-stdlib arm64 3.13.1-3 [1912 kB]
Get: 138 http://deb.debian.org/debian unstable/main arm64 python3.13 arm64 3.13.1-3 [740 kB]
Get: 139 http://deb.debian.org/debian unstable/main arm64 libpython3-stdlib arm64 3.13.1-1 [9912 B]
Get: 140 http://deb.debian.org/debian unstable/main arm64 python3 arm64 3.13.1-1 [28.0 kB]
Get: 141 http://deb.debian.org/debian unstable/main arm64 sgml-base all 1.31 [15.4 kB]
Get: 142 http://deb.debian.org/debian unstable/main arm64 sensible-utils all 0.0.24 [24.8 kB]
Get: 143 http://deb.debian.org/debian unstable/main arm64 openssl arm64 3.4.0-2 [1385 kB]
Get: 144 http://deb.debian.org/debian unstable/main arm64 ca-certificates all 20241223 [164 kB]
Get: 145 http://deb.debian.org/debian unstable/main arm64 libmagic-mgc arm64 1:5.45-3+b1 [314 kB]
Get: 146 http://deb.debian.org/debian unstable/main arm64 libmagic1t64 arm64 1:5.45-3+b1 [102 kB]
Get: 147 http://deb.debian.org/debian unstable/main arm64 file arm64 1:5.45-3+b1 [43.4 kB]
Get: 148 http://deb.debian.org/debian unstable/main arm64 gettext-base arm64 0.22.5-4 [198 kB]
Get: 149 http://deb.debian.org/debian unstable/main arm64 libuchardet0 arm64 0.0.8-1+b2 [69.2 kB]
Get: 150 http://deb.debian.org/debian unstable/main arm64 groff-base arm64 1.23.0-7 [1129 kB]
Get: 151 http://deb.debian.org/debian unstable/main arm64 bsdextrautils arm64 2.40.2-14 [91.5 kB]
Get: 152 http://deb.debian.org/debian unstable/main arm64 libpipeline1 arm64 1.5.8-1 [40.2 kB]
Get: 153 http://deb.debian.org/debian unstable/main arm64 man-db arm64 2.13.0-1 [1404 kB]
Get: 154 http://deb.debian.org/debian unstable/main arm64 m4 arm64 1.4.19-5 [284 kB]
Get: 155 http://deb.debian.org/debian unstable/main arm64 autoconf all 2.72-3 [493 kB]
Get: 156 http://deb.debian.org/debian unstable/main arm64 autotools-dev all 20220109.1 [51.6 kB]
Get: 157 http://deb.debian.org/debian unstable/main arm64 automake all 1:1.16.5-1.3 [823 kB]
Get: 158 http://deb.debian.org/debian unstable/main arm64 autopoint all 0.22.5-4 [723 kB]
Get: 159 http://deb.debian.org/debian unstable/main arm64 libdebhelper-perl all 13.23 [90.6 kB]
Get: 160 http://deb.debian.org/debian unstable/main arm64 libtool all 2.5.4-2 [539 kB]
Get: 161 http://deb.debian.org/debian unstable/main arm64 dh-autoreconf all 20 [17.1 kB]
Get: 162 http://deb.debian.org/debian unstable/main arm64 libarchive-zip-perl all 1.68-1 [104 kB]
Get: 163 http://deb.debian.org/debian unstable/main arm64 libfile-stripnondeterminism-perl all 1.14.0-1 [19.5 kB]
Get: 164 http://deb.debian.org/debian unstable/main arm64 dh-strip-nondeterminism all 1.14.0-1 [8448 B]
Get: 165 http://deb.debian.org/debian unstable/main arm64 dwz arm64 0.15-1+b1 [102 kB]
Get: 166 http://deb.debian.org/debian unstable/main arm64 gettext arm64 0.22.5-4 [1532 kB]
Get: 167 http://deb.debian.org/debian unstable/main arm64 intltool-debian all 0.35.0+20060710.6 [22.9 kB]
Get: 168 http://deb.debian.org/debian unstable/main arm64 po-debconf all 1.0.21+nmu1 [248 kB]
Get: 169 http://deb.debian.org/debian unstable/main arm64 debhelper all 13.23 [919 kB]
Get: 170 http://deb.debian.org/debian unstable/main arm64 python3-autocommand all 2.2.2-3 [13.6 kB]
Get: 171 http://deb.debian.org/debian unstable/main arm64 python3-more-itertools all 10.5.0-1 [63.8 kB]
Get: 172 http://deb.debian.org/debian unstable/main arm64 python3-typing-extensions all 4.12.2-2 [73.0 kB]
Get: 173 http://deb.debian.org/debian unstable/main arm64 python3-typeguard all 4.4.1-1 [37.0 kB]
Get: 174 http://deb.debian.org/debian unstable/main arm64 python3-inflect all 7.3.1-2 [32.4 kB]
Get: 175 http://deb.debian.org/debian unstable/main arm64 python3-jaraco.context all 6.0.0-1 [7984 B]
Get: 176 http://deb.debian.org/debian unstable/main arm64 python3-jaraco.functools all 4.1.0-1 [12.0 kB]
Get: 177 http://deb.debian.org/debian unstable/main arm64 python3-pkg-resources all 75.6.0-1 [222 kB]
Get: 178 http://deb.debian.org/debian unstable/main arm64 python3-jaraco.text all 4.0.0-1 [11.4 kB]
Get: 179 http://deb.debian.org/debian unstable/main arm64 python3-zipp all 3.21.0-1 [10.6 kB]
Get: 180 http://deb.debian.org/debian unstable/main arm64 python3-setuptools all 75.6.0-1 [720 kB]
Get: 181 http://deb.debian.org/debian unstable/main arm64 dh-python all 6.20241217 [113 kB]
Get: 182 http://deb.debian.org/debian unstable/main arm64 xml-core all 0.19 [20.1 kB]
Get: 183 http://deb.debian.org/debian unstable/main arm64 docutils-common all 0.21.2+dfsg-2 [128 kB]
Get: 184 http://deb.debian.org/debian unstable/main arm64 libaec0 arm64 1.1.3-1+b1 [22.5 kB]
Get: 185 http://deb.debian.org/debian unstable/main arm64 libasyncns0 arm64 0.8-6+b5 [11.7 kB]
Get: 186 http://deb.debian.org/debian unstable/main arm64 libb2-1 arm64 0.98.1-1.1+b2 [16.3 kB]
Get: 187 http://deb.debian.org/debian unstable/main arm64 libblas3 arm64 3.12.0-4 [98.7 kB]
Get: 188 http://deb.debian.org/debian unstable/main arm64 libsnappy1v5 arm64 1.2.1-1+b1 [28.7 kB]
Get: 189 http://deb.debian.org/debian unstable/main arm64 libblosc1 arm64 1.21.5+ds-1+b2 [39.2 kB]
Get: 190 http://deb.debian.org/debian unstable/main arm64 libblosc2-4 arm64 2.15.2+ds-5 [165 kB]
Get: 191 http://deb.debian.org/debian unstable/main arm64 libsasl2-modules-db arm64 2.1.28+dfsg1-8 [20.0 kB]
Get: 192 http://deb.debian.org/debian unstable/main arm64 libsasl2-2 arm64 2.1.28+dfsg1-8 [55.4 kB]
Get: 193 http://deb.debian.org/debian unstable/main arm64 libldap-2.5-0 arm64 2.5.19+dfsg-1 [175 kB]
Get: 194 http://deb.debian.org/debian unstable/main arm64 libnghttp2-14 arm64 1.64.0-1 [71.3 kB]
Get: 195 http://deb.debian.org/debian unstable/main arm64 libnghttp3-9 arm64 1.6.0-2 [60.5 kB]
Get: 196 http://deb.debian.org/debian unstable/main arm64 libngtcp2-16 arm64 1.9.1-1 [109 kB]
Get: 197 http://deb.debian.org/debian unstable/main arm64 libngtcp2-crypto-gnutls8 arm64 1.9.1-1 [17.3 kB]
Get: 198 http://deb.debian.org/debian unstable/main arm64 libpsl5t64 arm64 0.21.2-1.1+b1 [57.1 kB]
Get: 199 http://deb.debian.org/debian unstable/main arm64 librtmp1 arm64 2.4+20151223.gitfa8646d.1-2+b5 [56.8 kB]
Get: 200 http://deb.debian.org/debian unstable/main arm64 libssh2-1t64 arm64 1.11.1-1 [235 kB]
Get: 201 http://deb.debian.org/debian unstable/main arm64 libcurl3t64-gnutls arm64 8.11.1-1 [332 kB]
Get: 202 http://deb.debian.org/debian unstable/main arm64 libcurl4t64 arm64 8.11.1-1 [325 kB]
Get: 203 http://deb.debian.org/debian unstable/main arm64 libduktape207 arm64 2.7.0-2+b2 [127 kB]
Get: 204 http://deb.debian.org/debian unstable/main arm64 libogg0 arm64 1.3.5-3+b2 [23.6 kB]
Get: 205 http://deb.debian.org/debian unstable/main arm64 libflac12t64 arm64 1.4.3+ds-4 [170 kB]
Get: 206 http://deb.debian.org/debian unstable/main arm64 libfontenc1 arm64 1:1.1.8-1+b2 [22.5 kB]
Get: 207 http://deb.debian.org/debian unstable/main arm64 libgfortran5 arm64 14.2.0-12 [361 kB]
Get: 208 http://deb.debian.org/debian unstable/main arm64 libsz2 arm64 1.1.3-1+b1 [8044 B]
Get: 209 http://deb.debian.org/debian unstable/main arm64 libhdf5-310 arm64 1.14.5+repack-3 [1155 kB]
Get: 210 http://deb.debian.org/debian unstable/main arm64 libjs-jquery all 3.6.1+dfsg+~3.5.14-1 [326 kB]
Get: 211 http://deb.debian.org/debian unstable/main arm64 libjs-underscore all 1.13.4~dfsg+~1.11.4-3 [116 kB]
Get: 212 http://deb.debian.org/debian unstable/main arm64 libjs-sphinxdoc all 8.1.3-4 [30.4 kB]
Get: 213 http://deb.debian.org/debian unstable/main arm64 libjson-perl all 4.10000-1 [87.5 kB]
Get: 214 http://deb.debian.org/debian unstable/main arm64 liblapack3 arm64 3.12.0-4 [1812 kB]
Get: 215 http://deb.debian.org/debian unstable/main arm64 liblzo2-2 arm64 2.10-3+b1 [49.6 kB]
Get: 216 http://deb.debian.org/debian unstable/main arm64 libmp3lame0 arm64 3.100-6+b3 [355 kB]
Get: 217 http://deb.debian.org/debian unstable/main arm64 libmpg123-0t64 arm64 1.32.10-1 [142 kB]
Get: 218 http://deb.debian.org/debian unstable/main arm64 libopus0 arm64 1.5.2-2 [2813 kB]
Get: 219 http://deb.debian.org/debian unstable/main arm64 libpixman-1-0 arm64 0.44.0-3 [168 kB]
Get: 220 http://deb.debian.org/debian unstable/main arm64 libproxy1v5 arm64 0.5.9-1 [25.4 kB]
Get: 221 http://deb.debian.org/debian unstable/main arm64 libvorbis0a arm64 1.3.7-2+b1 [84.5 kB]
Get: 222 http://deb.debian.org/debian unstable/main arm64 libvorbisenc2 arm64 1.3.7-2+b1 [76.3 kB]
Get: 223 http://deb.debian.org/debian unstable/main arm64 libsndfile1 arm64 1.2.2-2 [186 kB]
Get: 224 http://deb.debian.org/debian unstable/main arm64 libpulse0 arm64 17.0+dfsg1-1 [236 kB]
Get: 225 http://deb.debian.org/debian unstable/main arm64 libpython3.13 arm64 3.13.1-3 [1971 kB]
Get: 226 http://deb.debian.org/debian unstable/main arm64 libqt5charts5 arm64 5.15.15-2 [432 kB]
Get: 227 http://deb.debian.org/debian unstable/main arm64 libqt5xml5t64 arm64 5.15.15+dfsg-2 [121 kB]
Get: 228 http://deb.debian.org/debian unstable/main arm64 libqt5designer5 arm64 5.15.15-4 [2721 kB]
Get: 229 http://deb.debian.org/debian unstable/main arm64 libqt5sql5t64 arm64 5.15.15+dfsg-2 [120 kB]
Get: 230 http://deb.debian.org/debian unstable/main arm64 libqt5help5 arm64 5.15.15-4 [145 kB]
Get: 231 http://deb.debian.org/debian unstable/main arm64 libqt5positioningquick5 arm64 5.15.15+dfsg-2 [42.5 kB]
Get: 232 http://deb.debian.org/debian unstable/main arm64 libqt5location5 arm64 5.15.15+dfsg-2 [662 kB]
Get: 233 http://deb.debian.org/debian unstable/main arm64 libqt5multimedia5 arm64 5.15.15-2 [274 kB]
Get: 234 http://deb.debian.org/debian unstable/main arm64 libqt5multimediawidgets5 arm64 5.15.15-2 [38.7 kB]
Get: 235 http://deb.debian.org/debian unstable/main arm64 libqt5opengl5t64 arm64 5.15.15+dfsg-2 [144 kB]
Get: 236 http://deb.debian.org/debian unstable/main arm64 libqt5quickwidgets5 arm64 5.15.15+dfsg-3 [39.7 kB]
Get: 237 http://deb.debian.org/debian unstable/main arm64 libqt5remoteobjects5 arm64 5.15.15-2 [196 kB]
Get: 238 http://deb.debian.org/debian unstable/main arm64 libqt5serialport5 arm64 5.15.15-2 [32.3 kB]
Get: 239 http://deb.debian.org/debian unstable/main arm64 libqt5svg5 arm64 5.15.15-2 [128 kB]
Get: 240 http://deb.debian.org/debian unstable/main arm64 libqt5test5t64 arm64 5.15.15+dfsg-2 [139 kB]
Get: 241 http://deb.debian.org/debian unstable/main arm64 libqt5texttospeech5 arm64 5.15.15-2 [19.9 kB]
Get: 242 http://deb.debian.org/debian unstable/main arm64 libqt5websockets5 arm64 5.15.15-2 [59.5 kB]
Get: 243 http://deb.debian.org/debian unstable/main arm64 libqt5xmlpatterns5 arm64 5.15.15-2 [907 kB]
Get: 244 http://deb.debian.org/debian unstable/main arm64 libqt6core6t64 arm64 6.7.2+dfsg-5 [1644 kB]
Get: 245 http://deb.debian.org/debian unstable/main arm64 libqt6dbus6 arm64 6.7.2+dfsg-5 [243 kB]
Get: 246 http://deb.debian.org/debian unstable/main arm64 libopengl0 arm64 1.7.0-1+b2 [32.1 kB]
Get: 247 http://deb.debian.org/debian unstable/main arm64 libts0t64 arm64 1.22-1.1+b1 [61.6 kB]
Get: 248 http://deb.debian.org/debian unstable/main arm64 libxcb-cursor0 arm64 0.1.4-1+b2 [17.0 kB]
Get: 249 http://deb.debian.org/debian unstable/main arm64 libqt6gui6 arm64 6.7.2+dfsg-5 [2749 kB]
Get: 250 http://deb.debian.org/debian unstable/main arm64 libqt6network6 arm64 6.7.2+dfsg-5 [717 kB]
Get: 251 http://deb.debian.org/debian unstable/main arm64 libqt6opengl6 arm64 6.7.2+dfsg-5 [380 kB]
Get: 252 http://deb.debian.org/debian unstable/main arm64 libqt6widgets6 arm64 6.7.2+dfsg-5 [2441 kB]
Get: 253 http://deb.debian.org/debian unstable/main arm64 libqt6openglwidgets6 arm64 6.7.2+dfsg-5 [48.8 kB]
Get: 254 http://deb.debian.org/debian unstable/main arm64 libqt6printsupport6 arm64 6.7.2+dfsg-5 [205 kB]
Get: 255 http://deb.debian.org/debian unstable/main arm64 libqt6sql6 arm64 6.7.2+dfsg-5 [131 kB]
Get: 256 http://deb.debian.org/debian unstable/main arm64 libqt6test6 arm64 6.7.2+dfsg-5 [158 kB]
Get: 257 http://deb.debian.org/debian unstable/main arm64 libqt6xml6 arm64 6.7.2+dfsg-5 [82.0 kB]
Get: 258 http://deb.debian.org/debian unstable/main arm64 libxt6t64 arm64 1:1.2.1-1.2+b2 [173 kB]
Get: 259 http://deb.debian.org/debian unstable/main arm64 libxmu6 arm64 2:1.1.3-3+b4 [55.7 kB]
Get: 260 http://deb.debian.org/debian unstable/main arm64 libxpm4 arm64 1:3.5.17-1+b3 [53.4 kB]
Get: 261 http://deb.debian.org/debian unstable/main arm64 libxaw7 arm64 2:1.0.16-1 [195 kB]
Get: 262 http://deb.debian.org/debian unstable/main arm64 libxfont2 arm64 1:2.0.6-1+b3 [124 kB]
Get: 263 http://deb.debian.org/debian unstable/main arm64 libxkbfile1 arm64 1:1.1.0-1+b3 [72.2 kB]
Get: 264 http://deb.debian.org/debian unstable/main arm64 libxmuu1 arm64 2:1.1.3-3+b4 [22.0 kB]
Get: 265 http://deb.debian.org/debian unstable/main arm64 libxrandr2 arm64 2:1.5.4-1+b2 [36.0 kB]
Get: 266 http://deb.debian.org/debian unstable/main arm64 python3-packaging all 24.2-1 [55.3 kB]
Get: 267 http://deb.debian.org/debian unstable/main arm64 python3-pyproject-hooks all 1.2.0-1 [11.7 kB]
Get: 268 http://deb.debian.org/debian unstable/main arm64 python3-toml all 0.10.2-1 [16.2 kB]
Get: 269 http://deb.debian.org/debian unstable/main arm64 python3-wheel all 0.45.1-1 [56.7 kB]
Get: 270 http://deb.debian.org/debian unstable/main arm64 python3-build all 1.2.2-1 [36.0 kB]
Get: 271 http://deb.debian.org/debian unstable/main arm64 python3-installer all 0.7.0+dfsg1-3 [18.6 kB]
Get: 272 http://deb.debian.org/debian unstable/main arm64 pybuild-plugin-pyproject all 6.20241217 [11.5 kB]
Get: 273 http://deb.debian.org/debian unstable/main arm64 python3-pyqt6.sip arm64 13.9.1-1 [56.4 kB]
Get: 274 http://deb.debian.org/debian unstable/main arm64 python3-pyqt6 arm64 6.8.0-1+b1 [2375 kB]
Get: 275 http://deb.debian.org/debian unstable/main arm64 pyqt6-dev-tools all 6.8.0-1 [72.2 kB]
Get: 276 http://deb.debian.org/debian unstable/main arm64 python-babel-localedata all 2.16.0-1 [5696 kB]
Get: 277 http://deb.debian.org/debian unstable/main arm64 python-tables-data all 3.10.1-2 [49.6 kB]
Get: 278 http://deb.debian.org/debian unstable/main arm64 python3-alabaster all 0.7.16-0.1 [27.9 kB]
Get: 279 http://deb.debian.org/debian unstable/main arm64 python3-babel all 2.16.0-1 [114 kB]
Get: 280 http://deb.debian.org/debian unstable/main arm64 python3-certifi all 2024.12.14+ds-1 [9624 B]
Get: 281 http://deb.debian.org/debian unstable/main arm64 python3-chardet all 5.2.0+dfsg-1 [107 kB]
Get: 282 http://deb.debian.org/debian unstable/main arm64 python3-charset-normalizer arm64 3.4.0-1+b1 [129 kB]
Get: 283 http://deb.debian.org/debian unstable/main arm64 python3-cpuinfo all 9.0.0+git20221119-2 [23.4 kB]
Get: 284 http://deb.debian.org/debian unstable/main arm64 python3-defusedxml all 0.7.1-3 [43.4 kB]
Get: 285 http://deb.debian.org/debian unstable/main arm64 python3-roman all 4.2-1 [10.4 kB]
Get: 286 http://deb.debian.org/debian unstable/main arm64 python3-docutils all 0.21.2+dfsg-2 [403 kB]
Get: 287 http://deb.debian.org/debian unstable/main arm64 python3-easyprocess all 1.1-1 [9952 B]
Get: 288 http://deb.debian.org/debian unstable/main arm64 python3-pathspec all 0.12.1-1 [28.1 kB]
Get: 289 http://deb.debian.org/debian unstable/main arm64 python3-pluggy all 1.5.0-1 [26.9 kB]
Get: 290 http://deb.debian.org/debian unstable/main arm64 python3-trove-classifiers all 2024.9.12-1 [10.2 kB]
Get: 291 http://deb.debian.org/debian unstable/main arm64 python3-hatchling all 1.27.0-1 [47.0 kB]
Get: 292 http://deb.debian.org/debian unstable/main arm64 python3-idna all 3.8-2 [41.6 kB]
Get: 293 http://deb.debian.org/debian unstable/main arm64 python3-imagesize all 1.4.1-1 [6688 B]
Get: 294 http://deb.debian.org/debian unstable/main arm64 python3-iniconfig all 1.1.1-2 [6396 B]
Get: 295 http://deb.debian.org/debian unstable/main arm64 python3-markupsafe arm64 2.1.5-1+b3 [14.0 kB]
Get: 296 http://deb.debian.org/debian unstable/main arm64 python3-jinja2 all 3.1.3-2 [120 kB]
Get: 297 http://deb.debian.org/debian unstable/main arm64 python3-numpy arm64 1:1.26.4+ds-12 [3816 kB]
Get: 298 http://deb.debian.org/debian unstable/main arm64 python3-numexpr arm64 2.10.2-1 [126 kB]
Get: 299 http://deb.debian.org/debian unstable/main arm64 python3-pygments all 2.18.0+dfsg-1 [836 kB]
Get: 300 http://deb.debian.org/debian unstable/main arm64 python3-pyqt5.sip arm64 12.16.1-1 [65.7 kB]
Get: 301 http://deb.debian.org/debian unstable/main arm64 python3-pyqt5 arm64 5.15.11+dfsg-1+b3 [2325 kB]
Get: 302 http://deb.debian.org/debian unstable/main arm64 python3-pyqt5.qtchart arm64 5.15.7+dfsg-1+b1 [131 kB]
Get: 303 http://deb.debian.org/debian unstable/main arm64 python3-pyqt5.qtmultimedia arm64 5.15.11+dfsg-1+b3 [289 kB]
Get: 304 http://deb.debian.org/debian unstable/main arm64 python3-pyqt5.qtopengl arm64 5.15.11+dfsg-1+b3 [199 kB]
Get: 305 http://deb.debian.org/debian unstable/main arm64 python3-pyqt5.qtpositioning arm64 5.15.11+dfsg-1+b3 [227 kB]
Get: 306 http://deb.debian.org/debian unstable/main arm64 python3-pyqt5.qtquick arm64 5.15.11+dfsg-1+b3 [426 kB]
Get: 307 http://deb.debian.org/debian unstable/main arm64 python3-pyqt5.qtremoteobjects arm64 5.15.11+dfsg-1+b3 [128 kB]
Get: 308 http://deb.debian.org/debian unstable/main arm64 python3-pyqt5.qtsensors arm64 5.15.11+dfsg-1+b3 [144 kB]
Get: 309 http://deb.debian.org/debian unstable/main arm64 python3-pyqt5.qtserialport arm64 5.15.11+dfsg-1+b3 [121 kB]
Get: 310 http://deb.debian.org/debian unstable/main arm64 python3-pyqt5.qtsql arm64 5.15.11+dfsg-1+b3 [175 kB]
Get: 311 http://deb.debian.org/debian unstable/main arm64 python3-pyqt5.qtsvg arm64 5.15.11+dfsg-1+b3 [123 kB]
Get: 312 http://deb.debian.org/debian unstable/main arm64 python3-pyqt5.qttexttospeech arm64 5.15.11+dfsg-1+b3 [112 kB]
Get: 313 http://deb.debian.org/debian unstable/main arm64 python3-pyqt5.qtwebchannel arm64 5.15.11+dfsg-1+b3 [110 kB]
Get: 314 http://deb.debian.org/debian unstable/main arm64 python3-pyqt5.qtwebkit arm64 5.15.11+dfsg-1+b3 [192 kB]
Get: 315 http://deb.debian.org/debian unstable/main arm64 python3-pyqt5.qtwebsockets arm64 5.15.11+dfsg-1+b3 [121 kB]
Get: 316 http://deb.debian.org/debian unstable/main arm64 python3-pyqt5.qtxmlpatterns arm64 5.15.11+dfsg-1+b3 [135 kB]
Get: 317 http://deb.debian.org/debian unstable/main arm64 python3-pytest all 8.3.4-1 [250 kB]
Get: 318 http://deb.debian.org/debian unstable/main arm64 x11-xkb-utils arm64 7.7+9 [149 kB]
Get: 319 http://deb.debian.org/debian unstable/main arm64 xserver-common all 2:21.1.15-2 [2399 kB]
Get: 320 http://deb.debian.org/debian unstable/main arm64 xvfb arm64 2:21.1.15-2 [3112 kB]
Get: 321 http://deb.debian.org/debian unstable/main arm64 python3-pyvirtualdisplay all 2.2-2 [13.7 kB]
Get: 322 http://deb.debian.org/debian unstable/main arm64 xauth arm64 1:1.1.2-1.1 [35.4 kB]
Get: 323 http://deb.debian.org/debian unstable/main arm64 python3-pytest-xvfb all 3.0.0-2 [8180 B]
Get: 324 http://deb.debian.org/debian unstable/main arm64 python3-qtpy all 2.4.2-4 [69.0 kB]
Get: 325 http://deb.debian.org/debian unstable/main arm64 python3-urllib3 all 2.2.3-4 [112 kB]
Get: 326 http://deb.debian.org/debian unstable/main arm64 python3-requests all 2.32.3+dfsg-1 [71.9 kB]
Get: 327 http://deb.debian.org/debian unstable/main arm64 python3-snowballstemmer all 2.2.0-4 [58.0 kB]
Get: 328 http://deb.debian.org/debian unstable/main arm64 sphinx-common all 8.1.3-4 [616 kB]
Get: 329 http://deb.debian.org/debian unstable/main arm64 python3-sphinx all 8.1.3-4 [468 kB]
Get: 330 http://deb.debian.org/debian unstable/main arm64 python3-sphinxcontrib.qthelp all 2.0.0-1 [16.1 kB]
Get: 331 http://deb.debian.org/debian unstable/main arm64 python3-tables-lib arm64 3.10.1-2 [624 kB]
Get: 332 http://deb.debian.org/debian unstable/main arm64 python3-tables all 3.10.1-2 [355 kB]
Fetched 168 MB in 1s (149 MB/s)
Preconfiguring packages ...
Selecting previously unselected package libffi8:arm64.
(Reading database ... 
(Reading database ... 5%
(Reading database ... 10%
(Reading database ... 15%
(Reading database ... 20%
(Reading database ... 25%
(Reading database ... 30%
(Reading database ... 35%
(Reading database ... 40%
(Reading database ... 45%
(Reading database ... 50%
(Reading database ... 55%
(Reading database ... 60%
(Reading database ... 65%
(Reading database ... 70%
(Reading database ... 75%
(Reading database ... 80%
(Reading database ... 85%
(Reading database ... 90%
(Reading database ... 95%
(Reading database ... 100%
(Reading database ... 19966 files and directories currently installed.)
Preparing to unpack .../000-libffi8_3.4.6-1_arm64.deb ...
Unpacking libffi8:arm64 (3.4.6-1) ...
Selecting previously unselected package libglib2.0-0t64:arm64.
Preparing to unpack .../001-libglib2.0-0t64_2.82.4-1_arm64.deb ...
Unpacking libglib2.0-0t64:arm64 (2.82.4-1) ...
Selecting previously unselected package libdrm-common.
Preparing to unpack .../002-libdrm-common_2.4.123-1_all.deb ...
Unpacking libdrm-common (2.4.123-1) ...
Selecting previously unselected package libdrm2:arm64.
Preparing to unpack .../003-libdrm2_2.4.123-1_arm64.deb ...
Unpacking libdrm2:arm64 (2.4.123-1) ...
Selecting previously unselected package libelf1t64:arm64.
Preparing to unpack .../004-libelf1t64_0.192-4_arm64.deb ...
Unpacking libelf1t64:arm64 (0.192-4) ...
Selecting previously unselected package libdw1t64:arm64.
Preparing to unpack .../005-libdw1t64_0.192-4_arm64.deb ...
Unpacking libdw1t64:arm64 (0.192-4) ...
Selecting previously unselected package libunwind8:arm64.
Preparing to unpack .../006-libunwind8_1.6.2-3.1_arm64.deb ...
Unpacking libunwind8:arm64 (1.6.2-3.1) ...
Selecting previously unselected package libcap2-bin.
Preparing to unpack .../007-libcap2-bin_1%3a2.66-5+b1_arm64.deb ...
Unpacking libcap2-bin (1:2.66-5+b1) ...
Selecting previously unselected package libgstreamer1.0-0:arm64.
Preparing to unpack .../008-libgstreamer1.0-0_1.24.10-2_arm64.deb ...
Unpacking libgstreamer1.0-0:arm64 (1.24.10-2) ...
Selecting previously unselected package liborc-0.4-0t64:arm64.
Preparing to unpack .../009-liborc-0.4-0t64_1%3a0.4.40-1_arm64.deb ...
Unpacking liborc-0.4-0t64:arm64 (1:0.4.40-1) ...
Selecting previously unselected package iso-codes.
Preparing to unpack .../010-iso-codes_4.17.0-1_all.deb ...
Unpacking iso-codes (4.17.0-1) ...
Selecting previously unselected package libgstreamer-plugins-base1.0-0:arm64.
Preparing to unpack .../011-libgstreamer-plugins-base1.0-0_1.24.11-1_arm64.deb ...
Unpacking libgstreamer-plugins-base1.0-0:arm64 (1.24.11-1) ...
Selecting previously unselected package libhyphen0:arm64.
Preparing to unpack .../012-libhyphen0_2.8.8-7+b2_arm64.deb ...
Unpacking libhyphen0:arm64 (2.8.8-7+b2) ...
Selecting previously unselected package libicu72:arm64.
Preparing to unpack .../013-libicu72_72.1-5+b1_arm64.deb ...
Unpacking libicu72:arm64 (72.1-5+b1) ...
Selecting previously unselected package libjpeg62-turbo:arm64.
Preparing to unpack .../014-libjpeg62-turbo_1%3a2.1.5-3+b1_arm64.deb ...
Unpacking libjpeg62-turbo:arm64 (1:2.1.5-3+b1) ...
Selecting previously unselected package libpng16-16t64:arm64.
Preparing to unpack .../015-libpng16-16t64_1.6.44-3_arm64.deb ...
Unpacking libpng16-16t64:arm64 (1.6.44-3) ...
Selecting previously unselected package libxml2:arm64.
Preparing to unpack .../016-libxml2_2.12.7+dfsg+really2.9.14-0.2+b1_arm64.deb ...
Unpacking libxml2:arm64 (2.12.7+dfsg+really2.9.14-0.2+b1) ...
Selecting previously unselected package shared-mime-info.
Preparing to unpack .../017-shared-mime-info_2.4-5+b1_arm64.deb ...
Unpacking shared-mime-info (2.4-5+b1) ...
Selecting previously unselected package libdouble-conversion3:arm64.
Preparing to unpack .../018-libdouble-conversion3_3.3.0-1+b2_arm64.deb ...
Unpacking libdouble-conversion3:arm64 (3.3.0-1+b2) ...
Selecting previously unselected package libpcre2-16-0:arm64.
Preparing to unpack .../019-libpcre2-16-0_10.44-5_arm64.deb ...
Unpacking libpcre2-16-0:arm64 (10.44-5) ...
Selecting previously unselected package libqt5core5t64:arm64.
Preparing to unpack .../020-libqt5core5t64_5.15.15+dfsg-2_arm64.deb ...
Unpacking libqt5core5t64:arm64 (5.15.15+dfsg-2) ...
Selecting previously unselected package libexpat1:arm64.
Preparing to unpack .../021-libexpat1_2.6.4-1_arm64.deb ...
Unpacking libexpat1:arm64 (2.6.4-1) ...
Selecting previously unselected package libbrotli1:arm64.
Preparing to unpack .../022-libbrotli1_1.1.0-2+b6_arm64.deb ...
Unpacking libbrotli1:arm64 (1.1.0-2+b6) ...
Selecting previously unselected package libfreetype6:arm64.
Preparing to unpack .../023-libfreetype6_2.13.3+dfsg-1_arm64.deb ...
Unpacking libfreetype6:arm64 (2.13.3+dfsg-1) ...
Selecting previously unselected package fonts-dejavu-mono.
Preparing to unpack .../024-fonts-dejavu-mono_2.37-8_all.deb ...
Unpacking fonts-dejavu-mono (2.37-8) ...
Selecting previously unselected package fonts-dejavu-core.
Preparing to unpack .../025-fonts-dejavu-core_2.37-8_all.deb ...
Unpacking fonts-dejavu-core (2.37-8) ...
Selecting previously unselected package fontconfig-config.
Preparing to unpack .../026-fontconfig-config_2.15.0-1.1+b1_arm64.deb ...
Unpacking fontconfig-config (2.15.0-1.1+b1) ...
Selecting previously unselected package libfontconfig1:arm64.
Preparing to unpack .../027-libfontconfig1_2.15.0-1.1+b1_arm64.deb ...
Unpacking libfontconfig1:arm64 (2.15.0-1.1+b1) ...
Selecting previously unselected package fontconfig.
Preparing to unpack .../028-fontconfig_2.15.0-1.1+b1_arm64.deb ...
Unpacking fontconfig (2.15.0-1.1+b1) ...
Selecting previously unselected package libglvnd0:arm64.
Preparing to unpack .../029-libglvnd0_1.7.0-1+b2_arm64.deb ...
Unpacking libglvnd0:arm64 (1.7.0-1+b2) ...
Selecting previously unselected package libwayland-server0:arm64.
Preparing to unpack .../030-libwayland-server0_1.23.0-1+b1_arm64.deb ...
Unpacking libwayland-server0:arm64 (1.23.0-1+b1) ...
Selecting previously unselected package libxau6:arm64.
Preparing to unpack .../031-libxau6_1%3a1.0.11-1_arm64.deb ...
Unpacking libxau6:arm64 (1:1.0.11-1) ...
Selecting previously unselected package libxdmcp6:arm64.
Preparing to unpack .../032-libxdmcp6_1%3a1.1.5-1_arm64.deb ...
Unpacking libxdmcp6:arm64 (1:1.1.5-1) ...
Selecting previously unselected package libxcb1:arm64.
Preparing to unpack .../033-libxcb1_1.17.0-2+b1_arm64.deb ...
Unpacking libxcb1:arm64 (1.17.0-2+b1) ...
Selecting previously unselected package libxcb-randr0:arm64.
Preparing to unpack .../034-libxcb-randr0_1.17.0-2+b1_arm64.deb ...
Unpacking libxcb-randr0:arm64 (1.17.0-2+b1) ...
Selecting previously unselected package libdrm-amdgpu1:arm64.
Preparing to unpack .../035-libdrm-amdgpu1_2.4.123-1_arm64.deb ...
Unpacking libdrm-amdgpu1:arm64 (2.4.123-1) ...
Selecting previously unselected package libdrm-radeon1:arm64.
Preparing to unpack .../036-libdrm-radeon1_2.4.123-1_arm64.deb ...
Unpacking libdrm-radeon1:arm64 (2.4.123-1) ...
Selecting previously unselected package libglapi-mesa:arm64.
Preparing to unpack .../037-libglapi-mesa_24.2.8-1_arm64.deb ...
Unpacking libglapi-mesa:arm64 (24.2.8-1) ...
Selecting previously unselected package libedit2:arm64.
Preparing to unpack .../038-libedit2_3.1-20240808-1_arm64.deb ...
Unpacking libedit2:arm64 (3.1-20240808-1) ...
Selecting previously unselected package libz3-4:arm64.
Preparing to unpack .../039-libz3-4_4.13.3-1_arm64.deb ...
Unpacking libz3-4:arm64 (4.13.3-1) ...
Selecting previously unselected package libllvm19:arm64.
Preparing to unpack .../040-libllvm19_1%3a19.1.6-1_arm64.deb ...
Unpacking libllvm19:arm64 (1:19.1.6-1) ...
Selecting previously unselected package libsensors-config.
Preparing to unpack .../041-libsensors-config_1%3a3.6.0-10_all.deb ...
Unpacking libsensors-config (1:3.6.0-10) ...
Selecting previously unselected package libsensors5:arm64.
Preparing to unpack .../042-libsensors5_1%3a3.6.0-10+b1_arm64.deb ...
Unpacking libsensors5:arm64 (1:3.6.0-10+b1) ...
Selecting previously unselected package libx11-data.
Preparing to unpack .../043-libx11-data_2%3a1.8.10-2_all.deb ...
Unpacking libx11-data (2:1.8.10-2) ...
Selecting previously unselected package libx11-6:arm64.
Preparing to unpack .../044-libx11-6_2%3a1.8.10-2_arm64.deb ...
Unpacking libx11-6:arm64 (2:1.8.10-2) ...
Selecting previously unselected package libx11-xcb1:arm64.
Preparing to unpack .../045-libx11-xcb1_2%3a1.8.10-2_arm64.deb ...
Unpacking libx11-xcb1:arm64 (2:1.8.10-2) ...
Selecting previously unselected package libxcb-dri2-0:arm64.
Preparing to unpack .../046-libxcb-dri2-0_1.17.0-2+b1_arm64.deb ...
Unpacking libxcb-dri2-0:arm64 (1.17.0-2+b1) ...
Selecting previously unselected package libxcb-dri3-0:arm64.
Preparing to unpack .../047-libxcb-dri3-0_1.17.0-2+b1_arm64.deb ...
Unpacking libxcb-dri3-0:arm64 (1.17.0-2+b1) ...
Selecting previously unselected package libxcb-present0:arm64.
Preparing to unpack .../048-libxcb-present0_1.17.0-2+b1_arm64.deb ...
Unpacking libxcb-present0:arm64 (1.17.0-2+b1) ...
Selecting previously unselected package libxcb-sync1:arm64.
Preparing to unpack .../049-libxcb-sync1_1.17.0-2+b1_arm64.deb ...
Unpacking libxcb-sync1:arm64 (1.17.0-2+b1) ...
Selecting previously unselected package libxcb-xfixes0:arm64.
Preparing to unpack .../050-libxcb-xfixes0_1.17.0-2+b1_arm64.deb ...
Unpacking libxcb-xfixes0:arm64 (1.17.0-2+b1) ...
Selecting previously unselected package libxshmfence1:arm64.
Preparing to unpack .../051-libxshmfence1_1.3-1+b3_arm64.deb ...
Unpacking libxshmfence1:arm64 (1.3-1+b3) ...
Selecting previously unselected package mesa-libgallium:arm64.
Preparing to unpack .../052-mesa-libgallium_24.2.8-1_arm64.deb ...
Unpacking mesa-libgallium:arm64 (24.2.8-1) ...
Selecting previously unselected package libgbm1:arm64.
Preparing to unpack .../053-libgbm1_24.2.8-1_arm64.deb ...
Unpacking libgbm1:arm64 (24.2.8-1) ...
Selecting previously unselected package libwayland-client0:arm64.
Preparing to unpack .../054-libwayland-client0_1.23.0-1+b1_arm64.deb ...
Unpacking libwayland-client0:arm64 (1.23.0-1+b1) ...
Selecting previously unselected package libxcb-shm0:arm64.
Preparing to unpack .../055-libxcb-shm0_1.17.0-2+b1_arm64.deb ...
Unpacking libxcb-shm0:arm64 (1.17.0-2+b1) ...
Selecting previously unselected package libegl-mesa0:arm64.
Preparing to unpack .../056-libegl-mesa0_24.2.8-1_arm64.deb ...
Unpacking libegl-mesa0:arm64 (24.2.8-1) ...
Selecting previously unselected package libegl1:arm64.
Preparing to unpack .../057-libegl1_1.7.0-1+b2_arm64.deb ...
Unpacking libegl1:arm64 (1.7.0-1+b2) ...
Selecting previously unselected package libxcb-glx0:arm64.
Preparing to unpack .../058-libxcb-glx0_1.17.0-2+b1_arm64.deb ...
Unpacking libxcb-glx0:arm64 (1.17.0-2+b1) ...
Selecting previously unselected package libxext6:arm64.
Preparing to unpack .../059-libxext6_2%3a1.3.4-1+b3_arm64.deb ...
Unpacking libxext6:arm64 (2:1.3.4-1+b3) ...
Selecting previously unselected package libxfixes3:arm64.
Preparing to unpack .../060-libxfixes3_1%3a6.0.0-2+b3_arm64.deb ...
Unpacking libxfixes3:arm64 (1:6.0.0-2+b3) ...
Selecting previously unselected package libxxf86vm1:arm64.
Preparing to unpack .../061-libxxf86vm1_1%3a1.1.4-1+b4_arm64.deb ...
Unpacking libxxf86vm1:arm64 (1:1.1.4-1+b4) ...
Selecting previously unselected package libvulkan1:arm64.
Preparing to unpack .../062-libvulkan1_1.3.296.0-1_arm64.deb ...
Unpacking libvulkan1:arm64 (1.3.296.0-1) ...
Selecting previously unselected package libgl1-mesa-dri:arm64.
Preparing to unpack .../063-libgl1-mesa-dri_24.2.8-1_arm64.deb ...
Unpacking libgl1-mesa-dri:arm64 (24.2.8-1) ...
Selecting previously unselected package libglx-mesa0:arm64.
Preparing to unpack .../064-libglx-mesa0_24.2.8-1_arm64.deb ...
Unpacking libglx-mesa0:arm64 (24.2.8-1) ...
Selecting previously unselected package libglx0:arm64.
Preparing to unpack .../065-libglx0_1.7.0-1+b2_arm64.deb ...
Unpacking libglx0:arm64 (1.7.0-1+b2) ...
Selecting previously unselected package libgl1:arm64.
Preparing to unpack .../066-libgl1_1.7.0-1+b2_arm64.deb ...
Unpacking libgl1:arm64 (1.7.0-1+b2) ...
Selecting previously unselected package libgraphite2-3:arm64.
Preparing to unpack .../067-libgraphite2-3_1.3.14-2+b1_arm64.deb ...
Unpacking libgraphite2-3:arm64 (1.3.14-2+b1) ...
Selecting previously unselected package libharfbuzz0b:arm64.
Preparing to unpack .../068-libharfbuzz0b_10.1.0-2_arm64.deb ...
Unpacking libharfbuzz0b:arm64 (10.1.0-2) ...
Selecting previously unselected package x11-common.
Preparing to unpack .../069-x11-common_1%3a7.7+23.1_all.deb ...
Unpacking x11-common (1:7.7+23.1) ...
Selecting previously unselected package libice6:arm64.
Preparing to unpack .../070-libice6_2%3a1.1.1-1_arm64.deb ...
Unpacking libice6:arm64 (2:1.1.1-1) ...
Selecting previously unselected package libevdev2:arm64.
Preparing to unpack .../071-libevdev2_1.13.3+dfsg-1_arm64.deb ...
Unpacking libevdev2:arm64 (1.13.3+dfsg-1) ...
Selecting previously unselected package libmtdev1t64:arm64.
Preparing to unpack .../072-libmtdev1t64_1.1.6-1.2+b1_arm64.deb ...
Unpacking libmtdev1t64:arm64 (1.1.6-1.2+b1) ...
Selecting previously unselected package libgudev-1.0-0:arm64.
Preparing to unpack .../073-libgudev-1.0-0_238-5+b1_arm64.deb ...
Unpacking libgudev-1.0-0:arm64 (238-5+b1) ...
Selecting previously unselected package libwacom-common.
Preparing to unpack .../074-libwacom-common_2.13.0-1_all.deb ...
Unpacking libwacom-common (2.13.0-1) ...
Selecting previously unselected package libwacom9:arm64.
Preparing to unpack .../075-libwacom9_2.13.0-1_arm64.deb ...
Unpacking libwacom9:arm64 (2.13.0-1) ...
Selecting previously unselected package libinput-bin.
Preparing to unpack .../076-libinput-bin_1.26.2-1_arm64.deb ...
Unpacking libinput-bin (1.26.2-1) ...
Selecting previously unselected package libinput10:arm64.
Preparing to unpack .../077-libinput10_1.26.2-1_arm64.deb ...
Unpacking libinput10:arm64 (1.26.2-1) ...
Selecting previously unselected package libmd4c0:arm64.
Preparing to unpack .../078-libmd4c0_0.5.2-2+b1_arm64.deb ...
Unpacking libmd4c0:arm64 (0.5.2-2+b1) ...
Selecting previously unselected package libdbus-1-3:arm64.
Preparing to unpack .../079-libdbus-1-3_1.16.0-1_arm64.deb ...
Unpacking libdbus-1-3:arm64 (1.16.0-1) ...
Selecting previously unselected package libqt5dbus5t64:arm64.
Preparing to unpack .../080-libqt5dbus5t64_5.15.15+dfsg-2_arm64.deb ...
Unpacking libqt5dbus5t64:arm64 (5.15.15+dfsg-2) ...
Selecting previously unselected package libkrb5support0:arm64.
Preparing to unpack .../081-libkrb5support0_1.21.3-3_arm64.deb ...
Unpacking libkrb5support0:arm64 (1.21.3-3) ...
Selecting previously unselected package libcom-err2:arm64.
Preparing to unpack .../082-libcom-err2_1.47.2-1_arm64.deb ...
Unpacking libcom-err2:arm64 (1.47.2-1) ...
Selecting previously unselected package libk5crypto3:arm64.
Preparing to unpack .../083-libk5crypto3_1.21.3-3_arm64.deb ...
Unpacking libk5crypto3:arm64 (1.21.3-3) ...
Selecting previously unselected package libkeyutils1:arm64.
Preparing to unpack .../084-libkeyutils1_1.6.3-4_arm64.deb ...
Unpacking libkeyutils1:arm64 (1.6.3-4) ...
Selecting previously unselected package libkrb5-3:arm64.
Preparing to unpack .../085-libkrb5-3_1.21.3-3_arm64.deb ...
Unpacking libkrb5-3:arm64 (1.21.3-3) ...
Selecting previously unselected package libgssapi-krb5-2:arm64.
Preparing to unpack .../086-libgssapi-krb5-2_1.21.3-3_arm64.deb ...
Unpacking libgssapi-krb5-2:arm64 (1.21.3-3) ...
Selecting previously unselected package libqt5network5t64:arm64.
Preparing to unpack .../087-libqt5network5t64_5.15.15+dfsg-2_arm64.deb ...
Unpacking libqt5network5t64:arm64 (5.15.15+dfsg-2) ...
Selecting previously unselected package libsm6:arm64.
Preparing to unpack .../088-libsm6_2%3a1.2.4-1_arm64.deb ...
Unpacking libsm6:arm64 (2:1.2.4-1) ...
Selecting previously unselected package libxcb-icccm4:arm64.
Preparing to unpack .../089-libxcb-icccm4_0.4.2-1_arm64.deb ...
Unpacking libxcb-icccm4:arm64 (0.4.2-1) ...
Selecting previously unselected package libxcb-util1:arm64.
Preparing to unpack .../090-libxcb-util1_0.4.0-1+b2_arm64.deb ...
Unpacking libxcb-util1:arm64 (0.4.0-1+b2) ...
Selecting previously unselected package libxcb-image0:arm64.
Preparing to unpack .../091-libxcb-image0_0.4.0-2+b2_arm64.deb ...
Unpacking libxcb-image0:arm64 (0.4.0-2+b2) ...
Selecting previously unselected package libxcb-keysyms1:arm64.
Preparing to unpack .../092-libxcb-keysyms1_0.4.0-1+b3_arm64.deb ...
Unpacking libxcb-keysyms1:arm64 (0.4.0-1+b3) ...
Selecting previously unselected package libxcb-render0:arm64.
Preparing to unpack .../093-libxcb-render0_1.17.0-2+b1_arm64.deb ...
Unpacking libxcb-render0:arm64 (1.17.0-2+b1) ...
Selecting previously unselected package libxcb-render-util0:arm64.
Preparing to unpack .../094-libxcb-render-util0_0.3.9-1+b2_arm64.deb ...
Unpacking libxcb-render-util0:arm64 (0.3.9-1+b2) ...
Selecting previously unselected package libxcb-shape0:arm64.
Preparing to unpack .../095-libxcb-shape0_1.17.0-2+b1_arm64.deb ...
Unpacking libxcb-shape0:arm64 (1.17.0-2+b1) ...
Selecting previously unselected package libxcb-xinerama0:arm64.
Preparing to unpack .../096-libxcb-xinerama0_1.17.0-2+b1_arm64.deb ...
Unpacking libxcb-xinerama0:arm64 (1.17.0-2+b1) ...
Selecting previously unselected package libxcb-xinput0:arm64.
Preparing to unpack .../097-libxcb-xinput0_1.17.0-2+b1_arm64.deb ...
Unpacking libxcb-xinput0:arm64 (1.17.0-2+b1) ...
Selecting previously unselected package libxcb-xkb1:arm64.
Preparing to unpack .../098-libxcb-xkb1_1.17.0-2+b1_arm64.deb ...
Unpacking libxcb-xkb1:arm64 (1.17.0-2+b1) ...
Selecting previously unselected package xkb-data.
Preparing to unpack .../099-xkb-data_2.42-1_all.deb ...
Unpacking xkb-data (2.42-1) ...
Selecting previously unselected package libxkbcommon0:arm64.
Preparing to unpack .../100-libxkbcommon0_1.7.0-2_arm64.deb ...
Unpacking libxkbcommon0:arm64 (1.7.0-2) ...
Selecting previously unselected package libxkbcommon-x11-0:arm64.
Preparing to unpack .../101-libxkbcommon-x11-0_1.7.0-2_arm64.deb ...
Unpacking libxkbcommon-x11-0:arm64 (1.7.0-2) ...
Selecting previously unselected package libxrender1:arm64.
Preparing to unpack .../102-libxrender1_1%3a0.9.10-1.1+b3_arm64.deb ...
Unpacking libxrender1:arm64 (1:0.9.10-1.1+b3) ...
Selecting previously unselected package libqt5gui5t64:arm64.
Preparing to unpack .../103-libqt5gui5t64_5.15.15+dfsg-2_arm64.deb ...
Unpacking libqt5gui5t64:arm64 (5.15.15+dfsg-2) ...
Selecting previously unselected package libqt5positioning5:arm64.
Preparing to unpack .../104-libqt5positioning5_5.15.15+dfsg-2_arm64.deb ...
Unpacking libqt5positioning5:arm64 (5.15.15+dfsg-2) ...
Selecting previously unselected package libavahi-common-data:arm64.
Preparing to unpack .../105-libavahi-common-data_0.8-16_arm64.deb ...
Unpacking libavahi-common-data:arm64 (0.8-16) ...
Selecting previously unselected package libavahi-common3:arm64.
Preparing to unpack .../106-libavahi-common3_0.8-16_arm64.deb ...
Unpacking libavahi-common3:arm64 (0.8-16) ...
Selecting previously unselected package libavahi-client3:arm64.
Preparing to unpack .../107-libavahi-client3_0.8-16_arm64.deb ...
Unpacking libavahi-client3:arm64 (0.8-16) ...
Selecting previously unselected package libunistring5:arm64.
Preparing to unpack .../108-libunistring5_1.3-1_arm64.deb ...
Unpacking libunistring5:arm64 (1.3-1) ...
Selecting previously unselected package libidn2-0:arm64.
Preparing to unpack .../109-libidn2-0_2.3.7-2+b1_arm64.deb ...
Unpacking libidn2-0:arm64 (2.3.7-2+b1) ...
Selecting previously unselected package libp11-kit0:arm64.
Preparing to unpack .../110-libp11-kit0_0.25.5-3_arm64.deb ...
Unpacking libp11-kit0:arm64 (0.25.5-3) ...
Selecting previously unselected package libtasn1-6:arm64.
Preparing to unpack .../111-libtasn1-6_4.19.0-3+b3_arm64.deb ...
Unpacking libtasn1-6:arm64 (4.19.0-3+b3) ...
Selecting previously unselected package libgnutls30t64:arm64.
Preparing to unpack .../112-libgnutls30t64_3.8.8-2_arm64.deb ...
Unpacking libgnutls30t64:arm64 (3.8.8-2) ...
Selecting previously unselected package libcups2t64:arm64.
Preparing to unpack .../113-libcups2t64_2.4.10-2+b1_arm64.deb ...
Unpacking libcups2t64:arm64 (2.4.10-2+b1) ...
Selecting previously unselected package libqt5widgets5t64:arm64.
Preparing to unpack .../114-libqt5widgets5t64_5.15.15+dfsg-2_arm64.deb ...
Unpacking libqt5widgets5t64:arm64 (5.15.15+dfsg-2) ...
Selecting previously unselected package libqt5printsupport5t64:arm64.
Preparing to unpack .../115-libqt5printsupport5t64_5.15.15+dfsg-2_arm64.deb ...
Unpacking libqt5printsupport5t64:arm64 (5.15.15+dfsg-2) ...
Selecting previously unselected package libqt5qml5:arm64.
Preparing to unpack .../116-libqt5qml5_5.15.15+dfsg-3_arm64.deb ...
Unpacking libqt5qml5:arm64 (5.15.15+dfsg-3) ...
Selecting previously unselected package libqt5qmlmodels5:arm64.
Preparing to unpack .../117-libqt5qmlmodels5_5.15.15+dfsg-3_arm64.deb ...
Unpacking libqt5qmlmodels5:arm64 (5.15.15+dfsg-3) ...
Selecting previously unselected package libqt5quick5:arm64.
Preparing to unpack .../118-libqt5quick5_5.15.15+dfsg-3_arm64.deb ...
Unpacking libqt5quick5:arm64 (5.15.15+dfsg-3) ...
Selecting previously unselected package libqt5sensors5:arm64.
Preparing to unpack .../119-libqt5sensors5_5.15.15-2_arm64.deb ...
Unpacking libqt5sensors5:arm64 (5.15.15-2) ...
Selecting previously unselected package libqt5webchannel5:arm64.
Preparing to unpack .../120-libqt5webchannel5_5.15.15-2_arm64.deb ...
Unpacking libqt5webchannel5:arm64 (5.15.15-2) ...
Selecting previously unselected package libsharpyuv0:arm64.
Preparing to unpack .../121-libsharpyuv0_1.4.0-0.1+b1_arm64.deb ...
Unpacking libsharpyuv0:arm64 (1.4.0-0.1+b1) ...
Selecting previously unselected package libwebp7:arm64.
Preparing to unpack .../122-libwebp7_1.4.0-0.1+b1_arm64.deb ...
Unpacking libwebp7:arm64 (1.4.0-0.1+b1) ...
Selecting previously unselected package libwoff1:arm64.
Preparing to unpack .../123-libwoff1_1.0.2-2+b2_arm64.deb ...
Unpacking libwoff1:arm64 (1.0.2-2+b2) ...
Selecting previously unselected package libgpg-error0:arm64.
Preparing to unpack .../124-libgpg-error0_1.51-3_arm64.deb ...
Unpacking libgpg-error0:arm64 (1.51-3) ...
Selecting previously unselected package libgcrypt20:arm64.
Preparing to unpack .../125-libgcrypt20_1.11.0-7_arm64.deb ...
Unpacking libgcrypt20:arm64 (1.11.0-7) ...
Selecting previously unselected package libxslt1.1:arm64.
Preparing to unpack .../126-libxslt1.1_1.1.35-1.1+b1_arm64.deb ...
Unpacking libxslt1.1:arm64 (1.1.35-1.1+b1) ...
Selecting previously unselected package libqt5webkit5:arm64.
Preparing to unpack .../127-libqt5webkit5_5.212.0~alpha4-41_arm64.deb ...
Unpacking libqt5webkit5:arm64 (5.212.0~alpha4-41) ...
Selecting previously unselected package libpython3.13-minimal:arm64.
Preparing to unpack .../128-libpython3.13-minimal_3.13.1-3_arm64.deb ...
Unpacking libpython3.13-minimal:arm64 (3.13.1-3) ...
Selecting previously unselected package python3.13-minimal.
Preparing to unpack .../129-python3.13-minimal_3.13.1-3_arm64.deb ...
Unpacking python3.13-minimal (3.13.1-3) ...
Setting up libpython3.13-minimal:arm64 (3.13.1-3) ...
Setting up libexpat1:arm64 (2.6.4-1) ...
Setting up python3.13-minimal (3.13.1-3) ...
Selecting previously unselected package python3-minimal.
(Reading database ... 
(Reading database ... 5%
(Reading database ... 10%
(Reading database ... 15%
(Reading database ... 20%
(Reading database ... 25%
(Reading database ... 30%
(Reading database ... 35%
(Reading database ... 40%
(Reading database ... 45%
(Reading database ... 50%
(Reading database ... 55%
(Reading database ... 60%
(Reading database ... 65%
(Reading database ... 70%
(Reading database ... 75%
(Reading database ... 80%
(Reading database ... 85%
(Reading database ... 90%
(Reading database ... 95%
(Reading database ... 100%
(Reading database ... 24607 files and directories currently installed.)
Preparing to unpack .../0-python3-minimal_3.13.1-1_arm64.deb ...
Unpacking python3-minimal (3.13.1-1) ...
Selecting previously unselected package media-types.
Preparing to unpack .../1-media-types_10.1.0_all.deb ...
Unpacking media-types (10.1.0) ...
Selecting previously unselected package netbase.
Preparing to unpack .../2-netbase_6.4_all.deb ...
Unpacking netbase (6.4) ...
Selecting previously unselected package tzdata.
Preparing to unpack .../3-tzdata_2024b-4_all.deb ...
Unpacking tzdata (2024b-4) ...
Selecting previously unselected package readline-common.
Preparing to unpack .../4-readline-common_8.2-6_all.deb ...
Unpacking readline-common (8.2-6) ...
Selecting previously unselected package libreadline8t64:arm64.
Preparing to unpack .../5-libreadline8t64_8.2-6_arm64.deb ...
Adding 'diversion of /lib/aarch64-linux-gnu/libhistory.so.8 to /lib/aarch64-linux-gnu/libhistory.so.8.usr-is-merged by libreadline8t64'
Adding 'diversion of /lib/aarch64-linux-gnu/libhistory.so.8.2 to /lib/aarch64-linux-gnu/libhistory.so.8.2.usr-is-merged by libreadline8t64'
Adding 'diversion of /lib/aarch64-linux-gnu/libreadline.so.8 to /lib/aarch64-linux-gnu/libreadline.so.8.usr-is-merged by libreadline8t64'
Adding 'diversion of /lib/aarch64-linux-gnu/libreadline.so.8.2 to /lib/aarch64-linux-gnu/libreadline.so.8.2.usr-is-merged by libreadline8t64'
Unpacking libreadline8t64:arm64 (8.2-6) ...
Selecting previously unselected package libpython3.13-stdlib:arm64.
Preparing to unpack .../6-libpython3.13-stdlib_3.13.1-3_arm64.deb ...
Unpacking libpython3.13-stdlib:arm64 (3.13.1-3) ...
Selecting previously unselected package python3.13.
Preparing to unpack .../7-python3.13_3.13.1-3_arm64.deb ...
Unpacking python3.13 (3.13.1-3) ...
Selecting previously unselected package libpython3-stdlib:arm64.
Preparing to unpack .../8-libpython3-stdlib_3.13.1-1_arm64.deb ...
Unpacking libpython3-stdlib:arm64 (3.13.1-1) ...
Setting up python3-minimal (3.13.1-1) ...
Selecting previously unselected package python3.
(Reading database ... 
(Reading database ... 5%
(Reading database ... 10%
(Reading database ... 15%
(Reading database ... 20%
(Reading database ... 25%
(Reading database ... 30%
(Reading database ... 35%
(Reading database ... 40%
(Reading database ... 45%
(Reading database ... 50%
(Reading database ... 55%
(Reading database ... 60%
(Reading database ... 65%
(Reading database ... 70%
(Reading database ... 75%
(Reading database ... 80%
(Reading database ... 85%
(Reading database ... 90%
(Reading database ... 95%
(Reading database ... 100%
(Reading database ... 25612 files and directories currently installed.)
Preparing to unpack .../000-python3_3.13.1-1_arm64.deb ...
Unpacking python3 (3.13.1-1) ...
Selecting previously unselected package sgml-base.
Preparing to unpack .../001-sgml-base_1.31_all.deb ...
Unpacking sgml-base (1.31) ...
Selecting previously unselected package sensible-utils.
Preparing to unpack .../002-sensible-utils_0.0.24_all.deb ...
Unpacking sensible-utils (0.0.24) ...
Selecting previously unselected package openssl.
Preparing to unpack .../003-openssl_3.4.0-2_arm64.deb ...
Unpacking openssl (3.4.0-2) ...
Selecting previously unselected package ca-certificates.
Preparing to unpack .../004-ca-certificates_20241223_all.deb ...
Unpacking ca-certificates (20241223) ...
Selecting previously unselected package libmagic-mgc.
Preparing to unpack .../005-libmagic-mgc_1%3a5.45-3+b1_arm64.deb ...
Unpacking libmagic-mgc (1:5.45-3+b1) ...
Selecting previously unselected package libmagic1t64:arm64.
Preparing to unpack .../006-libmagic1t64_1%3a5.45-3+b1_arm64.deb ...
Unpacking libmagic1t64:arm64 (1:5.45-3+b1) ...
Selecting previously unselected package file.
Preparing to unpack .../007-file_1%3a5.45-3+b1_arm64.deb ...
Unpacking file (1:5.45-3+b1) ...
Selecting previously unselected package gettext-base.
Preparing to unpack .../008-gettext-base_0.22.5-4_arm64.deb ...
Unpacking gettext-base (0.22.5-4) ...
Selecting previously unselected package libuchardet0:arm64.
Preparing to unpack .../009-libuchardet0_0.0.8-1+b2_arm64.deb ...
Unpacking libuchardet0:arm64 (0.0.8-1+b2) ...
Selecting previously unselected package groff-base.
Preparing to unpack .../010-groff-base_1.23.0-7_arm64.deb ...
Unpacking groff-base (1.23.0-7) ...
Selecting previously unselected package bsdextrautils.
Preparing to unpack .../011-bsdextrautils_2.40.2-14_arm64.deb ...
Unpacking bsdextrautils (2.40.2-14) ...
Selecting previously unselected package libpipeline1:arm64.
Preparing to unpack .../012-libpipeline1_1.5.8-1_arm64.deb ...
Unpacking libpipeline1:arm64 (1.5.8-1) ...
Selecting previously unselected package man-db.
Preparing to unpack .../013-man-db_2.13.0-1_arm64.deb ...
Unpacking man-db (2.13.0-1) ...
Selecting previously unselected package m4.
Preparing to unpack .../014-m4_1.4.19-5_arm64.deb ...
Unpacking m4 (1.4.19-5) ...
Selecting previously unselected package autoconf.
Preparing to unpack .../015-autoconf_2.72-3_all.deb ...
Unpacking autoconf (2.72-3) ...
Selecting previously unselected package autotools-dev.
Preparing to unpack .../016-autotools-dev_20220109.1_all.deb ...
Unpacking autotools-dev (20220109.1) ...
Selecting previously unselected package automake.
Preparing to unpack .../017-automake_1%3a1.16.5-1.3_all.deb ...
Unpacking automake (1:1.16.5-1.3) ...
Selecting previously unselected package autopoint.
Preparing to unpack .../018-autopoint_0.22.5-4_all.deb ...
Unpacking autopoint (0.22.5-4) ...
Selecting previously unselected package libdebhelper-perl.
Preparing to unpack .../019-libdebhelper-perl_13.23_all.deb ...
Unpacking libdebhelper-perl (13.23) ...
Selecting previously unselected package libtool.
Preparing to unpack .../020-libtool_2.5.4-2_all.deb ...
Unpacking libtool (2.5.4-2) ...
Selecting previously unselected package dh-autoreconf.
Preparing to unpack .../021-dh-autoreconf_20_all.deb ...
Unpacking dh-autoreconf (20) ...
Selecting previously unselected package libarchive-zip-perl.
Preparing to unpack .../022-libarchive-zip-perl_1.68-1_all.deb ...
Unpacking libarchive-zip-perl (1.68-1) ...
Selecting previously unselected package libfile-stripnondeterminism-perl.
Preparing to unpack .../023-libfile-stripnondeterminism-perl_1.14.0-1_all.deb ...
Unpacking libfile-stripnondeterminism-perl (1.14.0-1) ...
Selecting previously unselected package dh-strip-nondeterminism.
Preparing to unpack .../024-dh-strip-nondeterminism_1.14.0-1_all.deb ...
Unpacking dh-strip-nondeterminism (1.14.0-1) ...
Selecting previously unselected package dwz.
Preparing to unpack .../025-dwz_0.15-1+b1_arm64.deb ...
Unpacking dwz (0.15-1+b1) ...
Selecting previously unselected package gettext.
Preparing to unpack .../026-gettext_0.22.5-4_arm64.deb ...
Unpacking gettext (0.22.5-4) ...
Selecting previously unselected package intltool-debian.
Preparing to unpack .../027-intltool-debian_0.35.0+20060710.6_all.deb ...
Unpacking intltool-debian (0.35.0+20060710.6) ...
Selecting previously unselected package po-debconf.
Preparing to unpack .../028-po-debconf_1.0.21+nmu1_all.deb ...
Unpacking po-debconf (1.0.21+nmu1) ...
Selecting previously unselected package debhelper.
Preparing to unpack .../029-debhelper_13.23_all.deb ...
Unpacking debhelper (13.23) ...
Selecting previously unselected package python3-autocommand.
Preparing to unpack .../030-python3-autocommand_2.2.2-3_all.deb ...
Unpacking python3-autocommand (2.2.2-3) ...
Selecting previously unselected package python3-more-itertools.
Preparing to unpack .../031-python3-more-itertools_10.5.0-1_all.deb ...
Unpacking python3-more-itertools (10.5.0-1) ...
Selecting previously unselected package python3-typing-extensions.
Preparing to unpack .../032-python3-typing-extensions_4.12.2-2_all.deb ...
Unpacking python3-typing-extensions (4.12.2-2) ...
Selecting previously unselected package python3-typeguard.
Preparing to unpack .../033-python3-typeguard_4.4.1-1_all.deb ...
Unpacking python3-typeguard (4.4.1-1) ...
Selecting previously unselected package python3-inflect.
Preparing to unpack .../034-python3-inflect_7.3.1-2_all.deb ...
Unpacking python3-inflect (7.3.1-2) ...
Selecting previously unselected package python3-jaraco.context.
Preparing to unpack .../035-python3-jaraco.context_6.0.0-1_all.deb ...
Unpacking python3-jaraco.context (6.0.0-1) ...
Selecting previously unselected package python3-jaraco.functools.
Preparing to unpack .../036-python3-jaraco.functools_4.1.0-1_all.deb ...
Unpacking python3-jaraco.functools (4.1.0-1) ...
Selecting previously unselected package python3-pkg-resources.
Preparing to unpack .../037-python3-pkg-resources_75.6.0-1_all.deb ...
Unpacking python3-pkg-resources (75.6.0-1) ...
Selecting previously unselected package python3-jaraco.text.
Preparing to unpack .../038-python3-jaraco.text_4.0.0-1_all.deb ...
Unpacking python3-jaraco.text (4.0.0-1) ...
Selecting previously unselected package python3-zipp.
Preparing to unpack .../039-python3-zipp_3.21.0-1_all.deb ...
Unpacking python3-zipp (3.21.0-1) ...
Selecting previously unselected package python3-setuptools.
Preparing to unpack .../040-python3-setuptools_75.6.0-1_all.deb ...
Unpacking python3-setuptools (75.6.0-1) ...
Selecting previously unselected package dh-python.
Preparing to unpack .../041-dh-python_6.20241217_all.deb ...
Unpacking dh-python (6.20241217) ...
Selecting previously unselected package xml-core.
Preparing to unpack .../042-xml-core_0.19_all.deb ...
Unpacking xml-core (0.19) ...
Selecting previously unselected package docutils-common.
Preparing to unpack .../043-docutils-common_0.21.2+dfsg-2_all.deb ...
Unpacking docutils-common (0.21.2+dfsg-2) ...
Selecting previously unselected package libaec0:arm64.
Preparing to unpack .../044-libaec0_1.1.3-1+b1_arm64.deb ...
Unpacking libaec0:arm64 (1.1.3-1+b1) ...
Selecting previously unselected package libasyncns0:arm64.
Preparing to unpack .../045-libasyncns0_0.8-6+b5_arm64.deb ...
Unpacking libasyncns0:arm64 (0.8-6+b5) ...
Selecting previously unselected package libb2-1:arm64.
Preparing to unpack .../046-libb2-1_0.98.1-1.1+b2_arm64.deb ...
Unpacking libb2-1:arm64 (0.98.1-1.1+b2) ...
Selecting previously unselected package libblas3:arm64.
Preparing to unpack .../047-libblas3_3.12.0-4_arm64.deb ...
Unpacking libblas3:arm64 (3.12.0-4) ...
Selecting previously unselected package libsnappy1v5:arm64.
Preparing to unpack .../048-libsnappy1v5_1.2.1-1+b1_arm64.deb ...
Unpacking libsnappy1v5:arm64 (1.2.1-1+b1) ...
Selecting previously unselected package libblosc1:arm64.
Preparing to unpack .../049-libblosc1_1.21.5+ds-1+b2_arm64.deb ...
Unpacking libblosc1:arm64 (1.21.5+ds-1+b2) ...
Selecting previously unselected package libblosc2-4:arm64.
Preparing to unpack .../050-libblosc2-4_2.15.2+ds-5_arm64.deb ...
Unpacking libblosc2-4:arm64 (2.15.2+ds-5) ...
Selecting previously unselected package libsasl2-modules-db:arm64.
Preparing to unpack .../051-libsasl2-modules-db_2.1.28+dfsg1-8_arm64.deb ...
Unpacking libsasl2-modules-db:arm64 (2.1.28+dfsg1-8) ...
Selecting previously unselected package libsasl2-2:arm64.
Preparing to unpack .../052-libsasl2-2_2.1.28+dfsg1-8_arm64.deb ...
Unpacking libsasl2-2:arm64 (2.1.28+dfsg1-8) ...
Selecting previously unselected package libldap-2.5-0:arm64.
Preparing to unpack .../053-libldap-2.5-0_2.5.19+dfsg-1_arm64.deb ...
Unpacking libldap-2.5-0:arm64 (2.5.19+dfsg-1) ...
Selecting previously unselected package libnghttp2-14:arm64.
Preparing to unpack .../054-libnghttp2-14_1.64.0-1_arm64.deb ...
Unpacking libnghttp2-14:arm64 (1.64.0-1) ...
Selecting previously unselected package libnghttp3-9:arm64.
Preparing to unpack .../055-libnghttp3-9_1.6.0-2_arm64.deb ...
Unpacking libnghttp3-9:arm64 (1.6.0-2) ...
Selecting previously unselected package libngtcp2-16:arm64.
Preparing to unpack .../056-libngtcp2-16_1.9.1-1_arm64.deb ...
Unpacking libngtcp2-16:arm64 (1.9.1-1) ...
Selecting previously unselected package libngtcp2-crypto-gnutls8:arm64.
Preparing to unpack .../057-libngtcp2-crypto-gnutls8_1.9.1-1_arm64.deb ...
Unpacking libngtcp2-crypto-gnutls8:arm64 (1.9.1-1) ...
Selecting previously unselected package libpsl5t64:arm64.
Preparing to unpack .../058-libpsl5t64_0.21.2-1.1+b1_arm64.deb ...
Unpacking libpsl5t64:arm64 (0.21.2-1.1+b1) ...
Selecting previously unselected package librtmp1:arm64.
Preparing to unpack .../059-librtmp1_2.4+20151223.gitfa8646d.1-2+b5_arm64.deb ...
Unpacking librtmp1:arm64 (2.4+20151223.gitfa8646d.1-2+b5) ...
Selecting previously unselected package libssh2-1t64:arm64.
Preparing to unpack .../060-libssh2-1t64_1.11.1-1_arm64.deb ...
Unpacking libssh2-1t64:arm64 (1.11.1-1) ...
Selecting previously unselected package libcurl3t64-gnutls:arm64.
Preparing to unpack .../061-libcurl3t64-gnutls_8.11.1-1_arm64.deb ...
Unpacking libcurl3t64-gnutls:arm64 (8.11.1-1) ...
Selecting previously unselected package libcurl4t64:arm64.
Preparing to unpack .../062-libcurl4t64_8.11.1-1_arm64.deb ...
Unpacking libcurl4t64:arm64 (8.11.1-1) ...
Selecting previously unselected package libduktape207:arm64.
Preparing to unpack .../063-libduktape207_2.7.0-2+b2_arm64.deb ...
Unpacking libduktape207:arm64 (2.7.0-2+b2) ...
Selecting previously unselected package libogg0:arm64.
Preparing to unpack .../064-libogg0_1.3.5-3+b2_arm64.deb ...
Unpacking libogg0:arm64 (1.3.5-3+b2) ...
Selecting previously unselected package libflac12t64:arm64.
Preparing to unpack .../065-libflac12t64_1.4.3+ds-4_arm64.deb ...
Unpacking libflac12t64:arm64 (1.4.3+ds-4) ...
Selecting previously unselected package libfontenc1:arm64.
Preparing to unpack .../066-libfontenc1_1%3a1.1.8-1+b2_arm64.deb ...
Unpacking libfontenc1:arm64 (1:1.1.8-1+b2) ...
Selecting previously unselected package libgfortran5:arm64.
Preparing to unpack .../067-libgfortran5_14.2.0-12_arm64.deb ...
Unpacking libgfortran5:arm64 (14.2.0-12) ...
Selecting previously unselected package libsz2:arm64.
Preparing to unpack .../068-libsz2_1.1.3-1+b1_arm64.deb ...
Unpacking libsz2:arm64 (1.1.3-1+b1) ...
Selecting previously unselected package libhdf5-310:arm64.
Preparing to unpack .../069-libhdf5-310_1.14.5+repack-3_arm64.deb ...
Unpacking libhdf5-310:arm64 (1.14.5+repack-3) ...
Selecting previously unselected package libjs-jquery.
Preparing to unpack .../070-libjs-jquery_3.6.1+dfsg+~3.5.14-1_all.deb ...
Unpacking libjs-jquery (3.6.1+dfsg+~3.5.14-1) ...
Selecting previously unselected package libjs-underscore.
Preparing to unpack .../071-libjs-underscore_1.13.4~dfsg+~1.11.4-3_all.deb ...
Unpacking libjs-underscore (1.13.4~dfsg+~1.11.4-3) ...
Selecting previously unselected package libjs-sphinxdoc.
Preparing to unpack .../072-libjs-sphinxdoc_8.1.3-4_all.deb ...
Unpacking libjs-sphinxdoc (8.1.3-4) ...
Selecting previously unselected package libjson-perl.
Preparing to unpack .../073-libjson-perl_4.10000-1_all.deb ...
Unpacking libjson-perl (4.10000-1) ...
Selecting previously unselected package liblapack3:arm64.
Preparing to unpack .../074-liblapack3_3.12.0-4_arm64.deb ...
Unpacking liblapack3:arm64 (3.12.0-4) ...
Selecting previously unselected package liblzo2-2:arm64.
Preparing to unpack .../075-liblzo2-2_2.10-3+b1_arm64.deb ...
Unpacking liblzo2-2:arm64 (2.10-3+b1) ...
Selecting previously unselected package libmp3lame0:arm64.
Preparing to unpack .../076-libmp3lame0_3.100-6+b3_arm64.deb ...
Unpacking libmp3lame0:arm64 (3.100-6+b3) ...
Selecting previously unselected package libmpg123-0t64:arm64.
Preparing to unpack .../077-libmpg123-0t64_1.32.10-1_arm64.deb ...
Unpacking libmpg123-0t64:arm64 (1.32.10-1) ...
Selecting previously unselected package libopus0:arm64.
Preparing to unpack .../078-libopus0_1.5.2-2_arm64.deb ...
Unpacking libopus0:arm64 (1.5.2-2) ...
Selecting previously unselected package libpixman-1-0:arm64.
Preparing to unpack .../079-libpixman-1-0_0.44.0-3_arm64.deb ...
Unpacking libpixman-1-0:arm64 (0.44.0-3) ...
Selecting previously unselected package libproxy1v5:arm64.
Preparing to unpack .../080-libproxy1v5_0.5.9-1_arm64.deb ...
Unpacking libproxy1v5:arm64 (0.5.9-1) ...
Selecting previously unselected package libvorbis0a:arm64.
Preparing to unpack .../081-libvorbis0a_1.3.7-2+b1_arm64.deb ...
Unpacking libvorbis0a:arm64 (1.3.7-2+b1) ...
Selecting previously unselected package libvorbisenc2:arm64.
Preparing to unpack .../082-libvorbisenc2_1.3.7-2+b1_arm64.deb ...
Unpacking libvorbisenc2:arm64 (1.3.7-2+b1) ...
Selecting previously unselected package libsndfile1:arm64.
Preparing to unpack .../083-libsndfile1_1.2.2-2_arm64.deb ...
Unpacking libsndfile1:arm64 (1.2.2-2) ...
Selecting previously unselected package libpulse0:arm64.
Preparing to unpack .../084-libpulse0_17.0+dfsg1-1_arm64.deb ...
Unpacking libpulse0:arm64 (17.0+dfsg1-1) ...
Selecting previously unselected package libpython3.13:arm64.
Preparing to unpack .../085-libpython3.13_3.13.1-3_arm64.deb ...
Unpacking libpython3.13:arm64 (3.13.1-3) ...
Selecting previously unselected package libqt5charts5:arm64.
Preparing to unpack .../086-libqt5charts5_5.15.15-2_arm64.deb ...
Unpacking libqt5charts5:arm64 (5.15.15-2) ...
Selecting previously unselected package libqt5xml5t64:arm64.
Preparing to unpack .../087-libqt5xml5t64_5.15.15+dfsg-2_arm64.deb ...
Unpacking libqt5xml5t64:arm64 (5.15.15+dfsg-2) ...
Selecting previously unselected package libqt5designer5:arm64.
Preparing to unpack .../088-libqt5designer5_5.15.15-4_arm64.deb ...
Unpacking libqt5designer5:arm64 (5.15.15-4) ...
Selecting previously unselected package libqt5sql5t64:arm64.
Preparing to unpack .../089-libqt5sql5t64_5.15.15+dfsg-2_arm64.deb ...
Unpacking libqt5sql5t64:arm64 (5.15.15+dfsg-2) ...
Selecting previously unselected package libqt5help5:arm64.
Preparing to unpack .../090-libqt5help5_5.15.15-4_arm64.deb ...
Unpacking libqt5help5:arm64 (5.15.15-4) ...
Selecting previously unselected package libqt5positioningquick5:arm64.
Preparing to unpack .../091-libqt5positioningquick5_5.15.15+dfsg-2_arm64.deb ...
Unpacking libqt5positioningquick5:arm64 (5.15.15+dfsg-2) ...
Selecting previously unselected package libqt5location5:arm64.
Preparing to unpack .../092-libqt5location5_5.15.15+dfsg-2_arm64.deb ...
Unpacking libqt5location5:arm64 (5.15.15+dfsg-2) ...
Selecting previously unselected package libqt5multimedia5:arm64.
Preparing to unpack .../093-libqt5multimedia5_5.15.15-2_arm64.deb ...
Unpacking libqt5multimedia5:arm64 (5.15.15-2) ...
Selecting previously unselected package libqt5multimediawidgets5:arm64.
Preparing to unpack .../094-libqt5multimediawidgets5_5.15.15-2_arm64.deb ...
Unpacking libqt5multimediawidgets5:arm64 (5.15.15-2) ...
Selecting previously unselected package libqt5opengl5t64:arm64.
Preparing to unpack .../095-libqt5opengl5t64_5.15.15+dfsg-2_arm64.deb ...
Unpacking libqt5opengl5t64:arm64 (5.15.15+dfsg-2) ...
Selecting previously unselected package libqt5quickwidgets5:arm64.
Preparing to unpack .../096-libqt5quickwidgets5_5.15.15+dfsg-3_arm64.deb ...
Unpacking libqt5quickwidgets5:arm64 (5.15.15+dfsg-3) ...
Selecting previously unselected package libqt5remoteobjects5:arm64.
Preparing to unpack .../097-libqt5remoteobjects5_5.15.15-2_arm64.deb ...
Unpacking libqt5remoteobjects5:arm64 (5.15.15-2) ...
Selecting previously unselected package libqt5serialport5:arm64.
Preparing to unpack .../098-libqt5serialport5_5.15.15-2_arm64.deb ...
Unpacking libqt5serialport5:arm64 (5.15.15-2) ...
Selecting previously unselected package libqt5svg5:arm64.
Preparing to unpack .../099-libqt5svg5_5.15.15-2_arm64.deb ...
Unpacking libqt5svg5:arm64 (5.15.15-2) ...
Selecting previously unselected package libqt5test5t64:arm64.
Preparing to unpack .../100-libqt5test5t64_5.15.15+dfsg-2_arm64.deb ...
Unpacking libqt5test5t64:arm64 (5.15.15+dfsg-2) ...
Selecting previously unselected package libqt5texttospeech5:arm64.
Preparing to unpack .../101-libqt5texttospeech5_5.15.15-2_arm64.deb ...
Unpacking libqt5texttospeech5:arm64 (5.15.15-2) ...
Selecting previously unselected package libqt5websockets5:arm64.
Preparing to unpack .../102-libqt5websockets5_5.15.15-2_arm64.deb ...
Unpacking libqt5websockets5:arm64 (5.15.15-2) ...
Selecting previously unselected package libqt5xmlpatterns5:arm64.
Preparing to unpack .../103-libqt5xmlpatterns5_5.15.15-2_arm64.deb ...
Unpacking libqt5xmlpatterns5:arm64 (5.15.15-2) ...
Selecting previously unselected package libqt6core6t64:arm64.
Preparing to unpack .../104-libqt6core6t64_6.7.2+dfsg-5_arm64.deb ...
Unpacking libqt6core6t64:arm64 (6.7.2+dfsg-5) ...
Selecting previously unselected package libqt6dbus6:arm64.
Preparing to unpack .../105-libqt6dbus6_6.7.2+dfsg-5_arm64.deb ...
Unpacking libqt6dbus6:arm64 (6.7.2+dfsg-5) ...
Selecting previously unselected package libopengl0:arm64.
Preparing to unpack .../106-libopengl0_1.7.0-1+b2_arm64.deb ...
Unpacking libopengl0:arm64 (1.7.0-1+b2) ...
Selecting previously unselected package libts0t64:arm64.
Preparing to unpack .../107-libts0t64_1.22-1.1+b1_arm64.deb ...
Unpacking libts0t64:arm64 (1.22-1.1+b1) ...
Selecting previously unselected package libxcb-cursor0:arm64.
Preparing to unpack .../108-libxcb-cursor0_0.1.4-1+b2_arm64.deb ...
Unpacking libxcb-cursor0:arm64 (0.1.4-1+b2) ...
Selecting previously unselected package libqt6gui6:arm64.
Preparing to unpack .../109-libqt6gui6_6.7.2+dfsg-5_arm64.deb ...
Unpacking libqt6gui6:arm64 (6.7.2+dfsg-5) ...
Selecting previously unselected package libqt6network6:arm64.
Preparing to unpack .../110-libqt6network6_6.7.2+dfsg-5_arm64.deb ...
Unpacking libqt6network6:arm64 (6.7.2+dfsg-5) ...
Selecting previously unselected package libqt6opengl6:arm64.
Preparing to unpack .../111-libqt6opengl6_6.7.2+dfsg-5_arm64.deb ...
Unpacking libqt6opengl6:arm64 (6.7.2+dfsg-5) ...
Selecting previously unselected package libqt6widgets6:arm64.
Preparing to unpack .../112-libqt6widgets6_6.7.2+dfsg-5_arm64.deb ...
Unpacking libqt6widgets6:arm64 (6.7.2+dfsg-5) ...
Selecting previously unselected package libqt6openglwidgets6:arm64.
Preparing to unpack .../113-libqt6openglwidgets6_6.7.2+dfsg-5_arm64.deb ...
Unpacking libqt6openglwidgets6:arm64 (6.7.2+dfsg-5) ...
Selecting previously unselected package libqt6printsupport6:arm64.
Preparing to unpack .../114-libqt6printsupport6_6.7.2+dfsg-5_arm64.deb ...
Unpacking libqt6printsupport6:arm64 (6.7.2+dfsg-5) ...
Selecting previously unselected package libqt6sql6:arm64.
Preparing to unpack .../115-libqt6sql6_6.7.2+dfsg-5_arm64.deb ...
Unpacking libqt6sql6:arm64 (6.7.2+dfsg-5) ...
Selecting previously unselected package libqt6test6:arm64.
Preparing to unpack .../116-libqt6test6_6.7.2+dfsg-5_arm64.deb ...
Unpacking libqt6test6:arm64 (6.7.2+dfsg-5) ...
Selecting previously unselected package libqt6xml6:arm64.
Preparing to unpack .../117-libqt6xml6_6.7.2+dfsg-5_arm64.deb ...
Unpacking libqt6xml6:arm64 (6.7.2+dfsg-5) ...
Selecting previously unselected package libxt6t64:arm64.
Preparing to unpack .../118-libxt6t64_1%3a1.2.1-1.2+b2_arm64.deb ...
Unpacking libxt6t64:arm64 (1:1.2.1-1.2+b2) ...
Selecting previously unselected package libxmu6:arm64.
Preparing to unpack .../119-libxmu6_2%3a1.1.3-3+b4_arm64.deb ...
Unpacking libxmu6:arm64 (2:1.1.3-3+b4) ...
Selecting previously unselected package libxpm4:arm64.
Preparing to unpack .../120-libxpm4_1%3a3.5.17-1+b3_arm64.deb ...
Unpacking libxpm4:arm64 (1:3.5.17-1+b3) ...
Selecting previously unselected package libxaw7:arm64.
Preparing to unpack .../121-libxaw7_2%3a1.0.16-1_arm64.deb ...
Unpacking libxaw7:arm64 (2:1.0.16-1) ...
Selecting previously unselected package libxfont2:arm64.
Preparing to unpack .../122-libxfont2_1%3a2.0.6-1+b3_arm64.deb ...
Unpacking libxfont2:arm64 (1:2.0.6-1+b3) ...
Selecting previously unselected package libxkbfile1:arm64.
Preparing to unpack .../123-libxkbfile1_1%3a1.1.0-1+b3_arm64.deb ...
Unpacking libxkbfile1:arm64 (1:1.1.0-1+b3) ...
Selecting previously unselected package libxmuu1:arm64.
Preparing to unpack .../124-libxmuu1_2%3a1.1.3-3+b4_arm64.deb ...
Unpacking libxmuu1:arm64 (2:1.1.3-3+b4) ...
Selecting previously unselected package libxrandr2:arm64.
Preparing to unpack .../125-libxrandr2_2%3a1.5.4-1+b2_arm64.deb ...
Unpacking libxrandr2:arm64 (2:1.5.4-1+b2) ...
Selecting previously unselected package python3-packaging.
Preparing to unpack .../126-python3-packaging_24.2-1_all.deb ...
Unpacking python3-packaging (24.2-1) ...
Selecting previously unselected package python3-pyproject-hooks.
Preparing to unpack .../127-python3-pyproject-hooks_1.2.0-1_all.deb ...
Unpacking python3-pyproject-hooks (1.2.0-1) ...
Selecting previously unselected package python3-toml.
Preparing to unpack .../128-python3-toml_0.10.2-1_all.deb ...
Unpacking python3-toml (0.10.2-1) ...
Selecting previously unselected package python3-wheel.
Preparing to unpack .../129-python3-wheel_0.45.1-1_all.deb ...
Unpacking python3-wheel (0.45.1-1) ...
Selecting previously unselected package python3-build.
Preparing to unpack .../130-python3-build_1.2.2-1_all.deb ...
Unpacking python3-build (1.2.2-1) ...
Selecting previously unselected package python3-installer.
Preparing to unpack .../131-python3-installer_0.7.0+dfsg1-3_all.deb ...
Unpacking python3-installer (0.7.0+dfsg1-3) ...
Selecting previously unselected package pybuild-plugin-pyproject.
Preparing to unpack .../132-pybuild-plugin-pyproject_6.20241217_all.deb ...
Unpacking pybuild-plugin-pyproject (6.20241217) ...
Selecting previously unselected package python3-pyqt6.sip.
Preparing to unpack .../133-python3-pyqt6.sip_13.9.1-1_arm64.deb ...
Unpacking python3-pyqt6.sip (13.9.1-1) ...
Selecting previously unselected package python3-pyqt6.
Preparing to unpack .../134-python3-pyqt6_6.8.0-1+b1_arm64.deb ...
Unpacking python3-pyqt6 (6.8.0-1+b1) ...
Selecting previously unselected package pyqt6-dev-tools.
Preparing to unpack .../135-pyqt6-dev-tools_6.8.0-1_all.deb ...
Unpacking pyqt6-dev-tools (6.8.0-1) ...
Selecting previously unselected package python-babel-localedata.
Preparing to unpack .../136-python-babel-localedata_2.16.0-1_all.deb ...
Unpacking python-babel-localedata (2.16.0-1) ...
Selecting previously unselected package python-tables-data.
Preparing to unpack .../137-python-tables-data_3.10.1-2_all.deb ...
Unpacking python-tables-data (3.10.1-2) ...
Selecting previously unselected package python3-alabaster.
Preparing to unpack .../138-python3-alabaster_0.7.16-0.1_all.deb ...
Unpacking python3-alabaster (0.7.16-0.1) ...
Selecting previously unselected package python3-babel.
Preparing to unpack .../139-python3-babel_2.16.0-1_all.deb ...
Unpacking python3-babel (2.16.0-1) ...
Selecting previously unselected package python3-certifi.
Preparing to unpack .../140-python3-certifi_2024.12.14+ds-1_all.deb ...
Unpacking python3-certifi (2024.12.14+ds-1) ...
Selecting previously unselected package python3-chardet.
Preparing to unpack .../141-python3-chardet_5.2.0+dfsg-1_all.deb ...
Unpacking python3-chardet (5.2.0+dfsg-1) ...
Selecting previously unselected package python3-charset-normalizer.
Preparing to unpack .../142-python3-charset-normalizer_3.4.0-1+b1_arm64.deb ...
Unpacking python3-charset-normalizer (3.4.0-1+b1) ...
Selecting previously unselected package python3-cpuinfo.
Preparing to unpack .../143-python3-cpuinfo_9.0.0+git20221119-2_all.deb ...
Unpacking python3-cpuinfo (9.0.0+git20221119-2) ...
Selecting previously unselected package python3-defusedxml.
Preparing to unpack .../144-python3-defusedxml_0.7.1-3_all.deb ...
Unpacking python3-defusedxml (0.7.1-3) ...
Selecting previously unselected package python3-roman.
Preparing to unpack .../145-python3-roman_4.2-1_all.deb ...
Unpacking python3-roman (4.2-1) ...
Selecting previously unselected package python3-docutils.
Preparing to unpack .../146-python3-docutils_0.21.2+dfsg-2_all.deb ...
Unpacking python3-docutils (0.21.2+dfsg-2) ...
Selecting previously unselected package python3-easyprocess.
Preparing to unpack .../147-python3-easyprocess_1.1-1_all.deb ...
Unpacking python3-easyprocess (1.1-1) ...
Selecting previously unselected package python3-pathspec.
Preparing to unpack .../148-python3-pathspec_0.12.1-1_all.deb ...
Unpacking python3-pathspec (0.12.1-1) ...
Selecting previously unselected package python3-pluggy.
Preparing to unpack .../149-python3-pluggy_1.5.0-1_all.deb ...
Unpacking python3-pluggy (1.5.0-1) ...
Selecting previously unselected package python3-trove-classifiers.
Preparing to unpack .../150-python3-trove-classifiers_2024.9.12-1_all.deb ...
Unpacking python3-trove-classifiers (2024.9.12-1) ...
Selecting previously unselected package python3-hatchling.
Preparing to unpack .../151-python3-hatchling_1.27.0-1_all.deb ...
Unpacking python3-hatchling (1.27.0-1) ...
Selecting previously unselected package python3-idna.
Preparing to unpack .../152-python3-idna_3.8-2_all.deb ...
Unpacking python3-idna (3.8-2) ...
Selecting previously unselected package python3-imagesize.
Preparing to unpack .../153-python3-imagesize_1.4.1-1_all.deb ...
Unpacking python3-imagesize (1.4.1-1) ...
Selecting previously unselected package python3-iniconfig.
Preparing to unpack .../154-python3-iniconfig_1.1.1-2_all.deb ...
Unpacking python3-iniconfig (1.1.1-2) ...
Selecting previously unselected package python3-markupsafe.
Preparing to unpack .../155-python3-markupsafe_2.1.5-1+b3_arm64.deb ...
Unpacking python3-markupsafe (2.1.5-1+b3) ...
Selecting previously unselected package python3-jinja2.
Preparing to unpack .../156-python3-jinja2_3.1.3-2_all.deb ...
Unpacking python3-jinja2 (3.1.3-2) ...
Selecting previously unselected package python3-numpy.
Preparing to unpack .../157-python3-numpy_1%3a1.26.4+ds-12_arm64.deb ...
Unpacking python3-numpy (1:1.26.4+ds-12) ...
Selecting previously unselected package python3-numexpr.
Preparing to unpack .../158-python3-numexpr_2.10.2-1_arm64.deb ...
Unpacking python3-numexpr (2.10.2-1) ...
Selecting previously unselected package python3-pygments.
Preparing to unpack .../159-python3-pygments_2.18.0+dfsg-1_all.deb ...
Unpacking python3-pygments (2.18.0+dfsg-1) ...
Selecting previously unselected package python3-pyqt5.sip.
Preparing to unpack .../160-python3-pyqt5.sip_12.16.1-1_arm64.deb ...
Unpacking python3-pyqt5.sip (12.16.1-1) ...
Selecting previously unselected package python3-pyqt5.
Preparing to unpack .../161-python3-pyqt5_5.15.11+dfsg-1+b3_arm64.deb ...
Unpacking python3-pyqt5 (5.15.11+dfsg-1+b3) ...
Selecting previously unselected package python3-pyqt5.qtchart.
Preparing to unpack .../162-python3-pyqt5.qtchart_5.15.7+dfsg-1+b1_arm64.deb ...
Unpacking python3-pyqt5.qtchart (5.15.7+dfsg-1+b1) ...
Selecting previously unselected package python3-pyqt5.qtmultimedia.
Preparing to unpack .../163-python3-pyqt5.qtmultimedia_5.15.11+dfsg-1+b3_arm64.deb ...
Unpacking python3-pyqt5.qtmultimedia (5.15.11+dfsg-1+b3) ...
Selecting previously unselected package python3-pyqt5.qtopengl.
Preparing to unpack .../164-python3-pyqt5.qtopengl_5.15.11+dfsg-1+b3_arm64.deb ...
Unpacking python3-pyqt5.qtopengl (5.15.11+dfsg-1+b3) ...
Selecting previously unselected package python3-pyqt5.qtpositioning.
Preparing to unpack .../165-python3-pyqt5.qtpositioning_5.15.11+dfsg-1+b3_arm64.deb ...
Unpacking python3-pyqt5.qtpositioning (5.15.11+dfsg-1+b3) ...
Selecting previously unselected package python3-pyqt5.qtquick.
Preparing to unpack .../166-python3-pyqt5.qtquick_5.15.11+dfsg-1+b3_arm64.deb ...
Unpacking python3-pyqt5.qtquick (5.15.11+dfsg-1+b3) ...
Selecting previously unselected package python3-pyqt5.qtremoteobjects.
Preparing to unpack .../167-python3-pyqt5.qtremoteobjects_5.15.11+dfsg-1+b3_arm64.deb ...
Unpacking python3-pyqt5.qtremoteobjects (5.15.11+dfsg-1+b3) ...
Selecting previously unselected package python3-pyqt5.qtsensors.
Preparing to unpack .../168-python3-pyqt5.qtsensors_5.15.11+dfsg-1+b3_arm64.deb ...
Unpacking python3-pyqt5.qtsensors (5.15.11+dfsg-1+b3) ...
Selecting previously unselected package python3-pyqt5.qtserialport.
Preparing to unpack .../169-python3-pyqt5.qtserialport_5.15.11+dfsg-1+b3_arm64.deb ...
Unpacking python3-pyqt5.qtserialport (5.15.11+dfsg-1+b3) ...
Selecting previously unselected package python3-pyqt5.qtsql.
Preparing to unpack .../170-python3-pyqt5.qtsql_5.15.11+dfsg-1+b3_arm64.deb ...
Unpacking python3-pyqt5.qtsql (5.15.11+dfsg-1+b3) ...
Selecting previously unselected package python3-pyqt5.qtsvg.
Preparing to unpack .../171-python3-pyqt5.qtsvg_5.15.11+dfsg-1+b3_arm64.deb ...
Unpacking python3-pyqt5.qtsvg (5.15.11+dfsg-1+b3) ...
Selecting previously unselected package python3-pyqt5.qttexttospeech.
Preparing to unpack .../172-python3-pyqt5.qttexttospeech_5.15.11+dfsg-1+b3_arm64.deb ...
Unpacking python3-pyqt5.qttexttospeech (5.15.11+dfsg-1+b3) ...
Selecting previously unselected package python3-pyqt5.qtwebchannel.
Preparing to unpack .../173-python3-pyqt5.qtwebchannel_5.15.11+dfsg-1+b3_arm64.deb ...
Unpacking python3-pyqt5.qtwebchannel (5.15.11+dfsg-1+b3) ...
Selecting previously unselected package python3-pyqt5.qtwebkit.
Preparing to unpack .../174-python3-pyqt5.qtwebkit_5.15.11+dfsg-1+b3_arm64.deb ...
Unpacking python3-pyqt5.qtwebkit (5.15.11+dfsg-1+b3) ...
Selecting previously unselected package python3-pyqt5.qtwebsockets.
Preparing to unpack .../175-python3-pyqt5.qtwebsockets_5.15.11+dfsg-1+b3_arm64.deb ...
Unpacking python3-pyqt5.qtwebsockets (5.15.11+dfsg-1+b3) ...
Selecting previously unselected package python3-pyqt5.qtxmlpatterns.
Preparing to unpack .../176-python3-pyqt5.qtxmlpatterns_5.15.11+dfsg-1+b3_arm64.deb ...
Unpacking python3-pyqt5.qtxmlpatterns (5.15.11+dfsg-1+b3) ...
Selecting previously unselected package python3-pytest.
Preparing to unpack .../177-python3-pytest_8.3.4-1_all.deb ...
Unpacking python3-pytest (8.3.4-1) ...
Selecting previously unselected package x11-xkb-utils.
Preparing to unpack .../178-x11-xkb-utils_7.7+9_arm64.deb ...
Unpacking x11-xkb-utils (7.7+9) ...
Selecting previously unselected package xserver-common.
Preparing to unpack .../179-xserver-common_2%3a21.1.15-2_all.deb ...
Unpacking xserver-common (2:21.1.15-2) ...
Selecting previously unselected package xvfb.
Preparing to unpack .../180-xvfb_2%3a21.1.15-2_arm64.deb ...
Unpacking xvfb (2:21.1.15-2) ...
Selecting previously unselected package python3-pyvirtualdisplay.
Preparing to unpack .../181-python3-pyvirtualdisplay_2.2-2_all.deb ...
Unpacking python3-pyvirtualdisplay (2.2-2) ...
Selecting previously unselected package xauth.
Preparing to unpack .../182-xauth_1%3a1.1.2-1.1_arm64.deb ...
Unpacking xauth (1:1.1.2-1.1) ...
Selecting previously unselected package python3-pytest-xvfb.
Preparing to unpack .../183-python3-pytest-xvfb_3.0.0-2_all.deb ...
Unpacking python3-pytest-xvfb (3.0.0-2) ...
Selecting previously unselected package python3-qtpy.
Preparing to unpack .../184-python3-qtpy_2.4.2-4_all.deb ...
Unpacking python3-qtpy (2.4.2-4) ...
Selecting previously unselected package python3-urllib3.
Preparing to unpack .../185-python3-urllib3_2.2.3-4_all.deb ...
Unpacking python3-urllib3 (2.2.3-4) ...
Selecting previously unselected package python3-requests.
Preparing to unpack .../186-python3-requests_2.32.3+dfsg-1_all.deb ...
Unpacking python3-requests (2.32.3+dfsg-1) ...
Selecting previously unselected package python3-snowballstemmer.
Preparing to unpack .../187-python3-snowballstemmer_2.2.0-4_all.deb ...
Unpacking python3-snowballstemmer (2.2.0-4) ...
Selecting previously unselected package sphinx-common.
Preparing to unpack .../188-sphinx-common_8.1.3-4_all.deb ...
Unpacking sphinx-common (8.1.3-4) ...
Selecting previously unselected package python3-sphinx.
Preparing to unpack .../189-python3-sphinx_8.1.3-4_all.deb ...
Unpacking python3-sphinx (8.1.3-4) ...
Selecting previously unselected package python3-sphinxcontrib.qthelp.
Preparing to unpack .../190-python3-sphinxcontrib.qthelp_2.0.0-1_all.deb ...
Unpacking python3-sphinxcontrib.qthelp (2.0.0-1) ...
Selecting previously unselected package python3-tables-lib.
Preparing to unpack .../191-python3-tables-lib_3.10.1-2_arm64.deb ...
Unpacking python3-tables-lib (3.10.1-2) ...
Selecting previously unselected package python3-tables.
Preparing to unpack .../192-python3-tables_3.10.1-2_all.deb ...
Unpacking python3-tables (3.10.1-2) ...
Setting up media-types (10.1.0) ...
Setting up libb2-1:arm64 (0.98.1-1.1+b2) ...
Setting up libpipeline1:arm64 (1.5.8-1) ...
Setting up libgraphite2-3:arm64 (1.3.14-2+b1) ...
Setting up libpixman-1-0:arm64 (0.44.0-3) ...
Setting up libsharpyuv0:arm64 (1.4.0-0.1+b1) ...
Setting up libxau6:arm64 (1:1.0.11-1) ...
Setting up libxdmcp6:arm64 (1:1.1.5-1) ...
Setting up libdouble-conversion3:arm64 (3.3.0-1+b2) ...
Setting up libkeyutils1:arm64 (1.6.3-4) ...
Setting up libxcb1:arm64 (1.17.0-2+b1) ...
Setting up libicu72:arm64 (72.1-5+b1) ...
Setting up libxcb-xfixes0:arm64 (1.17.0-2+b1) ...
Setting up libogg0:arm64 (1.3.5-3+b2) ...
Setting up bsdextrautils (2.40.2-14) ...
Setting up libgpg-error0:arm64 (1.51-3) ...
Setting up libxcb-xinput0:arm64 (1.17.0-2+b1) ...
Setting up libhyphen0:arm64 (2.8.8-7+b2) ...
Setting up libmagic-mgc (1:5.45-3+b1) ...
Setting up libxcb-render0:arm64 (1.17.0-2+b1) ...
Setting up libarchive-zip-perl (1.68-1) ...
Setting up libglvnd0:arm64 (1.7.0-1+b2) ...
Setting up libts0t64:arm64 (1.22-1.1+b1) ...
Setting up libxcb-glx0:arm64 (1.17.0-2+b1) ...
Setting up libdebhelper-perl (13.23) ...
Setting up libbrotli1:arm64 (1.1.0-2+b6) ...
Setting up libedit2:arm64 (3.1-20240808-1) ...
Setting up libmagic1t64:arm64 (1:5.45-3+b1) ...
Setting up libxcb-keysyms1:arm64 (0.4.0-1+b3) ...
Setting up libxcb-shape0:arm64 (1.17.0-2+b1) ...
Setting up x11-common (1:7.7+23.1) ...
invoke-rc.d: could not determine current runlevel
Setting up X socket directories... /tmp/.X11-unix /tmp/.ICE-unix.
Setting up libsensors-config (1:3.6.0-10) ...
Setting up libnghttp2-14:arm64 (1.64.0-1) ...
Setting up gettext-base (0.22.5-4) ...
Setting up m4 (1.4.19-5) ...
Setting up libgcrypt20:arm64 (1.11.0-7) ...
Setting up libxcb-render-util0:arm64 (0.3.9-1+b2) ...
Setting up xkb-data (2.42-1) ...
Setting up liblzo2-2:arm64 (2.10-3+b1) ...
Setting up libxcb-shm0:arm64 (1.17.0-2+b1) ...
Setting up libxcb-icccm4:arm64 (0.4.2-1) ...
Setting up libcom-err2:arm64 (1.47.2-1) ...
Setting up file (1:5.45-3+b1) ...
Setting up libmpg123-0t64:arm64 (1.32.10-1) ...
Setting up libunwind8:arm64 (1.6.2-3.1) ...
Setting up libpcre2-16-0:arm64 (10.44-5) ...
Setting up libaec0:arm64 (1.1.3-1+b1) ...
Setting up libopengl0:arm64 (1.7.0-1+b2) ...
Setting up libelf1t64:arm64 (0.192-4) ...
Setting up python-babel-localedata (2.16.0-1) ...
Setting up libxcb-util1:arm64 (0.4.0-1+b2) ...
Setting up libsnappy1v5:arm64 (1.2.1-1+b1) ...
Setting up liborc-0.4-0t64:arm64 (1:0.4.40-1) ...
Setting up libxcb-xkb1:arm64 (1.17.0-2+b1) ...
Setting up libxcb-image0:arm64 (0.4.0-2+b2) ...
Setting up libkrb5support0:arm64 (1.21.3-3) ...
Setting up libdw1t64:arm64 (0.192-4) ...
Setting up libsasl2-modules-db:arm64 (2.1.28+dfsg1-8) ...
Setting up tzdata (2024b-4) ...

Current default time zone: 'Etc/UTC'
Local time is now:      Tue Feb 10 15:55:49 UTC 2026.
Universal Time is now:  Tue Feb 10 15:55:49 UTC 2026.
Run 'dpkg-reconfigure tzdata' if you wish to change it.

Setting up libcap2-bin (1:2.66-5+b1) ...
Setting up libxcb-present0:arm64 (1.17.0-2+b1) ...
Setting up libblosc2-4:arm64 (2.15.2+ds-5) ...
Setting up libfontenc1:arm64 (1:1.1.8-1+b2) ...
Setting up autotools-dev (20220109.1) ...
Setting up libz3-4:arm64 (4.13.3-1) ...
Setting up libblas3:arm64 (3.12.0-4) ...
update-alternatives: using /usr/lib/aarch64-linux-gnu/blas/libblas.so.3 to provide /usr/lib/aarch64-linux-gnu/libblas.so.3 (libblas.so.3-aarch64-linux-gnu) in auto mode
Setting up libxcb-xinerama0:arm64 (1.17.0-2+b1) ...
Setting up libjpeg62-turbo:arm64 (1:2.1.5-3+b1) ...
Setting up libx11-data (2:1.8.10-2) ...
Setting up libxcb-sync1:arm64 (1.17.0-2+b1) ...
Setting up libxcb-cursor0:arm64 (0.1.4-1+b2) ...
Setting up libavahi-common-data:arm64 (0.8-16) ...
Setting up libdbus-1-3:arm64 (1.16.0-1) ...
Setting up libopus0:arm64 (1.5.2-2) ...
Setting up libunistring5:arm64 (1.3-1) ...
Setting up fonts-dejavu-mono (2.37-8) ...
Setting up libpng16-16t64:arm64 (1.6.44-3) ...
Setting up libvorbis0a:arm64 (1.3.7-2+b1) ...
Setting up autopoint (0.22.5-4) ...
Setting up fonts-dejavu-core (2.37-8) ...
Setting up libsensors5:arm64 (1:3.6.0-10+b1) ...
Setting up libk5crypto3:arm64 (1.21.3-3) ...
Setting up libglapi-mesa:arm64 (24.2.8-1) ...
Setting up libsasl2-2:arm64 (2.1.28+dfsg1-8) ...
Setting up libgfortran5:arm64 (14.2.0-12) ...
Setting up libvulkan1:arm64 (1.3.296.0-1) ...
Setting up autoconf (2.72-3) ...
Setting up libnghttp3-9:arm64 (1.6.0-2) ...
Setting up libwebp7:arm64 (1.4.0-0.1+b1) ...
Setting up libxcb-dri2-0:arm64 (1.17.0-2+b1) ...
Setting up libffi8:arm64 (3.4.6-1) ...
Setting up dwz (0.15-1+b1) ...
Setting up libmtdev1t64:arm64 (1.1.6-1.2+b1) ...
Setting up sensible-utils (0.0.24) ...
Setting up libduktape207:arm64 (2.7.0-2+b2) ...
Setting up libasyncns0:arm64 (0.8-6+b5) ...
Setting up libxshmfence1:arm64 (1.3-1+b3) ...
Setting up libxcb-randr0:arm64 (1.17.0-2+b1) ...
Setting up libuchardet0:arm64 (0.0.8-1+b2) ...
Setting up libjson-perl (4.10000-1) ...
Setting up libblosc1:arm64 (1.21.5+ds-1+b2) ...
Setting up libtasn1-6:arm64 (4.19.0-3+b3) ...
Setting up libmd4c0:arm64 (0.5.2-2+b1) ...
Setting up libx11-6:arm64 (2:1.8.10-2) ...
Setting up netbase (6.4) ...
Setting up libngtcp2-16:arm64 (1.9.1-1) ...
Setting up sgml-base (1.31) ...
Setting up libkrb5-3:arm64 (1.21.3-3) ...
Setting up libflac12t64:arm64 (1.4.3+ds-4) ...
Setting up libxkbfile1:arm64 (1:1.1.0-1+b3) ...
Setting up libssh2-1t64:arm64 (1.11.1-1) ...
Setting up libjs-jquery (3.6.1+dfsg+~3.5.14-1) ...
Setting up openssl (3.4.0-2) ...
Setting up libdrm-common (2.4.123-1) ...
Setting up libevdev2:arm64 (1.13.3+dfsg-1) ...
Setting up readline-common (8.2-6) ...
Setting up libxml2:arm64 (2.12.7+dfsg+really2.9.14-0.2+b1) ...
Setting up python-tables-data (3.10.1-2) ...
Setting up iso-codes (4.17.0-1) ...
Setting up libxmuu1:arm64 (2:1.1.3-3+b4) ...
Setting up libmp3lame0:arm64 (3.100-6+b3) ...
Setting up libsz2:arm64 (1.1.3-1+b1) ...
Setting up libvorbisenc2:arm64 (1.3.7-2+b1) ...
Setting up libjs-underscore (1.13.4~dfsg+~1.11.4-3) ...
Setting up libwacom-common (2.13.0-1) ...
Setting up libxkbcommon0:arm64 (1.7.0-2) ...
Setting up libwayland-client0:arm64 (1.23.0-1+b1) ...
Setting up automake (1:1.16.5-1.3) ...
update-alternatives: using /usr/bin/automake-1.16 to provide /usr/bin/automake (automake) in auto mode
Setting up libfile-stripnondeterminism-perl (1.14.0-1) ...
Setting up libxcb-dri3-0:arm64 (1.17.0-2+b1) ...
Setting up libllvm19:arm64 (1:19.1.6-1) ...
Setting up libwayland-server0:arm64 (1.23.0-1+b1) ...
Setting up libx11-xcb1:arm64 (2:1.8.10-2) ...
Setting up libice6:arm64 (2:1.1.1-1) ...
Setting up liblapack3:arm64 (3.12.0-4) ...
update-alternatives: using /usr/lib/aarch64-linux-gnu/lapack/liblapack.so.3 to provide /usr/lib/aarch64-linux-gnu/liblapack.so.3 (liblapack.so.3-aarch64-linux-gnu) in auto mode
Setting up gettext (0.22.5-4) ...
Setting up libxpm4:arm64 (1:3.5.17-1+b3) ...
Setting up libwoff1:arm64 (1.0.2-2+b2) ...
Setting up libxrender1:arm64 (1:0.9.10-1.1+b3) ...
Setting up libtool (2.5.4-2) ...
Setting up fontconfig-config (2.15.0-1.1+b1) ...
Setting up libavahi-common3:arm64 (0.8-16) ...
Setting up libxext6:arm64 (2:1.3.4-1+b3) ...
Setting up libidn2-0:arm64 (2.3.7-2+b1) ...
Setting up libxxf86vm1:arm64 (1:1.1.4-1+b4) ...
Setting up intltool-debian (0.35.0+20060710.6) ...
Setting up dh-autoreconf (20) ...
Setting up ca-certificates (20241223) ...
Updating certificates in /etc/ssl/certs...
152 added, 0 removed; done.
Setting up libglib2.0-0t64:arm64 (2.82.4-1) ...
No schema files found: doing nothing.
Setting up libfreetype6:arm64 (2.13.3+dfsg-1) ...
Setting up libxfixes3:arm64 (1:6.0.0-2+b3) ...
Setting up shared-mime-info (2.4-5+b1) ...
Setting up libp11-kit0:arm64 (0.25.5-3) ...
Setting up libxkbcommon-x11-0:arm64 (1.7.0-2) ...
Setting up libgssapi-krb5-2:arm64 (1.21.3-3) ...
Setting up libxrandr2:arm64 (2:1.5.4-1+b2) ...
Setting up libjs-sphinxdoc (8.1.3-4) ...
Setting up libreadline8t64:arm64 (8.2-6) ...
Setting up dh-strip-nondeterminism (1.14.0-1) ...
Setting up libdrm2:arm64 (2.4.123-1) ...
Setting up xauth (1:1.1.2-1.1) ...
Setting up groff-base (1.23.0-7) ...
Setting up xml-core (0.19) ...
Setting up libxslt1.1:arm64 (1.1.35-1.1+b1) ...
Setting up libharfbuzz0b:arm64 (10.1.0-2) ...
Setting up libfontconfig1:arm64 (2.15.0-1.1+b1) ...
Setting up libsndfile1:arm64 (1.2.2-2) ...
Setting up libsm6:arm64 (2:1.2.4-1) ...
Setting up libxfont2:arm64 (1:2.0.6-1+b3) ...
Setting up libpython3.13-stdlib:arm64 (3.13.1-3) ...
Setting up libavahi-client3:arm64 (0.8-16) ...
Setting up libgudev-1.0-0:arm64 (238-5+b1) ...
Setting up libgstreamer1.0-0:arm64 (1.24.10-2) ...
Setcap worked! gst-ptp-helper is not suid!
Setting up libpython3-stdlib:arm64 (3.13.1-1) ...
Setting up libdrm-amdgpu1:arm64 (2.4.123-1) ...
Setting up libpython3.13:arm64 (3.13.1-3) ...
Setting up libgnutls30t64:arm64 (3.8.8-2) ...
Setting up libqt6core6t64:arm64 (6.7.2+dfsg-5) ...
Setting up fontconfig (2.15.0-1.1+b1) ...
Regenerating fonts cache... done.
Setting up libqt6test6:arm64 (6.7.2+dfsg-5) ...
Setting up libpulse0:arm64 (17.0+dfsg1-1) ...
Setting up python3.13 (3.13.1-3) ...
Setting up libwacom9:arm64 (2.13.0-1) ...
Setting up libdrm-radeon1:arm64 (2.4.123-1) ...
Setting up po-debconf (1.0.21+nmu1) ...
Setting up libpsl5t64:arm64 (0.21.2-1.1+b1) ...
Setting up libgstreamer-plugins-base1.0-0:arm64 (1.24.11-1) ...
Setting up python3 (3.13.1-1) ...
/usr/bin/py3clean:101: DeprecationWarning: glob.glob1 is deprecated and will be removed in Python 3.15. Use glob.glob and pass a directory to its root_dir argument instead.
  for fn in glob1(directory, "%s.*" % fname):
Setting up python3-zipp (3.21.0-1) ...
Setting up python3-autocommand (2.2.2-3) ...
Setting up man-db (2.13.0-1) ...
Not building database; man-db/auto-update is not 'true'.
Setting up python3-markupsafe (2.1.5-1+b3) ...
Setting up python3-wheel (0.45.1-1) ...
Setting up libldap-2.5-0:arm64 (2.5.19+dfsg-1) ...
Setting up libinput-bin (1.26.2-1) ...
Setting up python3-roman (4.2-1) ...
Setting up libqt5core5t64:arm64 (5.15.15+dfsg-2) ...
Setting up libqt5texttospeech5:arm64 (5.15.15-2) ...
Setting up python3-jinja2 (3.1.3-2) ...
Setting up python3-packaging (24.2-1) ...
Setting up python3-easyprocess (1.1-1) ...
Setting up python3-pyproject-hooks (1.2.0-1) ...
Setting up libqt6xml6:arm64 (6.7.2+dfsg-5) ...
Setting up python3-certifi (2024.12.14+ds-1) ...
Setting up libqt6sql6:arm64 (6.7.2+dfsg-5) ...
Setting up librtmp1:arm64 (2.4+20151223.gitfa8646d.1-2+b5) ...
Setting up python3-snowballstemmer (2.2.0-4) ...
Setting up sphinx-common (8.1.3-4) ...
Setting up libxt6t64:arm64 (1:1.2.1-1.2+b2) ...
Setting up python3-idna (3.8-2) ...
Setting up python3-typing-extensions (4.12.2-2) ...
Setting up python3-cpuinfo (9.0.0+git20221119-2) ...
Setting up python3-toml (0.10.2-1) ...
Setting up python3-installer (0.7.0+dfsg1-3) ...
Setting up python3-urllib3 (2.2.3-4) ...
Setting up python3-pluggy (1.5.0-1) ...
Setting up python3-pyqt5.sip (12.16.1-1) ...
Setting up python3-trove-classifiers (2024.9.12-1) ...
Setting up libqt5sql5t64:arm64 (5.15.15+dfsg-2) ...
Setting up python3-pyqt6.sip (13.9.1-1) ...
Setting up python3-build (1.2.2-1) ...
Setting up python3-pathspec (0.12.1-1) ...
Setting up libcups2t64:arm64 (2.4.10-2+b1) ...
Setting up libngtcp2-crypto-gnutls8:arm64 (1.9.1-1) ...
Setting up libqt6dbus6:arm64 (6.7.2+dfsg-5) ...
Setting up python3-imagesize (1.4.1-1) ...
Setting up python3-more-itertools (10.5.0-1) ...
Setting up python3-iniconfig (1.1.1-2) ...
Setting up libinput10:arm64 (1.26.2-1) ...
Setting up mesa-libgallium:arm64 (24.2.8-1) ...
Setting up libxmu6:arm64 (2:1.1.3-3+b4) ...
Setting up libqt5dbus5t64:arm64 (5.15.15+dfsg-2) ...
Setting up python3-jaraco.functools (4.1.0-1) ...
Setting up python3-jaraco.context (6.0.0-1) ...
Setting up libcurl4t64:arm64 (8.11.1-1) ...
Setting up libgbm1:arm64 (24.2.8-1) ...
Setting up python3-defusedxml (0.7.1-3) ...
Setting up python3-charset-normalizer (3.4.0-1+b1) ...
Setting up python3-pytest (8.3.4-1) ...
Setting up python3-alabaster (0.7.16-0.1) ...
Setting up libqt5positioning5:arm64 (5.15.15+dfsg-2) ...
Setting up python3-typeguard (4.4.1-1) ...
Setting up libgl1-mesa-dri:arm64 (24.2.8-1) ...
Setting up libqt5network5t64:arm64 (5.15.15+dfsg-2) ...
Setting up libcurl3t64-gnutls:arm64 (8.11.1-1) ...
Setting up libqt5xml5t64:arm64 (5.15.15+dfsg-2) ...
Setting up debhelper (13.23) ...
Setting up libqt5serialport5:arm64 (5.15.15-2) ...
Setting up libxaw7:arm64 (2:1.0.16-1) ...
Setting up libqt5test5t64:arm64 (5.15.15+dfsg-2) ...
Setting up python3-inflect (7.3.1-2) ...
Setting up libqt5websockets5:arm64 (5.15.15-2) ...
Setting up libegl-mesa0:arm64 (24.2.8-1) ...
Setting up libqt5qml5:arm64 (5.15.15+dfsg-3) ...
Setting up python3-jaraco.text (4.0.0-1) ...
Setting up libqt5webchannel5:arm64 (5.15.15-2) ...
Setting up libhdf5-310:arm64 (1.14.5+repack-3) ...
Setting up libegl1:arm64 (1.7.0-1+b2) ...
Setting up python3-hatchling (1.27.0-1) ...
Setting up libqt5sensors5:arm64 (5.15.15-2) ...
Setting up python3-pkg-resources (75.6.0-1) ...
Setting up libproxy1v5:arm64 (0.5.9-1) ...
Setting up libqt5qmlmodels5:arm64 (5.15.15+dfsg-3) ...
Setting up libglx-mesa0:arm64 (24.2.8-1) ...
Setting up python3-setuptools (75.6.0-1) ...
Setting up libglx0:arm64 (1.7.0-1+b2) ...
Setting up python3-babel (2.16.0-1) ...
update-alternatives: using /usr/bin/pybabel-python3 to provide /usr/bin/pybabel (pybabel) in auto mode
Setting up libqt5xmlpatterns5:arm64 (5.15.15-2) ...
Setting up x11-xkb-utils (7.7+9) ...
Setting up libqt5remoteobjects5:arm64 (5.15.15-2) ...
Setting up python3-pygments (2.18.0+dfsg-1) ...
Setting up python3-chardet (5.2.0+dfsg-1) ...
Setting up libgl1:arm64 (1.7.0-1+b2) ...
Setting up libqt6gui6:arm64 (6.7.2+dfsg-5) ...
Setting up python3-requests (2.32.3+dfsg-1) ...
Setting up python3-numpy (1:1.26.4+ds-12) ...
Setting up libqt6network6:arm64 (6.7.2+dfsg-5) ...
Setting up xserver-common (2:21.1.15-2) ...
Setting up dh-python (6.20241217) ...
Setting up pybuild-plugin-pyproject (6.20241217) ...
Setting up python3-tables-lib (3.10.1-2) ...
Setting up xvfb (2:21.1.15-2) ...
Setting up libqt6opengl6:arm64 (6.7.2+dfsg-5) ...
Setting up libqt6widgets6:arm64 (6.7.2+dfsg-5) ...
Setting up libqt5gui5t64:arm64 (5.15.15+dfsg-2) ...
Setting up python3-numexpr (2.10.2-1) ...
Setting up libqt5quick5:arm64 (5.15.15+dfsg-3) ...
Setting up libqt6openglwidgets6:arm64 (6.7.2+dfsg-5) ...
Setting up libqt5positioningquick5:arm64 (5.15.15+dfsg-2) ...
Setting up libqt6printsupport6:arm64 (6.7.2+dfsg-5) ...
Setting up libqt5location5:arm64 (5.15.15+dfsg-2) ...
Setting up python3-pyqt6 (6.8.0-1+b1) ...
Setting up libqt5widgets5t64:arm64 (5.15.15+dfsg-2) ...
Setting up python3-pyvirtualdisplay (2.2-2) ...
Setting up pyqt6-dev-tools (6.8.0-1) ...
Setting up libqt5svg5:arm64 (5.15.15-2) ...
Setting up python3-tables (3.10.1-2) ...
Setting up libqt5help5:arm64 (5.15.15-4) ...
Setting up libqt5charts5:arm64 (5.15.15-2) ...
Setting up libqt5multimedia5:arm64 (5.15.15-2) ...
Setting up libqt5quickwidgets5:arm64 (5.15.15+dfsg-3) ...
Setting up libqt5multimediawidgets5:arm64 (5.15.15-2) ...
Setting up libqt5opengl5t64:arm64 (5.15.15+dfsg-2) ...
Setting up libqt5printsupport5t64:arm64 (5.15.15+dfsg-2) ...
Setting up python3-pytest-xvfb (3.0.0-2) ...
Setting up libqt5designer5:arm64 (5.15.15-4) ...
Setting up libqt5webkit5:arm64 (5.212.0~alpha4-41) ...
Setting up python3-pyqt5 (5.15.11+dfsg-1+b3) ...
Setting up python3-pyqt5.qtpositioning (5.15.11+dfsg-1+b3) ...
Setting up python3-pyqt5.qtsvg (5.15.11+dfsg-1+b3) ...
Setting up python3-pyqt5.qttexttospeech (5.15.11+dfsg-1+b3) ...
Setting up python3-pyqt5.qtsql (5.15.11+dfsg-1+b3) ...
Setting up python3-pyqt5.qtopengl (5.15.11+dfsg-1+b3) ...
Setting up python3-pyqt5.qtmultimedia (5.15.11+dfsg-1+b3) ...
Setting up python3-pyqt5.qtchart (5.15.7+dfsg-1+b1) ...
Setting up python3-pyqt5.qtxmlpatterns (5.15.11+dfsg-1+b3) ...
Setting up python3-pyqt5.qtsensors (5.15.11+dfsg-1+b3) ...
Setting up python3-pyqt5.qtwebsockets (5.15.11+dfsg-1+b3) ...
Setting up python3-pyqt5.qtserialport (5.15.11+dfsg-1+b3) ...
Setting up python3-pyqt5.qtremoteobjects (5.15.11+dfsg-1+b3) ...
Setting up python3-pyqt5.qtwebchannel (5.15.11+dfsg-1+b3) ...
Setting up python3-pyqt5.qtwebkit (5.15.11+dfsg-1+b3) ...
Setting up python3-pyqt5.qtquick (5.15.11+dfsg-1+b3) ...
Setting up python3-qtpy (2.4.2-4) ...
Processing triggers for libc-bin (2.40-5) ...
Processing triggers for sgml-base (1.31) ...
Setting up docutils-common (0.21.2+dfsg-2) ...
Processing triggers for sgml-base (1.31) ...
Setting up python3-docutils (0.21.2+dfsg-2) ...
Setting up python3-sphinx (8.1.3-4) ...
Setting up python3-sphinxcontrib.qthelp (2.0.0-1) ...
Processing triggers for ca-certificates (20241223) ...
Updating certificates in /etc/ssl/certs...
0 added, 0 removed; done.
Running hooks in /etc/ca-certificates/update.d...
done.
Reading package lists...
Building dependency tree...
Reading state information...
Reading extended state information...
Initializing package states...
Writing extended state information...
Building tag database...
 -> Finished parsing the build-deps
I: Building the package
I: Running cd /build/reproducible-path/vitables-3.0.3/ && env PATH="/usr/sbin:/usr/bin:/sbin:/bin:/usr/games" HOME="/nonexistent/first-build" dpkg-buildpackage -us -uc -b && env PATH="/usr/sbin:/usr/bin:/sbin:/bin:/usr/games" HOME="/nonexistent/first-build" dpkg-genchanges -S  > ../vitables_3.0.3-1_source.changes
dpkg-buildpackage: info: source package vitables
dpkg-buildpackage: info: source version 3.0.3-1
dpkg-buildpackage: info: source distribution unstable
dpkg-buildpackage: info: source changed by Stuart Prescott <stuart@debian.org>
 dpkg-source --before-build .
dpkg-buildpackage: info: host architecture arm64
 debian/rules clean
dh clean --with python3,sphinxdoc --buildsystem=pybuild
   dh_auto_clean -O--buildsystem=pybuild
	pybuild --clean -i python{version} -p 3.13
	rm -rf .pybuild/
	find . -name \*.pyc -exec rm {} \;
   dh_autoreconf_clean -O--buildsystem=pybuild
   dh_clean -O--buildsystem=pybuild
	rm -f debian/debhelper-build-stamp
	rm -rf debian/.debhelper/
	rm -f -- debian/vitables.substvars debian/files
	rm -fr -- debian/vitables/ debian/tmp/
	find .  \( \( \
		\( -path .\*/.git -o -path .\*/.svn -o -path .\*/.bzr -o -path .\*/.hg -o -path .\*/CVS -o -path .\*/.pc -o -path .\*/_darcs \) -prune -o -type f -a \
	        \( -name '#*#' -o -name '.*~' -o -name '*~' -o -name DEADJOE \
		 -o -name '*.orig' -o -name '*.rej' -o -name '*.bak' \
		 -o -name '.*.orig' -o -name .*.rej -o -name '.SUMS' \
		 -o -name TAGS -o \( -path '*/.deps/*' -a -name '*.P' \) \
		\) -exec rm -f {} + \) -o \
		\( -type d -a \( -name autom4te.cache -o -name __pycache__ \) -prune -exec rm -rf {} + \) \)
   debian/rules execute_after_dh_clean
make[1]: Entering directory '/build/reproducible-path/vitables-3.0.3'
/usr/bin/make -C doc clean
make[2]: Entering directory '/build/reproducible-path/vitables-3.0.3/doc'
rm -rf _build/*
rm -f index.rst
make[2]: Leaving directory '/build/reproducible-path/vitables-3.0.3/doc'
make[1]: Leaving directory '/build/reproducible-path/vitables-3.0.3'
 debian/rules binary
dh binary --with python3,sphinxdoc --buildsystem=pybuild
   dh_update_autotools_config -O--buildsystem=pybuild
   dh_autoreconf -O--buildsystem=pybuild
   dh_auto_configure -O--buildsystem=pybuild
	pybuild --configure -i python{version} -p 3.13
   dh_auto_build -O--buildsystem=pybuild
	pybuild --build -i python{version} -p 3.13
I: pybuild plugin_pyproject:129: Building wheel for python3.13 with "build" module
I: pybuild base:311: python3.13 -m build --skip-dependency-check --no-isolation --wheel --outdir /build/reproducible-path/vitables-3.0.3/.pybuild/cpython3_3.13  
* Building wheel...
Successfully built vitables-3.0.3-py3-none-any.whl
I: pybuild plugin_pyproject:144: Unpacking wheel built for python3.13 with "installer" module
   debian/rules execute_after_dh_auto_build
make[1]: Entering directory '/build/reproducible-path/vitables-3.0.3'
/usr/bin/make -C doc html # generate doc/index.rst
make[2]: Entering directory '/build/reproducible-path/vitables-3.0.3/doc'
mkdir -p _build
cp indices/index_html.rst index.rst
sphinx-build -b html -d _build/doctrees   . _build/html
Running Sphinx v8.1.3
loading translations [en]... done
making output directory... done
Converting `source_suffix = '.rst'` to `source_suffix = {'.rst': 'restructuredtext'}`.
building [mo]: targets for 0 po files that are out of date
writing output... 
building [html]: targets for 9 source files that are out of date
updating environment: [new config] 9 added, 0 changed, 0 removed
reading sources... [ 11%] develop
reading sources... [ 22%] index
reading sources... [ 33%] usersguide-app1
reading sources... [ 44%] usersguide-app2
reading sources... [ 56%] usersguide-ch1
reading sources... [ 67%] usersguide-ch2
reading sources... [ 78%] usersguide-ch3
reading sources... [ 89%] usersguide-ch4
reading sources... [100%] usersguide-ch5

looking for now-outdated files... none found
pickling environment... done
checking consistency... /build/reproducible-path/vitables-3.0.3/doc/develop.rst: WARNING: document isn't included in any toctree
done
preparing documents... done
copying assets... 
copying static files... 
Writing evaluated template result to /build/reproducible-path/vitables-3.0.3/doc/_build/html/_static/language_data.js
Writing evaluated template result to /build/reproducible-path/vitables-3.0.3/doc/_build/html/_static/documentation_options.js
Writing evaluated template result to /build/reproducible-path/vitables-3.0.3/doc/_build/html/_static/basic.css
Writing evaluated template result to /build/reproducible-path/vitables-3.0.3/doc/_build/html/_static/sidebar.js
Writing evaluated template result to /build/reproducible-path/vitables-3.0.3/doc/_build/html/_static/classic.css
copying static files: done
copying extra files... 
copying extra files: done
copying assets: done
writing output... [ 11%] develop
writing output... [ 22%] index
writing output... [ 33%] usersguide-app1
writing output... [ 44%] usersguide-app2
writing output... [ 56%] usersguide-ch1
writing output... [ 67%] usersguide-ch2
writing output... [ 78%] usersguide-ch3
writing output... [ 89%] usersguide-ch4
writing output... [100%] usersguide-ch5

generating indices... genindex done
highlighting module code... 
writing additional pages... search done
copying images... [ 10%] images/title_page_plain.png
copying images... [ 20%] images/helpBrowser.png
copying images... [ 30%] images/mainWindow.png
copying images... [ 40%] images/treeSymbols.png
copying images... [ 50%] images/browseDataset.png
copying images... [ 60%] images/zoomingCells.png
copying images... [ 70%] images/propertiesDlg.png
copying images... [ 80%] images/newFilteredTable.png
copying images... [ 90%] images/groupCreation.png
copying images... [100%] images/editingUserAttrs.png

dumping search index in English (code: en)... done
dumping object inventory... done
build succeeded, 1 warning.

The HTML pages are in _build/html.

Build finished. The HTML pages are in _build/html.
make[2]: Leaving directory '/build/reproducible-path/vitables-3.0.3/doc'
/usr/bin/make -C doc qthelp
make[2]: Entering directory '/build/reproducible-path/vitables-3.0.3/doc'
sphinx-build -b qthelp -d _build/doctrees   . _build/qthelp
Running Sphinx v8.1.3
loading translations [en]... done
making output directory... done
Converting `source_suffix = '.rst'` to `source_suffix = {'.rst': 'restructuredtext'}`.
loading pickled environment... The configuration has changed (4 options: 'qthelp_basename', 'qthelp_namespace', 'qthelp_theme', 'qthelp_theme_options')
done
building [mo]: targets for 0 po files that are out of date
writing output... 
building [qthelp]: targets for 9 source files that are out of date
updating environment: 0 added, 0 changed, 0 removed
reading sources... 
looking for now-outdated files... none found
preparing documents... done
copying assets... 
copying static files... 
Writing evaluated template result to /build/reproducible-path/vitables-3.0.3/doc/_build/qthelp/_static/language_data.js
Writing evaluated template result to /build/reproducible-path/vitables-3.0.3/doc/_build/qthelp/_static/documentation_options.js
Writing evaluated template result to /build/reproducible-path/vitables-3.0.3/doc/_build/qthelp/_static/basic.css
Writing evaluated template result to /build/reproducible-path/vitables-3.0.3/doc/_build/qthelp/_static/nonav.css
copying static files: done
copying extra files... 
copying extra files: done
copying assets: done
writing output... [ 11%] develop
writing output... [ 22%] index
writing output... [ 33%] usersguide-app1
writing output... [ 44%] usersguide-app2
writing output... [ 56%] usersguide-ch1
writing output... [ 67%] usersguide-ch2
writing output... [ 78%] usersguide-ch3
writing output... [ 89%] usersguide-ch4
writing output... [100%] usersguide-ch5

generating indices... genindex done
highlighting module code... 
writing additional pages... done
copying images... [ 10%] images/title_page_plain.png
copying images... [ 20%] images/helpBrowser.png
copying images... [ 30%] images/mainWindow.png
copying images... [ 40%] images/treeSymbols.png
copying images... [ 50%] images/browseDataset.png
copying images... [ 60%] images/zoomingCells.png
copying images... [ 70%] images/propertiesDlg.png
copying images... [ 80%] images/newFilteredTable.png
copying images... [ 90%] images/groupCreation.png
copying images... [100%] images/editingUserAttrs.png

writing project file...
writing collection project file...
build succeeded.

You can now run "qcollectiongenerator" with the .qhcp project file in _build/qthelp, like this:
$ qcollectiongenerator _build/qthelp/ViTablesUsersGuide.qhcp
To view the help file:
$ assistant -collectionFile _build/qthelp/ViTablesUsersGuide.qhc

Build finished; now you can run qcollectiongenerator with the .qhcp project file in _build/qthelp, like this:
# qcollectiongenerator _build/qthelp/ViTablesUsersGuide.qhcp
To view the help file:
# assistant -collectionFile _build/qthelp/ViTablesUsersGuide.qhc
make[2]: Leaving directory '/build/reproducible-path/vitables-3.0.3/doc'
cd doc/_build && rm -r html && mv qthelp html && rm html/_static/*.js
make[1]: Leaving directory '/build/reproducible-path/vitables-3.0.3'
   dh_auto_test -O--buildsystem=pybuild
	pybuild --test --test-pytest -i python{version} -p 3.13
I: pybuild base:311: cd /build/reproducible-path/vitables-3.0.3/.pybuild/cpython3_3.13/build; python3.13 -m pytest tests
============================= test session starts ==============================
platform linux -- Python 3.13.1, pytest-8.3.4, pluggy-1.5.0
rootdir: /build/reproducible-path/vitables-3.0.3
configfile: pyproject.toml
plugins: xvfb-3.0.0, typeguard-4.4.1
collected 56 items

tests/test_calculator.py .                                               [  1%]
tests/test_filenode.py ......                                            [ 12%]
tests/test_logger.py .....                                               [ 21%]
tests/test_samples.py Fatal Python error: Aborted

Current thread 0x0000ffffa9c38740 (most recent call first):
  File "/build/reproducible-path/vitables-3.0.3/.pybuild/cpython3_3.13/build/tests/test_samples.py", line 173 in setup_class
  File "/usr/lib/python3/dist-packages/_pytest/python.py", line 715 in _call_with_optional_argument
  File "/usr/lib/python3/dist-packages/_pytest/python.py", line 787 in xunit_setup_class_fixture
  File "/usr/lib/python3/dist-packages/_pytest/fixtures.py", line 891 in call_fixture_func
  File "/usr/lib/python3/dist-packages/_pytest/fixtures.py", line 1140 in pytest_fixture_setup
  File "/usr/lib/python3/dist-packages/pluggy/_callers.py", line 103 in _multicall
  File "/usr/lib/python3/dist-packages/pluggy/_manager.py", line 120 in _hookexec
  File "/usr/lib/python3/dist-packages/pluggy/_hooks.py", line 513 in __call__
  File "/usr/lib/python3/dist-packages/_pytest/fixtures.py", line 1091 in execute
  File "/usr/lib/python3/dist-packages/_pytest/fixtures.py", line 617 in _get_active_fixturedef
  File "/usr/lib/python3/dist-packages/_pytest/fixtures.py", line 532 in getfixturevalue
  File "/usr/lib/python3/dist-packages/_pytest/fixtures.py", line 697 in _fillfixtures
  File "/usr/lib/python3/dist-packages/_pytest/python.py", line 1630 in setup
  File "/usr/lib/python3/dist-packages/_pytest/runner.py", line 514 in setup
  File "/usr/lib/python3/dist-packages/_pytest/runner.py", line 160 in pytest_runtest_setup
  File "/usr/lib/python3/dist-packages/pluggy/_callers.py", line 103 in _multicall
  File "/usr/lib/python3/dist-packages/pluggy/_manager.py", line 120 in _hookexec
  File "/usr/lib/python3/dist-packages/pluggy/_hooks.py", line 513 in __call__
  File "/usr/lib/python3/dist-packages/_pytest/runner.py", line 242 in <lambda>
  File "/usr/lib/python3/dist-packages/_pytest/runner.py", line 341 in from_call
  File "/usr/lib/python3/dist-packages/_pytest/runner.py", line 241 in call_and_report
  File "/usr/lib/python3/dist-packages/_pytest/runner.py", line 126 in runtestprotocol
  File "/usr/lib/python3/dist-packages/_pytest/runner.py", line 113 in pytest_runtest_protocol
  File "/usr/lib/python3/dist-packages/pluggy/_callers.py", line 103 in _multicall
  File "/usr/lib/python3/dist-packages/pluggy/_manager.py", line 120 in _hookexec
  File "/usr/lib/python3/dist-packages/pluggy/_hooks.py", line 513 in __call__
  File "/usr/lib/python3/dist-packages/_pytest/main.py", line 362 in pytest_runtestloop
  File "/usr/lib/python3/dist-packages/pluggy/_callers.py", line 103 in _multicall
  File "/usr/lib/python3/dist-packages/pluggy/_manager.py", line 120 in _hookexec
  File "/usr/lib/python3/dist-packages/pluggy/_hooks.py", line 513 in __call__
  File "/usr/lib/python3/dist-packages/_pytest/main.py", line 337 in _main
  File "/usr/lib/python3/dist-packages/_pytest/main.py", line 283 in wrap_session
  File "/usr/lib/python3/dist-packages/_pytest/main.py", line 330 in pytest_cmdline_main
  File "/usr/lib/python3/dist-packages/pluggy/_callers.py", line 103 in _multicall
  File "/usr/lib/python3/dist-packages/pluggy/_manager.py", line 120 in _hookexec
  File "/usr/lib/python3/dist-packages/pluggy/_hooks.py", line 513 in __call__
  File "/usr/lib/python3/dist-packages/_pytest/config/__init__.py", line 175 in main
  File "/usr/lib/python3/dist-packages/_pytest/config/__init__.py", line 201 in console_main
  File "/usr/lib/python3/dist-packages/pytest/__main__.py", line 9 in <module>
  File "<frozen runpy>", line 88 in _run_code
  File "<frozen runpy>", line 198 in _run_module_as_main

Extension modules: numpy.core._multiarray_umath, numpy.core._multiarray_tests, numpy.linalg._umath_linalg, numpy.fft._pocketfft_internal, numpy.random._common, numpy.random.bit_generator, numpy.random._bounded_integers, numpy.random._mt19937, numpy.random.mtrand, numpy.random._philox, numpy.random._pcg64, numpy.random._sfc64, numpy.random._generator, tables._comp_lzo, tables._comp_bzip2, tables.utilsextension, numexpr.interpreter, tables.hdf5extension, tables.linkextension, tables.lrucacheextension, tables.tableextension, tables.indexesextension, PyQt6.QtCore, PyQt6.QtGui, PyQt6.QtWidgets, PyQt6.QtOpenGL, PyQt6.QtOpenGLWidgets (total: 27)
Aborted
E: pybuild pybuild:389: test: plugin pyproject failed with: exit code=134: cd /build/reproducible-path/vitables-3.0.3/.pybuild/cpython3_3.13/build; python3.13 -m pytest tests
	rm -fr -- /tmp/dh-xdg-rundir-5LuPbpVa
dh_auto_test: error: pybuild --test --test-pytest -i python{version} -p 3.13 returned exit code 13
make: *** [debian/rules:10: binary] Error 25
dpkg-buildpackage: error: debian/rules binary subprocess returned exit status 2
I: copying local configuration
E: Failed autobuilding of package
I: unmounting dev/ptmx filesystem
I: unmounting dev/pts filesystem
I: unmounting dev/shm filesystem
I: unmounting proc filesystem
I: unmounting sys filesystem
W: Stray processes left from build:
* system-pbuilder-build-vitables_3.0.3\x2d1-3686440.slice - Slice /system/pbuilder/build/vitables_3.0.3-1/3686440
     Loaded: loaded
     Active: active since Tue 2026-02-10 03:55:10 -12; 1min 24s ago
      Tasks: 1
     Memory: 1.0G
        CPU: 1min 14.714s
     CGroup: /system.slice/system-pbuilder.slice/system-pbuilder-build.slice/system-pbuilder-build-vitables_3.0.3\x2d1.slice/system-pbuilder-build-vitables_3.0.3\x2d1-3686440.slice
             `-run-rffc1dfd5aa1f4d30b620df3aae7ba4e3.scope
               `-3707694 Xvfb -br -nolisten tcp -screen 0 800x600x16 -displayfd 10

Feb 10 03:55:10 codethink03-arm64 systemd[1]: Created slice system-pbuilder-build-vitables_3.0.3\x2d1-3686440.slice - Slice /system/pbuilder/build/vitables_3.0.3-1/3686440.
I: cleaning the build env 
I: removing directory /srv/workspace/pbuilder/3686440 and its subdirectories
Wed Jan  8 09:33:39 UTC 2025  W: No second build log, what happened?