Sun Mar 16 19:17:27 UTC 2025  I: starting to build keyd/trixie/armhf on jenkins on '2025-03-16 19:17'
Sun Mar 16 19:17:27 UTC 2025  I: The jenkins build log is/was available at https://jenkins.debian.net/userContent/reproducible/debian/build_service/armhf_3/14287/console.log
Sun Mar 16 19:17:27 UTC 2025  I: Downloading source for trixie/keyd=2.5.0-1.1
--2025-03-16 19:17:28--  http://deb.debian.org/debian/pool/main/k/keyd/keyd_2.5.0-1.1.dsc
Connecting to 46.16.76.132:3128... connected.
Proxy request sent, awaiting response... 200 OK
Length: 1896 (1.9K) [text/prs.lines.tag]
Saving to: ‘keyd_2.5.0-1.1.dsc’

     0K .                                                     100%  233M=0s

2025-03-16 19:17:28 (233 MB/s) - ‘keyd_2.5.0-1.1.dsc’ saved [1896/1896]

Sun Mar 16 19:17:28 UTC 2025  I: keyd_2.5.0-1.1.dsc
-----BEGIN PGP SIGNED MESSAGE-----
Hash: SHA512

Format: 3.0 (quilt)
Source: keyd
Binary: keyd, keyd-application-mapper
Architecture: any all
Version: 2.5.0-1.1
Maintainer: Richard Hansen <rhansen@rhansen.org>
Homepage: https://github.com/rvaiya/keyd
Standards-Version: 4.7.0
Vcs-Browser: https://salsa.debian.org/rhansen/keyd
Vcs-Git: https://salsa.debian.org/rhansen/keyd.git
Build-Depends: debhelper-compat (= 13), dh-python, python3, scdoc
Package-List:
 keyd deb utils optional arch=any
 keyd-application-mapper deb utils optional arch=all
Checksums-Sha1:
 fc58b73bcaee3567405128a2b8777d55e4bad8e1 671616 keyd_2.5.0.orig.tar.gz
 a122612577ca0ac884e6246e84d7665a8ce1ed2a 5592 keyd_2.5.0-1.1.debian.tar.xz
Checksums-Sha256:
 93ec6c153ef673a7a8b4d8b686494dee11d182513f4531c71dce15a8db7f6c1c 671616 keyd_2.5.0.orig.tar.gz
 73c8df28392412423fd06acbdd60751072148aeb44a19d136ec33d925a58b461 5592 keyd_2.5.0-1.1.debian.tar.xz
Files:
 741afd23e6cd3877cc051badc11b4438 671616 keyd_2.5.0.orig.tar.gz
 1afc774e839ead568b988a1e439e38fe 5592 keyd_2.5.0-1.1.debian.tar.xz

-----BEGIN PGP SIGNATURE-----

iQIzBAEBCgAdFiEEfncpR22H1vEdkazLwpPntGGCWs4FAmerkgsACgkQwpPntGGC
Ws5b4w//RxduXsdr8a0BzYSgLMPstTSJY9d7ZdVO98hrZ3QxvqGWtu3wvYMVzSjw
AqxqGZuJvES9GqayfSltIh7C7Xa1Y4DdWOsgMneESA/51UrNfgk3y+8+oMgavUd0
l/fjUAgcQaDvACgtNEu4jCmwuQMUJhOBlgvkQYE4EjIGSusVgNY6JqEfkI2ech7z
SM99zJ7KT7k1JGCE63dMCdDbcrlCXXJFA2mHbyHzQi4F+8PodAcKoLR1832mpd5i
xpT8JJPfQRx05xsbS8RtM6XWlXDUInPD5TpPlTLJCQydqrBzaJLD1ytiKgMkCjCV
KznUPKv1fARF7Vh4FsAji9EDHY4vE3vPig6xLUOpz+SYD6ydJRh38aTcjIMbhZsu
0DFD1M4LJ8VEkxOBfQPX5gDtlSB9xvdijuvkzCAjXZjm8kMsPhaKnaeSNUlz7WdT
KiwisYsRdqFcHoVjdCXT/LA4fAOEU99RID7MicyHIW7e/OPW67x+sFrUxlRVv82B
dYtq7A1wkv7CIBwyvTwgDd4PzU07aKjXCbYHtUAWdGXCJQmBCzUWV6HozQbzDiw7
o1qKvb4nraHtBAFTL3Qf45XPQ7UsvlN2JK0TsP0gNeKEG542e3IIvZJ0Lk3HNN6h
1cySSIQLyJYKp8DT/VjKY6cLPb14D12p0cOO7AxAo6pzc4J4d30=
=irh9
-----END PGP SIGNATURE-----
Sun Mar 16 19:17:28 UTC 2025  I: Checking whether the package is not for us
Sun Mar 16 19:17:28 UTC 2025  I: Starting 1st build on remote node ff4a-armhf-rb.debian.net.
Sun Mar 16 19:17:28 UTC 2025  I: Preparing to do remote build '1' on ff4a-armhf-rb.debian.net.
Sun Mar 16 19:19:29 UTC 2025  I: Deleting $TMPDIR on ff4a-armhf-rb.debian.net.
I: pbuilder: network access will be disabled during build
I: Current time: Sun Mar 16 07:17:37 -12 2025
I: pbuilder-time-stamp: 1742152657
I: Building the build Environment
I: extracting base tarball [/var/cache/pbuilder/trixie-reproducible-base.tgz]
I: copying local configuration
W: --override-config is not set; not updating apt.conf Read the manpage for details.
I: mounting /proc filesystem
I: mounting /sys filesystem
I: creating /{dev,run}/shm
I: mounting /dev/pts filesystem
I: redirecting /dev/ptmx to /dev/pts/ptmx
I: policy-rc.d already exists
I: Copying source file
I: copying [keyd_2.5.0-1.1.dsc]
I: copying [./keyd_2.5.0.orig.tar.gz]
I: copying [./keyd_2.5.0-1.1.debian.tar.xz]
I: Extracting source
dpkg-source: warning: cannot verify inline signature for ./keyd_2.5.0-1.1.dsc: unsupported subcommand
dpkg-source: info: extracting keyd in keyd-2.5.0
dpkg-source: info: unpacking keyd_2.5.0.orig.tar.gz
dpkg-source: info: unpacking keyd_2.5.0-1.1.debian.tar.xz
dpkg-source: info: using patch list from debian/patches/series
dpkg-source: info: applying 0001-Use-mkdir-p-instead-of-ignoring-return-code.patch
dpkg-source: info: applying 0002-Revamp-systemd-service-unit-file-installation.patch
dpkg-source: info: applying 0003-Teach-make-all-to-make-the-man-pages.patch
dpkg-source: info: applying 0004-Let-dh_compress-compress-the-man-pages.patch
dpkg-source: info: applying 0005-Let-debian-keyd.postinst-create-the-keyd-group.patch
dpkg-source: info: applying 0006-Pass-CPPFLAGS-CFLAGS-LDFLAGS-to-the-compiler.patch
dpkg-source: info: applying 0007-Reference-man-page-from-systemd-unit-files.patch
I: Not using root during the build.
I: Installing the build-deps
I: user script /srv/workspace/pbuilder/5578/tmp/hooks/D02_print_environment starting
I: set
  BUILDDIR='/build/reproducible-path'
  BUILDUSERGECOS='first user,first room,first work-phone,first home-phone,first other'
  BUILDUSERNAME='pbuilder1'
  BUILD_ARCH='armhf'
  DEBIAN_FRONTEND='noninteractive'
  DEB_BUILD_OPTIONS='buildinfo=+all reproducible=+all parallel=3 '
  DISTRIBUTION='trixie'
  HOME='/root'
  HOST_ARCH='armhf'
  IFS=' 	
  '
  INVOCATION_ID='d5805dacc1484467a647966dce2d4a7f'
  LANG='C'
  LANGUAGE='en_US:en'
  LC_ALL='C'
  MAIL='/var/mail/root'
  OPTIND='1'
  PATH='/usr/sbin:/usr/bin:/sbin:/bin:/usr/games'
  PBCURRENTCOMMANDLINEOPERATION='build'
  PBUILDER_OPERATION='build'
  PBUILDER_PKGDATADIR='/usr/share/pbuilder'
  PBUILDER_PKGLIBDIR='/usr/lib/pbuilder'
  PBUILDER_SYSCONFDIR='/etc'
  PPID='5578'
  PS1='# '
  PS2='> '
  PS4='+ '
  PWD='/'
  SHELL='/bin/bash'
  SHLVL='2'
  SUDO_COMMAND='/usr/bin/timeout -k 18.1h 18h /usr/bin/ionice -c 3 /usr/bin/nice /usr/sbin/pbuilder --build --configfile /srv/reproducible-results/rbuild-debian/r-b-build.JQDJoz1E/pbuilderrc_GS6Z --distribution trixie --hookdir /etc/pbuilder/first-build-hooks --debbuildopts -b --basetgz /var/cache/pbuilder/trixie-reproducible-base.tgz --buildresult /srv/reproducible-results/rbuild-debian/r-b-build.JQDJoz1E/b1 --logfile b1/build.log keyd_2.5.0-1.1.dsc'
  SUDO_GID='113'
  SUDO_UID='107'
  SUDO_USER='jenkins'
  TERM='unknown'
  TZ='/usr/share/zoneinfo/Etc/GMT+12'
  USER='root'
  _='/usr/bin/systemd-run'
  http_proxy='http://10.0.0.15:3142/'
I: uname -a
  Linux ff4a 6.1.0-32-armmp-lpae #1 SMP Debian 6.1.129-1 (2025-03-06) armv7l GNU/Linux
I: ls -l /bin
  lrwxrwxrwx 1 root root 7 Mar  4 11:20 /bin -> usr/bin
I: user script /srv/workspace/pbuilder/5578/tmp/hooks/D02_print_environment finished
 -> Attempting to satisfy build-dependencies
 -> Creating pbuilder-satisfydepends-dummy package
Package: pbuilder-satisfydepends-dummy
Version: 0.invalid.0
Architecture: armhf
Maintainer: Debian Pbuilder Team <pbuilder-maint@lists.alioth.debian.org>
Description: Dummy package to satisfy dependencies with aptitude - created by pbuilder
 This package was created automatically by pbuilder to satisfy the
 build-dependencies of the package being currently built.
Depends: debhelper-compat (= 13), dh-python, python3, scdoc
dpkg-deb: building package 'pbuilder-satisfydepends-dummy' in '/tmp/satisfydepends-aptitude/pbuilder-satisfydepends-dummy.deb'.
Selecting previously unselected package pbuilder-satisfydepends-dummy.
(Reading database ... 19528 files and directories currently installed.)
Preparing to unpack .../pbuilder-satisfydepends-dummy.deb ...
Unpacking pbuilder-satisfydepends-dummy (0.invalid.0) ...
dpkg: pbuilder-satisfydepends-dummy: dependency problems, but configuring anyway as you requested:
 pbuilder-satisfydepends-dummy depends on debhelper-compat (= 13); however:
  Package debhelper-compat is not installed.
 pbuilder-satisfydepends-dummy depends on dh-python; however:
  Package dh-python is not installed.
 pbuilder-satisfydepends-dummy depends on python3; however:
  Package python3 is not installed.
 pbuilder-satisfydepends-dummy depends on scdoc; however:
  Package scdoc is not installed.

Setting up pbuilder-satisfydepends-dummy (0.invalid.0) ...
Reading package lists...
Building dependency tree...
Reading state information...
Initializing package states...
Writing extended state information...
Building tag database...
pbuilder-satisfydepends-dummy is already installed at the requested version (0.invalid.0)
pbuilder-satisfydepends-dummy is already installed at the requested version (0.invalid.0)
The following NEW packages will be installed:
  autoconf{a} automake{a} autopoint{a} autotools-dev{a} bsdextrautils{a} debhelper{a} dh-autoreconf{a} dh-python{a} dh-strip-nondeterminism{a} dwz{a} file{a} gettext{a} gettext-base{a} groff-base{a} intltool-debian{a} libarchive-zip-perl{a} libdebhelper-perl{a} libelf1t64{a} libexpat1{a} libffi8{a} libfile-stripnondeterminism-perl{a} libicu72{a} libmagic-mgc{a} libmagic1t64{a} libpipeline1{a} libpython3-stdlib{a} libpython3.13-minimal{a} libpython3.13-stdlib{a} libreadline8t64{a} libtool{a} libuchardet0{a} libunistring5{a} libxml2{a} m4{a} man-db{a} media-types{a} netbase{a} po-debconf{a} python3{a} python3-minimal{a} python3.13{a} python3.13-minimal{a} readline-common{a} scdoc{a} sensible-utils{a} tzdata{a} 
The following packages are RECOMMENDED but will NOT be installed:
  ca-certificates curl libarchive-cpio-perl libltdl-dev libmail-sendmail-perl lynx wget 
0 packages upgraded, 46 newly installed, 0 to remove and 0 not upgraded.
Need to get 25.9 MB of archives. After unpacking 98.9 MB will be used.
Writing extended state information...
Get: 1 http://deb.debian.org/debian trixie/main armhf libpython3.13-minimal armhf 3.13.2-1 [845 kB]
Get: 2 http://deb.debian.org/debian trixie/main armhf libexpat1 armhf 2.6.4-1 [83.5 kB]
Get: 3 http://deb.debian.org/debian trixie/main armhf python3.13-minimal armhf 3.13.2-1 [1842 kB]
Get: 4 http://deb.debian.org/debian trixie/main armhf python3-minimal armhf 3.13.2-2 [27.1 kB]
Get: 5 http://deb.debian.org/debian trixie/main armhf media-types all 13.0.0 [29.3 kB]
Get: 6 http://deb.debian.org/debian trixie/main armhf netbase all 6.4 [12.8 kB]
Get: 7 http://deb.debian.org/debian trixie/main armhf tzdata all 2025a-2 [259 kB]
Get: 8 http://deb.debian.org/debian trixie/main armhf libffi8 armhf 3.4.7-1 [20.3 kB]
Get: 9 http://deb.debian.org/debian trixie/main armhf readline-common all 8.2-6 [69.4 kB]
Get: 10 http://deb.debian.org/debian trixie/main armhf libreadline8t64 armhf 8.2-6 [146 kB]
Get: 11 http://deb.debian.org/debian trixie/main armhf libpython3.13-stdlib armhf 3.13.2-1 [1853 kB]
Get: 12 http://deb.debian.org/debian trixie/main armhf python3.13 armhf 3.13.2-1 [745 kB]
Get: 13 http://deb.debian.org/debian trixie/main armhf libpython3-stdlib armhf 3.13.2-2 [10.1 kB]
Get: 14 http://deb.debian.org/debian trixie/main armhf python3 armhf 3.13.2-2 [28.1 kB]
Get: 15 http://deb.debian.org/debian trixie/main armhf sensible-utils all 0.0.24 [24.8 kB]
Get: 16 http://deb.debian.org/debian trixie/main armhf libmagic-mgc armhf 1:5.45-3+b1 [314 kB]
Get: 17 http://deb.debian.org/debian trixie/main armhf libmagic1t64 armhf 1:5.45-3+b1 [98.5 kB]
Get: 18 http://deb.debian.org/debian trixie/main armhf file armhf 1:5.45-3+b1 [42.3 kB]
Get: 19 http://deb.debian.org/debian trixie/main armhf gettext-base armhf 0.23.1-1 [238 kB]
Get: 20 http://deb.debian.org/debian trixie/main armhf libuchardet0 armhf 0.0.8-1+b2 [65.6 kB]
Get: 21 http://deb.debian.org/debian trixie/main armhf groff-base armhf 1.23.0-7 [1095 kB]
Get: 22 http://deb.debian.org/debian trixie/main armhf bsdextrautils armhf 2.40.4-5 [84.9 kB]
Get: 23 http://deb.debian.org/debian trixie/main armhf libpipeline1 armhf 1.5.8-1 [35.0 kB]
Get: 24 http://deb.debian.org/debian trixie/main armhf man-db armhf 2.13.0-1 [1382 kB]
Get: 25 http://deb.debian.org/debian trixie/main armhf m4 armhf 1.4.19-7 [272 kB]
Get: 26 http://deb.debian.org/debian trixie/main armhf autoconf all 2.72-3 [493 kB]
Get: 27 http://deb.debian.org/debian trixie/main armhf autotools-dev all 20220109.1 [51.6 kB]
Get: 28 http://deb.debian.org/debian trixie/main armhf automake all 1:1.17-3 [862 kB]
Get: 29 http://deb.debian.org/debian trixie/main armhf autopoint all 0.23.1-1 [770 kB]
Get: 30 http://deb.debian.org/debian trixie/main armhf libdebhelper-perl all 13.24.1 [90.9 kB]
Get: 31 http://deb.debian.org/debian trixie/main armhf libtool all 2.5.4-4 [539 kB]
Get: 32 http://deb.debian.org/debian trixie/main armhf dh-autoreconf all 20 [17.1 kB]
Get: 33 http://deb.debian.org/debian trixie/main armhf libarchive-zip-perl all 1.68-1 [104 kB]
Get: 34 http://deb.debian.org/debian trixie/main armhf libfile-stripnondeterminism-perl all 1.14.1-2 [19.7 kB]
Get: 35 http://deb.debian.org/debian trixie/main armhf dh-strip-nondeterminism all 1.14.1-2 [8620 B]
Get: 36 http://deb.debian.org/debian trixie/main armhf libelf1t64 armhf 0.192-4 [184 kB]
Get: 37 http://deb.debian.org/debian trixie/main armhf dwz armhf 0.15-1+b2 [106 kB]
Get: 38 http://deb.debian.org/debian trixie/main armhf libunistring5 armhf 1.3-1 [444 kB]
Get: 39 http://deb.debian.org/debian trixie/main armhf libicu72 armhf 72.1-6 [9086 kB]
Get: 40 http://deb.debian.org/debian trixie/main armhf libxml2 armhf 2.12.7+dfsg+really2.9.14-0.2+b2 [605 kB]
Get: 41 http://deb.debian.org/debian trixie/main armhf gettext armhf 0.23.1-1 [1560 kB]
Get: 42 http://deb.debian.org/debian trixie/main armhf intltool-debian all 0.35.0+20060710.6 [22.9 kB]
Get: 43 http://deb.debian.org/debian trixie/main armhf po-debconf all 1.0.21+nmu1 [248 kB]
Get: 44 http://deb.debian.org/debian trixie/main armhf debhelper all 13.24.1 [920 kB]
Get: 45 http://deb.debian.org/debian trixie/main armhf dh-python all 6.20250308 [115 kB]
Get: 46 http://deb.debian.org/debian trixie/main armhf scdoc armhf 1.11.3-1 [13.2 kB]
Fetched 25.9 MB in 2s (12.9 MB/s)
Preconfiguring packages ...
Selecting previously unselected package libpython3.13-minimal:armhf.
(Reading database ... 
(Reading database ... 5%
(Reading database ... 10%
(Reading database ... 15%
(Reading database ... 20%
(Reading database ... 25%
(Reading database ... 30%
(Reading database ... 35%
(Reading database ... 40%
(Reading database ... 45%
(Reading database ... 50%
(Reading database ... 55%
(Reading database ... 60%
(Reading database ... 65%
(Reading database ... 70%
(Reading database ... 75%
(Reading database ... 80%
(Reading database ... 85%
(Reading database ... 90%
(Reading database ... 95%
(Reading database ... 100%
(Reading database ... 19528 files and directories currently installed.)
Preparing to unpack .../libpython3.13-minimal_3.13.2-1_armhf.deb ...
Unpacking libpython3.13-minimal:armhf (3.13.2-1) ...
Selecting previously unselected package libexpat1:armhf.
Preparing to unpack .../libexpat1_2.6.4-1_armhf.deb ...
Unpacking libexpat1:armhf (2.6.4-1) ...
Selecting previously unselected package python3.13-minimal.
Preparing to unpack .../python3.13-minimal_3.13.2-1_armhf.deb ...
Unpacking python3.13-minimal (3.13.2-1) ...
Setting up libpython3.13-minimal:armhf (3.13.2-1) ...
Setting up libexpat1:armhf (2.6.4-1) ...
Setting up python3.13-minimal (3.13.2-1) ...
Selecting previously unselected package python3-minimal.
(Reading database ... 
(Reading database ... 5%
(Reading database ... 10%
(Reading database ... 15%
(Reading database ... 20%
(Reading database ... 25%
(Reading database ... 30%
(Reading database ... 35%
(Reading database ... 40%
(Reading database ... 45%
(Reading database ... 50%
(Reading database ... 55%
(Reading database ... 60%
(Reading database ... 65%
(Reading database ... 70%
(Reading database ... 75%
(Reading database ... 80%
(Reading database ... 85%
(Reading database ... 90%
(Reading database ... 95%
(Reading database ... 100%
(Reading database ... 19862 files and directories currently installed.)
Preparing to unpack .../0-python3-minimal_3.13.2-2_armhf.deb ...
Unpacking python3-minimal (3.13.2-2) ...
Selecting previously unselected package media-types.
Preparing to unpack .../1-media-types_13.0.0_all.deb ...
Unpacking media-types (13.0.0) ...
Selecting previously unselected package netbase.
Preparing to unpack .../2-netbase_6.4_all.deb ...
Unpacking netbase (6.4) ...
Selecting previously unselected package tzdata.
Preparing to unpack .../3-tzdata_2025a-2_all.deb ...
Unpacking tzdata (2025a-2) ...
Selecting previously unselected package libffi8:armhf.
Preparing to unpack .../4-libffi8_3.4.7-1_armhf.deb ...
Unpacking libffi8:armhf (3.4.7-1) ...
Selecting previously unselected package readline-common.
Preparing to unpack .../5-readline-common_8.2-6_all.deb ...
Unpacking readline-common (8.2-6) ...
Selecting previously unselected package libreadline8t64:armhf.
Preparing to unpack .../6-libreadline8t64_8.2-6_armhf.deb ...
Adding 'diversion of /lib/arm-linux-gnueabihf/libhistory.so.8 to /lib/arm-linux-gnueabihf/libhistory.so.8.usr-is-merged by libreadline8t64'
Adding 'diversion of /lib/arm-linux-gnueabihf/libhistory.so.8.2 to /lib/arm-linux-gnueabihf/libhistory.so.8.2.usr-is-merged by libreadline8t64'
Adding 'diversion of /lib/arm-linux-gnueabihf/libreadline.so.8 to /lib/arm-linux-gnueabihf/libreadline.so.8.usr-is-merged by libreadline8t64'
Adding 'diversion of /lib/arm-linux-gnueabihf/libreadline.so.8.2 to /lib/arm-linux-gnueabihf/libreadline.so.8.2.usr-is-merged by libreadline8t64'
Unpacking libreadline8t64:armhf (8.2-6) ...
Selecting previously unselected package libpython3.13-stdlib:armhf.
Preparing to unpack .../7-libpython3.13-stdlib_3.13.2-1_armhf.deb ...
Unpacking libpython3.13-stdlib:armhf (3.13.2-1) ...
Selecting previously unselected package python3.13.
Preparing to unpack .../8-python3.13_3.13.2-1_armhf.deb ...
Unpacking python3.13 (3.13.2-1) ...
Selecting previously unselected package libpython3-stdlib:armhf.
Preparing to unpack .../9-libpython3-stdlib_3.13.2-2_armhf.deb ...
Unpacking libpython3-stdlib:armhf (3.13.2-2) ...
Setting up python3-minimal (3.13.2-2) ...
Selecting previously unselected package python3.
(Reading database ... 
(Reading database ... 5%
(Reading database ... 10%
(Reading database ... 15%
(Reading database ... 20%
(Reading database ... 25%
(Reading database ... 30%
(Reading database ... 35%
(Reading database ... 40%
(Reading database ... 45%
(Reading database ... 50%
(Reading database ... 55%
(Reading database ... 60%
(Reading database ... 65%
(Reading database ... 70%
(Reading database ... 75%
(Reading database ... 80%
(Reading database ... 85%
(Reading database ... 90%
(Reading database ... 95%
(Reading database ... 100%
(Reading database ... 20872 files and directories currently installed.)
Preparing to unpack .../00-python3_3.13.2-2_armhf.deb ...
Unpacking python3 (3.13.2-2) ...
Selecting previously unselected package sensible-utils.
Preparing to unpack .../01-sensible-utils_0.0.24_all.deb ...
Unpacking sensible-utils (0.0.24) ...
Selecting previously unselected package libmagic-mgc.
Preparing to unpack .../02-libmagic-mgc_1%3a5.45-3+b1_armhf.deb ...
Unpacking libmagic-mgc (1:5.45-3+b1) ...
Selecting previously unselected package libmagic1t64:armhf.
Preparing to unpack .../03-libmagic1t64_1%3a5.45-3+b1_armhf.deb ...
Unpacking libmagic1t64:armhf (1:5.45-3+b1) ...
Selecting previously unselected package file.
Preparing to unpack .../04-file_1%3a5.45-3+b1_armhf.deb ...
Unpacking file (1:5.45-3+b1) ...
Selecting previously unselected package gettext-base.
Preparing to unpack .../05-gettext-base_0.23.1-1_armhf.deb ...
Unpacking gettext-base (0.23.1-1) ...
Selecting previously unselected package libuchardet0:armhf.
Preparing to unpack .../06-libuchardet0_0.0.8-1+b2_armhf.deb ...
Unpacking libuchardet0:armhf (0.0.8-1+b2) ...
Selecting previously unselected package groff-base.
Preparing to unpack .../07-groff-base_1.23.0-7_armhf.deb ...
Unpacking groff-base (1.23.0-7) ...
Selecting previously unselected package bsdextrautils.
Preparing to unpack .../08-bsdextrautils_2.40.4-5_armhf.deb ...
Unpacking bsdextrautils (2.40.4-5) ...
Selecting previously unselected package libpipeline1:armhf.
Preparing to unpack .../09-libpipeline1_1.5.8-1_armhf.deb ...
Unpacking libpipeline1:armhf (1.5.8-1) ...
Selecting previously unselected package man-db.
Preparing to unpack .../10-man-db_2.13.0-1_armhf.deb ...
Unpacking man-db (2.13.0-1) ...
Selecting previously unselected package m4.
Preparing to unpack .../11-m4_1.4.19-7_armhf.deb ...
Unpacking m4 (1.4.19-7) ...
Selecting previously unselected package autoconf.
Preparing to unpack .../12-autoconf_2.72-3_all.deb ...
Unpacking autoconf (2.72-3) ...
Selecting previously unselected package autotools-dev.
Preparing to unpack .../13-autotools-dev_20220109.1_all.deb ...
Unpacking autotools-dev (20220109.1) ...
Selecting previously unselected package automake.
Preparing to unpack .../14-automake_1%3a1.17-3_all.deb ...
Unpacking automake (1:1.17-3) ...
Selecting previously unselected package autopoint.
Preparing to unpack .../15-autopoint_0.23.1-1_all.deb ...
Unpacking autopoint (0.23.1-1) ...
Selecting previously unselected package libdebhelper-perl.
Preparing to unpack .../16-libdebhelper-perl_13.24.1_all.deb ...
Unpacking libdebhelper-perl (13.24.1) ...
Selecting previously unselected package libtool.
Preparing to unpack .../17-libtool_2.5.4-4_all.deb ...
Unpacking libtool (2.5.4-4) ...
Selecting previously unselected package dh-autoreconf.
Preparing to unpack .../18-dh-autoreconf_20_all.deb ...
Unpacking dh-autoreconf (20) ...
Selecting previously unselected package libarchive-zip-perl.
Preparing to unpack .../19-libarchive-zip-perl_1.68-1_all.deb ...
Unpacking libarchive-zip-perl (1.68-1) ...
Selecting previously unselected package libfile-stripnondeterminism-perl.
Preparing to unpack .../20-libfile-stripnondeterminism-perl_1.14.1-2_all.deb ...
Unpacking libfile-stripnondeterminism-perl (1.14.1-2) ...
Selecting previously unselected package dh-strip-nondeterminism.
Preparing to unpack .../21-dh-strip-nondeterminism_1.14.1-2_all.deb ...
Unpacking dh-strip-nondeterminism (1.14.1-2) ...
Selecting previously unselected package libelf1t64:armhf.
Preparing to unpack .../22-libelf1t64_0.192-4_armhf.deb ...
Unpacking libelf1t64:armhf (0.192-4) ...
Selecting previously unselected package dwz.
Preparing to unpack .../23-dwz_0.15-1+b2_armhf.deb ...
Unpacking dwz (0.15-1+b2) ...
Selecting previously unselected package libunistring5:armhf.
Preparing to unpack .../24-libunistring5_1.3-1_armhf.deb ...
Unpacking libunistring5:armhf (1.3-1) ...
Selecting previously unselected package libicu72:armhf.
Preparing to unpack .../25-libicu72_72.1-6_armhf.deb ...
Unpacking libicu72:armhf (72.1-6) ...
Selecting previously unselected package libxml2:armhf.
Preparing to unpack .../26-libxml2_2.12.7+dfsg+really2.9.14-0.2+b2_armhf.deb ...
Unpacking libxml2:armhf (2.12.7+dfsg+really2.9.14-0.2+b2) ...
Selecting previously unselected package gettext.
Preparing to unpack .../27-gettext_0.23.1-1_armhf.deb ...
Unpacking gettext (0.23.1-1) ...
Selecting previously unselected package intltool-debian.
Preparing to unpack .../28-intltool-debian_0.35.0+20060710.6_all.deb ...
Unpacking intltool-debian (0.35.0+20060710.6) ...
Selecting previously unselected package po-debconf.
Preparing to unpack .../29-po-debconf_1.0.21+nmu1_all.deb ...
Unpacking po-debconf (1.0.21+nmu1) ...
Selecting previously unselected package debhelper.
Preparing to unpack .../30-debhelper_13.24.1_all.deb ...
Unpacking debhelper (13.24.1) ...
Selecting previously unselected package dh-python.
Preparing to unpack .../31-dh-python_6.20250308_all.deb ...
Unpacking dh-python (6.20250308) ...
Selecting previously unselected package scdoc.
Preparing to unpack .../32-scdoc_1.11.3-1_armhf.deb ...
Unpacking scdoc (1.11.3-1) ...
Setting up media-types (13.0.0) ...
Setting up libpipeline1:armhf (1.5.8-1) ...
Setting up libicu72:armhf (72.1-6) ...
Setting up bsdextrautils (2.40.4-5) ...
Setting up libmagic-mgc (1:5.45-3+b1) ...
Setting up libarchive-zip-perl (1.68-1) ...
Setting up libdebhelper-perl (13.24.1) ...
Setting up libmagic1t64:armhf (1:5.45-3+b1) ...
Setting up gettext-base (0.23.1-1) ...
Setting up m4 (1.4.19-7) ...
Setting up file (1:5.45-3+b1) ...
Setting up libelf1t64:armhf (0.192-4) ...
Setting up tzdata (2025a-2) ...

Current default time zone: 'Etc/UTC'
Local time is now:      Sun Mar 16 19:18:58 UTC 2025.
Universal Time is now:  Sun Mar 16 19:18:58 UTC 2025.
Run 'dpkg-reconfigure tzdata' if you wish to change it.

Setting up autotools-dev (20220109.1) ...
Setting up libunistring5:armhf (1.3-1) ...
Setting up autopoint (0.23.1-1) ...
Setting up scdoc (1.11.3-1) ...
Setting up autoconf (2.72-3) ...
Setting up libffi8:armhf (3.4.7-1) ...
Setting up dwz (0.15-1+b2) ...
Setting up sensible-utils (0.0.24) ...
Setting up libuchardet0:armhf (0.0.8-1+b2) ...
Setting up netbase (6.4) ...
Setting up readline-common (8.2-6) ...
Setting up libxml2:armhf (2.12.7+dfsg+really2.9.14-0.2+b2) ...
Setting up automake (1:1.17-3) ...
update-alternatives: using /usr/bin/automake-1.17 to provide /usr/bin/automake (automake) in auto mode
Setting up libfile-stripnondeterminism-perl (1.14.1-2) ...
Setting up gettext (0.23.1-1) ...
Setting up libtool (2.5.4-4) ...
Setting up intltool-debian (0.35.0+20060710.6) ...
Setting up dh-autoreconf (20) ...
Setting up libreadline8t64:armhf (8.2-6) ...
Setting up dh-strip-nondeterminism (1.14.1-2) ...
Setting up groff-base (1.23.0-7) ...
Setting up libpython3.13-stdlib:armhf (3.13.2-1) ...
Setting up libpython3-stdlib:armhf (3.13.2-2) ...
Setting up python3.13 (3.13.2-1) ...
Setting up po-debconf (1.0.21+nmu1) ...
Setting up python3 (3.13.2-2) ...
Setting up man-db (2.13.0-1) ...
Not building database; man-db/auto-update is not 'true'.
Setting up dh-python (6.20250308) ...
Setting up debhelper (13.24.1) ...
Processing triggers for libc-bin (2.41-4) ...
Reading package lists...
Building dependency tree...
Reading state information...
Reading extended state information...
Initializing package states...
Writing extended state information...
Building tag database...
 -> Finished parsing the build-deps
I: Building the package
I: Running cd /build/reproducible-path/keyd-2.5.0/ && env PATH="/usr/sbin:/usr/bin:/sbin:/bin:/usr/games" HOME="/nonexistent/first-build" dpkg-buildpackage -us -uc -b && env PATH="/usr/sbin:/usr/bin:/sbin:/bin:/usr/games" HOME="/nonexistent/first-build" dpkg-genchanges -S  > ../keyd_2.5.0-1.1_source.changes
dpkg-buildpackage: info: source package keyd
dpkg-buildpackage: info: source version 2.5.0-1.1
dpkg-buildpackage: info: source distribution unstable
dpkg-buildpackage: info: source changed by Boyuan Yang <byang@debian.org>
 dpkg-source --before-build .
dpkg-buildpackage: info: host architecture armhf
 debian/rules clean
PREFIX=/usr dh clean --with python3
   dh_auto_clean
	make -j3 clean
make[1]: Entering directory '/build/reproducible-path/keyd-2.5.0'
make[1]: git: No such file or directory
rm -rf bin data/*.1 keyd.service src/vkbd/usb-gadget.service
make[1]: Leaving directory '/build/reproducible-path/keyd-2.5.0'
   dh_clean
 debian/rules binary
PREFIX=/usr dh binary --with python3
   dh_update_autotools_config
   dh_autoreconf
   dh_auto_configure
   dh_auto_build
	make -j3 "INSTALL=install --strip-program=true"
make[1]: Entering directory '/build/reproducible-path/keyd-2.5.0'
make[1]: git: No such file or directory
for f in docs/*.scdoc; do \
	target=${f%%.scdoc}.1; \
	target=data/${target##*/}; \
	scdoc < "$f" > "$target"; \
done
mkdir -p bin
cp scripts/keyd-application-mapper bin/
sed -e 's#@PREFIX@#/usr#' keyd.service.in > keyd.service
sed -e 's#@PREFIX@#/usr#' src/vkbd/usb-gadget.service.in > src/vkbd/usb-gadget.service
cc -DVERSION=\"v2.5.0\ \(\)\" -I/usr/local/include -L/usr/local/lib -Wall -Wextra -Wno-unused -std=c11 -DSOCKET_PATH=\"/var/run/keyd.socket\" -DCONFIG_DIR=\"/etc/keyd\" -DDATA_DIR=\"/usr/share/keyd\" -D_FORTIFY_SOURCE=2 -D_DEFAULT_SOURCE -Werror=format-security -D_LARGEFILE_SOURCE -D_FILE_OFFSET_BITS=64 -D_TIME_BITS=64 -Wdate-time -D_FORTIFY_SOURCE=2 -g -O2 -Werror=implicit-function-declaration -ffile-prefix-map=/build/reproducible-path/keyd-2.5.0=. -fstack-protector-strong -fstack-clash-protection -Wformat -Werror=format-security -O3  src/*.c src/vkbd/uinput.c -lpthread -o bin/keyd -Wl,-z,relro -Wl,-z,now
In file included from src/keyd.h:43,
                 from src/config.c:20:
src/config.c: In function 'set_layer_entry':
src/config.c:255:37: warning: format '%ld' expects argument of type 'long int', but argument 4 has type 'size_t' {aka 'unsigned int'} [-Wformat=]
  255 |                                 err("chords cannot contain more than %ld keys", n);
      |                                     ^~~~~~~~~~~~~~~~~~~~~~~~~~~~~~~~~~~~~~~~~~  ~
      |                                                                                 |
      |                                                                                 size_t {aka unsigned int}
src/log.h:19:56: note: in definition of macro 'err'
   19 | #define err(fmt, ...) snprintf(errstr, sizeof(errstr), fmt, ##__VA_ARGS__);
      |                                                        ^~~
src/config.c:255:72: note: format string is defined here
  255 |                                 err("chords cannot contain more than %ld keys", n);
      |                                                                      ~~^
      |                                                                        |
      |                                                                        long int
      |                                                                      %d
src/config.c:268:37: warning: format '%ld' expects argument of type 'long int', but argument 4 has type 'size_t' {aka 'unsigned int'} [-Wformat=]
  268 |                                 err("max chords exceeded(%ld)", layer->nr_chords);
      |                                     ^~~~~~~~~~~~~~~~~~~~~~~~~~  ~~~~~~~~~~~~~~~~
      |                                                                      |
      |                                                                      size_t {aka unsigned int}
src/log.h:19:56: note: in definition of macro 'err'
   19 | #define err(fmt, ...) snprintf(errstr, sizeof(errstr), fmt, ##__VA_ARGS__);
      |                                                        ^~~
src/config.c:268:60: note: format string is defined here
  268 |                                 err("max chords exceeded(%ld)", layer->nr_chords);
      |                                                          ~~^
      |                                                            |
      |                                                            long int
      |                                                          %d
src/config.c: In function 'parse_macro_expression':
src/config.c:502:21: warning: format '%ld' expects argument of type 'long int', but argument 4 has type 'unsigned int' [-Wformat=]
  502 |                 err("macro size exceeded maximum size (%ld)\n", sizeof(buf));
      |                     ^~~~~~~~~~~~~~~~~~~~~~~~~~~~~~~~~~~~~~~~~~  ~~~~~~~~~~~
      |                                                                 |
      |                                                                 unsigned int
src/log.h:19:56: note: in definition of macro 'err'
   19 | #define err(fmt, ...) snprintf(errstr, sizeof(errstr), fmt, ##__VA_ARGS__);
      |                                                        ^~~
src/config.c:502:58: note: format string is defined here
  502 |                 err("macro size exceeded maximum size (%ld)\n", sizeof(buf));
      |                                                        ~~^
      |                                                          |
      |                                                          long int
      |                                                        %d
src/config.c: In function 'parse_command':
src/config.c:528:21: warning: format '%ld' expects argument of type 'long int', but argument 4 has type 'unsigned int' [-Wformat=]
  528 |                 err("max command length (%ld) exceeded\n", sizeof(command->cmd));
      |                     ^~~~~~~~~~~~~~~~~~~~~~~~~~~~~~~~~~~~~  ~~~~~~~~~~~~~~~~~~~~
      |                                                            |
      |                                                            unsigned int
src/log.h:19:56: note: in definition of macro 'err'
   19 | #define err(fmt, ...) snprintf(errstr, sizeof(errstr), fmt, ##__VA_ARGS__);
      |                                                        ^~~
src/config.c:528:44: note: format string is defined here
  528 |                 err("max command length (%ld) exceeded\n", sizeof(command->cmd));
      |                                          ~~^
      |                                            |
      |                                            long int
      |                                          %d
src/config.c: In function 'config_add_entry':
src/config.c:997:21: warning: '%s' directive output may be truncated writing between 512 and 2147483645 bytes into a region of size 2048 [-Wformat-truncation=]
  997 |                 err("%s exceeds maximum expression length (%d)", exp, MAX_EXP_LEN);
      |                     ^~~~~~~~~~~~~~~~~~~~~~~~~~~~~~~~~~~~~~~~~~~
src/log.h:19:56: note: in definition of macro 'err'
   19 | #define err(fmt, ...) snprintf(errstr, sizeof(errstr), fmt, ##__VA_ARGS__);
      |                                                        ^~~
src/config.c:997:22: note: format string is defined here
  997 |                 err("%s exceeds maximum expression length (%d)", exp, MAX_EXP_LEN);
      |                      ^~
In file included from /usr/include/stdio.h:970,
                 from src/config.c:11:
In function 'snprintf',
    inlined from 'config_add_entry' at src/config.c:997:3:
/usr/include/arm-linux-gnueabihf/bits/stdio2.h:68:10: note: '__builtin___snprintf_chk' output between 553 and 2147483686 bytes into a destination of size 2048
   68 |   return __builtin___snprintf_chk (__s, __n, __USE_FORTIFY_LEVEL - 1,
      |          ^~~~~~~~~~~~~~~~~~~~~~~~~~~~~~~~~~~~~~~~~~~~~~~~~~~~~~~~~~~~
   69 |                                    __glibc_objsize (__s), __fmt,
      |                                    ~~~~~~~~~~~~~~~~~~~~~~~~~~~~~
   70 |                                    __va_arg_pack ());
      |                                    ~~~~~~~~~~~~~~~~~
In function 'config_add_layer',
    inlined from 'config_parse_string' at src/config.c:855:8:
src/config.c:374:21: warning: '%s' directive output may be truncated writing between 65 and 2147483645 bytes into a region of size 2048 [-Wformat-truncation=]
  374 |                 err("%s exceeds maximum section length (%d) (ignoring)", s, MAX_LAYER_NAME_LEN);
      |                     ^~~~~~~~~~~~~~~~~~~~~~~~~~~~~~~~~~~~~~~~~~~~~~~~~~~
src/log.h:19:56: note: in definition of macro 'err'
   19 | #define err(fmt, ...) snprintf(errstr, sizeof(errstr), fmt, ##__VA_ARGS__);
      |                                                        ^~~
src/config.c: In function 'config_parse_string':
src/config.c:374:22: note: format string is defined here
  374 |                 err("%s exceeds maximum section length (%d) (ignoring)", s, MAX_LAYER_NAME_LEN);
      |                      ^~
In function 'snprintf',
    inlined from 'config_add_layer' at src/config.c:374:3,
    inlined from 'config_parse_string' at src/config.c:855:8:
/usr/include/arm-linux-gnueabihf/bits/stdio2.h:68:10: note: '__builtin___snprintf_chk' output between 113 and 2147483693 bytes into a destination of size 2048
   68 |   return __builtin___snprintf_chk (__s, __n, __USE_FORTIFY_LEVEL - 1,
      |          ^~~~~~~~~~~~~~~~~~~~~~~~~~~~~~~~~~~~~~~~~~~~~~~~~~~~~~~~~~~~
   69 |                                    __glibc_objsize (__s), __fmt,
      |                                    ~~~~~~~~~~~~~~~~~~~~~~~~~~~~~
   70 |                                    __va_arg_pack ());
      |                                    ~~~~~~~~~~~~~~~~~
src/daemon.c: In function 'add_listener':
src/daemon.c:84:33: warning: ignoring return value of 'write' declared with attribute 'warn_unused_result' [-Wunused-result]
   84 |                                 write(con, layer->type == LT_LAYOUT ? "/" : "+", 1);
      |                                 ^~~~~~~~~~~~~~~~~~~~~~~~~~~~~~~~~~~~~~~~~~~~~~~~~~~
src/daemon.c:85:33: warning: ignoring return value of 'write' declared with attribute 'warn_unused_result' [-Wunused-result]
   85 |                                 write(con, layer->name, strlen(layer->name));
      |                                 ^~~~~~~~~~~~~~~~~~~~~~~~~~~~~~~~~~~~~~~~~~~~
src/daemon.c:86:33: warning: ignoring return value of 'write' declared with attribute 'warn_unused_result' [-Wunused-result]
   86 |                                 write(con, "\n", 1);
      |                                 ^~~~~~~~~~~~~~~~~~~
src/vkbd/uinput.c: In function 'write_key_event':
src/vkbd/uinput.c:213:11: error: 'struct input_event' has no member named 'time'
  213 |         ev.time.tv_sec = 0;
      |           ^
src/vkbd/uinput.c:214:11: error: 'struct input_event' has no member named 'time'
  214 |         ev.time.tv_usec = 0;
      |           ^
src/vkbd/uinput.c: In function 'vkbd_init':
src/vkbd/uinput.c:232:29: warning: allocation of insufficient size '4' for type 'struct vkbd' with size '8' [-Walloc-size]
  232 |         struct vkbd *vkbd = calloc(1, sizeof vkbd);
      |                             ^~~~~~
src/vkbd/uinput.c: In function 'vkbd_mouse_move':
src/vkbd/uinput.c:248:19: error: 'struct input_event' has no member named 'time'
  248 |                 ev.time.tv_sec = 0;
      |                   ^
src/vkbd/uinput.c:249:19: error: 'struct input_event' has no member named 'time'
  249 |                 ev.time.tv_usec = 0;
      |                   ^
src/vkbd/uinput.c:259:19: error: 'struct input_event' has no member named 'time'
  259 |                 ev.time.tv_sec = 0;
      |                   ^
src/vkbd/uinput.c:260:19: error: 'struct input_event' has no member named 'time'
  260 |                 ev.time.tv_usec = 0;
      |                   ^
src/vkbd/uinput.c: In function 'vkbd_mouse_scroll':
src/vkbd/uinput.c:280:11: error: 'struct input_event' has no member named 'time'
  280 |         ev.time.tv_sec = 0;
      |           ^
src/vkbd/uinput.c:281:11: error: 'struct input_event' has no member named 'time'
  281 |         ev.time.tv_usec = 0;
      |           ^
src/vkbd/uinput.c:289:11: error: 'struct input_event' has no member named 'time'
  289 |         ev.time.tv_sec = 0;
      |           ^
src/vkbd/uinput.c:290:11: error: 'struct input_event' has no member named 'time'
  290 |         ev.time.tv_usec = 0;
      |           ^
src/vkbd/uinput.c: In function 'vkbd_mouse_move_abs':
src/vkbd/uinput.c:310:19: error: 'struct input_event' has no member named 'time'
  310 |                 ev.time.tv_sec = 0;
      |                   ^
src/vkbd/uinput.c:311:19: error: 'struct input_event' has no member named 'time'
  311 |                 ev.time.tv_usec = 0;
      |                   ^
src/vkbd/uinput.c:321:19: error: 'struct input_event' has no member named 'time'
  321 |                 ev.time.tv_sec = 0;
      |                   ^
src/vkbd/uinput.c:322:19: error: 'struct input_event' has no member named 'time'
  322 |                 ev.time.tv_usec = 0;
      |                   ^
make[1]: *** [Makefile:44: all] Error 1
make[1]: Leaving directory '/build/reproducible-path/keyd-2.5.0'
dh_auto_build: error: make -j3 "INSTALL=install --strip-program=true" returned exit code 2
make: *** [debian/rules:6: binary] Error 25
dpkg-buildpackage: error: debian/rules binary subprocess returned exit status 2
I: copying local configuration
E: Failed autobuilding of package
I: unmounting dev/ptmx filesystem
I: unmounting dev/pts filesystem
I: unmounting dev/shm filesystem
I: unmounting proc filesystem
I: unmounting sys filesystem
I: cleaning the build env 
I: removing directory /srv/workspace/pbuilder/5578 and its subdirectories
Sun Mar 16 19:19:32 UTC 2025  W: No second build log, what happened?