Sat Mar  8 05:24:46 UTC 2025  I: starting to build ocserv/trixie/amd64 on jenkins on '2025-03-08 05:24'
Sat Mar  8 05:24:46 UTC 2025  I: The jenkins build log is/was available at https://jenkins.debian.net/userContent/reproducible/debian/build_service/amd64_8/49929/console.log
Sat Mar  8 05:24:46 UTC 2025  I: Downloading source for trixie/ocserv=1.3.0-1
--2025-03-08 05:24:46--  http://deb.debian.org/debian/pool/main/o/ocserv/ocserv_1.3.0-1.dsc
Connecting to 46.16.76.132:3128... connected.
Proxy request sent, awaiting response... 200 OK
Length: 2478 (2.4K) [text/prs.lines.tag]
Saving to: ‘ocserv_1.3.0-1.dsc’

     0K ..                                                    100%  356M=0s

2025-03-08 05:24:46 (356 MB/s) - ‘ocserv_1.3.0-1.dsc’ saved [2478/2478]

Sat Mar  8 05:24:46 UTC 2025  I: ocserv_1.3.0-1.dsc
-----BEGIN PGP SIGNED MESSAGE-----
Hash: SHA256

Format: 3.0 (quilt)
Source: ocserv
Binary: ocserv
Architecture: any
Version: 1.3.0-1
Maintainer: Aron Xu <aron@debian.org>
Uploaders: Mike Miller <mtmiller@debian.org>, Shengqi Chen <harry-chen@outlook.com>
Homepage: https://www.infradead.org/ocserv/
Standards-Version: 4.7.0
Vcs-Browser: https://salsa.debian.org/debian/ocserv
Vcs-Git: https://salsa.debian.org/debian/ocserv.git
Build-Depends: debhelper-compat (= 13), dh-sequence-movetousr, freeradius <!nocheck !cross>, gawk, gnutls-bin, gperf, gss-ntlmssp, haproxy <!nocheck !cross>, ipcalc-ng, iperf3 <!nocheck> <!cross>, iproute2 <!nocheck !cross>, iputils-ping <!nocheck !cross>, libcjose-dev, libcurl4-gnutls-dev, libev-dev, libgnutls28-dev (>= 3.1.10), libhttp-parser-dev, libjansson-dev, libkrb5-dev, liblz4-dev, libmaxminddb-dev, libnl-route-3-dev [linux-any], libnss-wrapper, liboath-dev, libpam-wrapper, libpam0g-dev, libprotobuf-c-dev, libradcli-dev (>= 1.2.5), libreadline-dev, libseccomp-dev [linux-any], libsocket-wrapper, libsystemd-dev, libtalloc-dev, libuid-wrapper, nettle-dev, pkgconf, protobuf-c-compiler, ronn, tcpdump <!nocheck> <!cross>, yajl-tools
Package-List:
 ocserv deb net optional arch=any
Checksums-Sha1:
 4ffff4ba2974213df4558cf6ff85762e664b33ea 770596 ocserv_1.3.0.orig.tar.xz
 f1ad5d7cdd095ceeef1c844143db7880232c4f68 667 ocserv_1.3.0.orig.tar.xz.asc
 ab979fb10c9e03628a27d8bd42524c9dd638ea31 23964 ocserv_1.3.0-1.debian.tar.xz
Checksums-Sha256:
 5c562c3ea1032065ef43d6075e5722f94ce6a7a780d6a2b4c6d54c1ce3921965 770596 ocserv_1.3.0.orig.tar.xz
 25d71751a07d07da2f38f09f9a5ea27718cd08244ed9ebba8cf4c9f2a20cc672 667 ocserv_1.3.0.orig.tar.xz.asc
 6b890efbeea14d19aa8492c8887add49b6c62b260f73e282d2ffb217b100424a 23964 ocserv_1.3.0-1.debian.tar.xz
Files:
 2b6cfd509e3a18491e8c79ce613faa90 770596 ocserv_1.3.0.orig.tar.xz
 5c3fb722bef27693106552f4c3682881 667 ocserv_1.3.0.orig.tar.xz.asc
 64bb3faf03517196403716f9d71731c0 23964 ocserv_1.3.0-1.debian.tar.xz

-----BEGIN PGP SIGNATURE-----

iQEzBAEBCAAdFiEEBLHAyuu1xqoC2aJ5NP8o68vMTMgFAmbCHQAACgkQNP8o68vM
TMgxuwf/TcTo68bXKMSkdf1/YQ7qeODTGCLkhHkdBH1a42jo6YtMmW8pGpAqXteV
94FaYYIW4iBZvS1vsSc7mkUrYmHEJ4/lKOwDnjITtel/ZeO1oZFN52aAo+yPz1qL
9OOSdTJxEE9GGihtYlIYOzCC+6vMCPPc0pNUOPMYze/zJAyuWhiAIr+jKbAutsTM
FHGwW9YrS/+UvF3o4UKCuG5UGCqww+WPsKRldKffTaeGBfq9gYBiHfk57r5TD7UL
QWjjGNEotfcmToEwvznCIMw8x2PNUUV/hH/DZNFJP+xd4ZTmFODzNsG7eDBQ+0VP
WVSABNCHrTBepkbM5dwTSwPD0etZHg==
=Qu1B
-----END PGP SIGNATURE-----
Sat Mar  8 05:24:46 UTC 2025  I: Checking whether the package is not for us
Sat Mar  8 05:24:46 UTC 2025  I: Starting 1st build on remote node ionos15-amd64.debian.net.
Sat Mar  8 05:24:46 UTC 2025  I: Preparing to do remote build '1' on ionos15-amd64.debian.net.
Sat Mar  8 05:26:51 UTC 2025  I: Deleting $TMPDIR on ionos15-amd64.debian.net.
I: pbuilder: network access will be disabled during build
I: Current time: Thu Apr  9 23:47:46 -12 2026
I: pbuilder-time-stamp: 1775821666
I: Building the build Environment
I: extracting base tarball [/var/cache/pbuilder/trixie-reproducible-base.tgz]
I: copying local configuration
W: --override-config is not set; not updating apt.conf Read the manpage for details.
I: mounting /proc filesystem
I: mounting /sys filesystem
I: creating /{dev,run}/shm
I: mounting /dev/pts filesystem
I: redirecting /dev/ptmx to /dev/pts/ptmx
I: policy-rc.d already exists
I: Copying source file
I: copying [ocserv_1.3.0-1.dsc]
I: copying [./ocserv_1.3.0.orig.tar.xz]
I: copying [./ocserv_1.3.0.orig.tar.xz.asc]
I: copying [./ocserv_1.3.0-1.debian.tar.xz]
I: Extracting source
dpkg-source: warning: cannot verify inline signature for ./ocserv_1.3.0-1.dsc: unsupported subcommand
dpkg-source: info: extracting ocserv in ocserv-1.3.0
dpkg-source: info: unpacking ocserv_1.3.0.orig.tar.xz
dpkg-source: info: unpacking ocserv_1.3.0-1.debian.tar.xz
I: using fakeroot in build.
I: Installing the build-deps
I: user script /srv/workspace/pbuilder/822881/tmp/hooks/D02_print_environment starting
I: set
  BUILDDIR='/build/reproducible-path'
  BUILDUSERGECOS='first user,first room,first work-phone,first home-phone,first other'
  BUILDUSERNAME='pbuilder1'
  BUILD_ARCH='amd64'
  DEBIAN_FRONTEND='noninteractive'
  DEB_BUILD_OPTIONS='buildinfo=+all reproducible=+all parallel=42 '
  DISTRIBUTION='trixie'
  HOME='/root'
  HOST_ARCH='amd64'
  IFS=' 	
  '
  INVOCATION_ID='839ba4a662d640f1acbdcdc686bb6e8d'
  LANG='C'
  LANGUAGE='en_US:en'
  LC_ALL='C'
  MAIL='/var/mail/root'
  OPTIND='1'
  PATH='/usr/sbin:/usr/bin:/sbin:/bin:/usr/games'
  PBCURRENTCOMMANDLINEOPERATION='build'
  PBUILDER_OPERATION='build'
  PBUILDER_PKGDATADIR='/usr/share/pbuilder'
  PBUILDER_PKGLIBDIR='/usr/lib/pbuilder'
  PBUILDER_SYSCONFDIR='/etc'
  PPID='822881'
  PS1='# '
  PS2='> '
  PS4='+ '
  PWD='/'
  SHELL='/bin/bash'
  SHLVL='2'
  SUDO_COMMAND='/usr/bin/timeout -k 18.1h 18h /usr/bin/ionice -c 3 /usr/bin/nice /usr/sbin/pbuilder --build --configfile /srv/reproducible-results/rbuild-debian/r-b-build.wERMwNNu/pbuilderrc_9uZU --distribution trixie --hookdir /etc/pbuilder/first-build-hooks --debbuildopts -b --basetgz /var/cache/pbuilder/trixie-reproducible-base.tgz --buildresult /srv/reproducible-results/rbuild-debian/r-b-build.wERMwNNu/b1 --logfile b1/build.log ocserv_1.3.0-1.dsc'
  SUDO_GID='111'
  SUDO_UID='106'
  SUDO_USER='jenkins'
  TERM='unknown'
  TZ='/usr/share/zoneinfo/Etc/GMT+12'
  USER='root'
  _='/usr/bin/systemd-run'
  http_proxy='http://213.165.73.152:3128'
I: uname -a
  Linux ionos15-amd64 6.12.12+bpo-amd64 #1 SMP PREEMPT_DYNAMIC Debian 6.12.12-1~bpo12+1 (2025-02-23) x86_64 GNU/Linux
I: ls -l /bin
  lrwxrwxrwx 1 root root 7 Nov 22  2024 /bin -> usr/bin
I: user script /srv/workspace/pbuilder/822881/tmp/hooks/D02_print_environment finished
 -> Attempting to satisfy build-dependencies
 -> Creating pbuilder-satisfydepends-dummy package
Package: pbuilder-satisfydepends-dummy
Version: 0.invalid.0
Architecture: amd64
Maintainer: Debian Pbuilder Team <pbuilder-maint@lists.alioth.debian.org>
Description: Dummy package to satisfy dependencies with aptitude - created by pbuilder
 This package was created automatically by pbuilder to satisfy the
 build-dependencies of the package being currently built.
Depends: debhelper-compat (= 13), dh-sequence-movetousr, freeradius, gawk, gnutls-bin, gperf, gss-ntlmssp, haproxy, ipcalc-ng, iperf3, iproute2, iputils-ping, libcjose-dev, libcurl4-gnutls-dev, libev-dev, libgnutls28-dev (>= 3.1.10), libhttp-parser-dev, libjansson-dev, libkrb5-dev, liblz4-dev, libmaxminddb-dev, libnl-route-3-dev, libnss-wrapper, liboath-dev, libpam-wrapper, libpam0g-dev, libprotobuf-c-dev, libradcli-dev (>= 1.2.5), libreadline-dev, libseccomp-dev, libsocket-wrapper, libsystemd-dev, libtalloc-dev, libuid-wrapper, nettle-dev, pkgconf, protobuf-c-compiler, ronn, tcpdump, yajl-tools
dpkg-deb: building package 'pbuilder-satisfydepends-dummy' in '/tmp/satisfydepends-aptitude/pbuilder-satisfydepends-dummy.deb'.
Selecting previously unselected package pbuilder-satisfydepends-dummy.
(Reading database ... 19800 files and directories currently installed.)
Preparing to unpack .../pbuilder-satisfydepends-dummy.deb ...
Unpacking pbuilder-satisfydepends-dummy (0.invalid.0) ...
dpkg: pbuilder-satisfydepends-dummy: dependency problems, but configuring anyway as you requested:
 pbuilder-satisfydepends-dummy depends on debhelper-compat (= 13); however:
  Package debhelper-compat is not installed.
 pbuilder-satisfydepends-dummy depends on dh-sequence-movetousr; however:
  Package dh-sequence-movetousr is not installed.
 pbuilder-satisfydepends-dummy depends on freeradius; however:
  Package freeradius is not installed.
 pbuilder-satisfydepends-dummy depends on gawk; however:
  Package gawk is not installed.
 pbuilder-satisfydepends-dummy depends on gnutls-bin; however:
  Package gnutls-bin is not installed.
 pbuilder-satisfydepends-dummy depends on gperf; however:
  Package gperf is not installed.
 pbuilder-satisfydepends-dummy depends on gss-ntlmssp; however:
  Package gss-ntlmssp is not installed.
 pbuilder-satisfydepends-dummy depends on haproxy; however:
  Package haproxy is not installed.
 pbuilder-satisfydepends-dummy depends on ipcalc-ng; however:
  Package ipcalc-ng is not installed.
 pbuilder-satisfydepends-dummy depends on iperf3; however:
  Package iperf3 is not installed.
 pbuilder-satisfydepends-dummy depends on iproute2; however:
  Package iproute2 is not installed.
 pbuilder-satisfydepends-dummy depends on iputils-ping; however:
  Package iputils-ping is not installed.
 pbuilder-satisfydepends-dummy depends on libcjose-dev; however:
  Package libcjose-dev is not installed.
 pbuilder-satisfydepends-dummy depends on libcurl4-gnutls-dev; however:
  Package libcurl4-gnutls-dev is not installed.
 pbuilder-satisfydepends-dummy depends on libev-dev; however:
  Package libev-dev is not installed.
 pbuilder-satisfydepends-dummy depends on libgnutls28-dev (>= 3.1.10); however:
  Package libgnutls28-dev is not installed.
 pbuilder-satisfydepends-dummy depends on libhttp-parser-dev; however:
  Package libhttp-parser-dev is not installed.
 pbuilder-satisfydepends-dummy depends on libjansson-dev; however:
  Package libjansson-dev is not installed.
 pbuilder-satisfydepends-dummy depends on libkrb5-dev; however:
  Package libkrb5-dev is not installed.
 pbuilder-satisfydepends-dummy depends on liblz4-dev; however:
  Package liblz4-dev is not installed.
 pbuilder-satisfydepends-dummy depends on libmaxminddb-dev; however:
  Package libmaxminddb-dev is not installed.
 pbuilder-satisfydepends-dummy depends on libnl-route-3-dev; however:
  Package libnl-route-3-dev is not installed.
 pbuilder-satisfydepends-dummy depends on libnss-wrapper; however:
  Package libnss-wrapper is not installed.
 pbuilder-satisfydepends-dummy depends on liboath-dev; however:
  Package liboath-dev is not installed.
 pbuilder-satisfydepends-dummy depends on libpam-wrapper; however:
  Package libpam-wrapper is not installed.
 pbuilder-satisfydepends-dummy depends on libpam0g-dev; however:
  Package libpam0g-dev is not installed.
 pbuilder-satisfydepends-dummy depends on libprotobuf-c-dev; however:
  Package libprotobuf-c-dev is not installed.
 pbuilder-satisfydepends-dummy depends on libradcli-dev (>= 1.2.5); however:
  Package libradcli-dev is not installed.
 pbuilder-satisfydepends-dummy depends on libreadline-dev; however:
  Package libreadline-dev is not installed.
 pbuilder-satisfydepends-dummy depends on libseccomp-dev; however:
  Package libseccomp-dev is not installed.
 pbuilder-satisfydepends-dummy depends on libsocket-wrapper; however:
  Package libsocket-wrapper is not installed.
 pbuilder-satisfydepends-dummy depends on libsystemd-dev; however:
  Package libsystemd-dev is not installed.
 pbuilder-satisfydepends-dummy depends on libtalloc-dev; however:
  Package libtalloc-dev is not installed.
 pbuilder-satisfydepends-dummy depends on libuid-wrapper; however:
  Package libuid-wrapper is not installed.
 pbuilder-satisfydepends-dummy depends on nettle-dev; however:
  Package nettle-dev is not installed.
 pbuilder-satisfydepends-dummy depends on pkgconf; however:
  Package pkgconf is not installed.
 pbuilder-satisfydepends-dummy depends on protobuf-c-compiler; however:
  Package protobuf-c-compiler is not installed.
 pbuilder-satisfydepends-dummy depends on ronn; however:
  Package ronn is not installed.
 pbuilder-satisfydepends-dummy depends on tcpdump; however:
  Package tcpdump is not installed.
 pbuilder-satisfydepends-dummy depends on yajl-tools; however:
  Package yajl-tools is not installed.

Setting up pbuilder-satisfydepends-dummy (0.invalid.0) ...
Reading package lists...
Building dependency tree...
Reading state information...
Initializing package states...
Writing extended state information...
Building tag database...
pbuilder-satisfydepends-dummy is already installed at the requested version (0.invalid.0)
pbuilder-satisfydepends-dummy is already installed at the requested version (0.invalid.0)
The following NEW packages will be installed:
  autoconf{a} automake{a} autopoint{a} autotools-dev{a} bsdextrautils{a} ca-certificates{a} comerr-dev{a} debhelper{a} dh-autoreconf{a} dh-strip-nondeterminism{a} dwz{a} file{a} freeradius{a} freeradius-common{a} freeradius-config{a} freetds-common{a} gawk{a} gettext{a} gettext-base{a} gnutls-bin{a} gperf{a} groff{a} groff-base{a} gss-ntlmssp{a} haproxy{a} intltool-debian{a} ipcalc-ng{a} iperf3{a} iproute2{a} iputils-ping{a} krb5-multidev{a} libarchive-zip-perl{a} libbpf1{a} libbrotli-dev{a} libbrotli1{a} libcap-dev{a} libcap2-bin{a} libcjose-dev{a} libcjose0{a} libcom-err2{a} libct4{a} libcurl3t64-gnutls{a} libcurl4-gnutls-dev{a} libdbus-1-3{a} libdebhelper-perl{a} libelf1t64{a} libev-dev{a} libev4t64{a} libevent-2.1-7t64{a} libffi8{a} libfile-stripnondeterminism-perl{a} libfreeradius3{a} libgcrypt20{a} libgmp-dev{a} libgmpxx4ldbl{a} libgnutls-dane0t64{a} libgnutls-openssl27t64{a} libgnutls28-dev{a} libgnutls30t64{a} libgpg-error0{a} libgssapi-krb5-2{a} libgssrpc4t64{a} libhttp-parser-dev{a} libhttp-parser2.9{a} libice6{a} libicu72{a} libidn2-0{a} libidn2-dev{a} libiperf0{a} libjansson-dev{a} libjemalloc2{a} libjs-jquery{a} libjson-c5{a} libk5crypto3{a} libkadm5clnt-mit12{a} libkadm5srv-mit12{a} libkdb5-10t64{a} libkeyutils1{a} libkrb5-3{a} libkrb5-dev{a} libkrb5support0{a} libldap-dev{a} libldap2{a} liblua5.4-0{a} liblz4-dev{a} libmagic-mgc{a} libmagic1t64{a} libmaxminddb-dev{a} libmaxminddb0{a} libmnl0{a} libncurses-dev{a} libncurses6{a} libnghttp2-14{a} libnghttp2-dev{a} libnghttp3-9{a} libnghttp3-dev{a} libngtcp2-16{a} libngtcp2-crypto-gnutls-dev{a} libngtcp2-crypto-gnutls8{a} libngtcp2-dev{a} libnl-3-200{a} libnl-3-dev{a} libnl-route-3-200{a} libnl-route-3-dev{a} libnss-wrapper{a} liboath-dev{a} liboath0t64{a} libopentracing-c-wrapper0t64{a} libopentracing1{a} libp11-kit-dev{a} libp11-kit0{a} libpam-wrapper{a} libpam0g-dev{a} libpcap0.8t64{a} libpipeline1{a} libpkgconf3{a} libprotobuf-c-dev{a} libprotobuf-c1{a} libprotobuf32t64{a} libprotoc32t64{a} libpsl-dev{a} libpsl5t64{a} libradcli-dev{a} libradcli4{a} libreadline-dev{a} libreadline8t64{a} librtmp-dev{a} librtmp1{a} libruby{a} libruby3.3{a} libsasl2-2{a} libsasl2-modules-db{a} libsctp1{a} libseccomp-dev{a} libsigsegv2{a} libsm6{a} libsocket-wrapper{a} libssh2-1-dev{a} libssh2-1t64{a} libssl-dev{a} libsystemd-dev{a} libtalloc-dev{a} libtalloc2{a} libtasn1-6{a} libtasn1-6-dev{a} libtirpc-common{a} libtirpc3t64{a} libtool{a} libuchardet0{a} libuid-wrapper{a} libunbound8{a} libunistring5{a} libwbclient0{a} libx11-6{a} libx11-data{a} libxau6{a} libxaw7{a} libxcb1{a} libxdmcp6{a} libxext6{a} libxml2{a} libxmu6{a} libxpm4{a} libxslt1.1{a} libxt6t64{a} libxtables12{a} libxxhash-dev{a} libyajl2{a} libyaml-0-2{a} libzstd-dev{a} m4{a} man-db{a} nettle-dev{a} openssl{a} pkgconf{a} pkgconf-bin{a} po-debconf{a} protobuf-c-compiler{a} racc{a} rake{a} readline-common{a} ronn{a} ruby{a} ruby-did-you-mean{a} ruby-kramdown{a} ruby-kramdown-parser-gfm{a} ruby-mini-portile2{a} ruby-minitest{a} ruby-mustache{a} ruby-net-telnet{a} ruby-nokogiri{a} ruby-pkg-config{a} ruby-power-assert{a} ruby-ronn{a} ruby-rubygems{a} ruby-test-unit{a} ruby-webrick{a} ruby-xmlrpc{a} ruby3.3{a} rubygems-integration{a} sensible-utils{a} ssl-cert{a} tcpdump{a} x11-common{a} yajl-tools{a} zlib1g-dev{a} 
The following packages are RECOMMENDED but will NOT be installed:
  curl dbus fonts-lato freeradius-utils ghostscript graphicsmagick-imagemagick-compat imagemagick imagemagick-7.q16 javascript-common krb5-locales libarchive-cpio-perl libgpg-error-l10n libgpm2 libldap-common libltdl-dev libmail-sendmail-perl libpam-cap libpam-doc libsasl2-modules libtasn1-doc linux-sysctl-defaults lynx netpbm psutils publicsuffix ruby-rouge ruby-sdbm wget zip 
0 packages upgraded, 206 newly installed, 0 to remove and 0 not upgraded.
Need to get 78.4 MB of archives. After unpacking 261 MB will be used.
Writing extended state information...
Get: 1 http://deb.debian.org/debian trixie/main amd64 readline-common all 8.2-6 [69.4 kB]
Get: 2 http://deb.debian.org/debian trixie/main amd64 libreadline8t64 amd64 8.2-6 [169 kB]
Get: 3 http://deb.debian.org/debian trixie/main amd64 libsigsegv2 amd64 2.14-1+b2 [34.4 kB]
Get: 4 http://deb.debian.org/debian trixie/main amd64 gawk amd64 1:5.2.1-2+b1 [674 kB]
Get: 5 http://deb.debian.org/debian trixie/main amd64 libjemalloc2 amd64 5.3.0-3 [274 kB]
Get: 6 http://deb.debian.org/debian trixie/main amd64 liblua5.4-0 amd64 5.4.7-1+b2 [147 kB]
Get: 7 http://deb.debian.org/debian trixie/main amd64 libopentracing1 amd64 1.6.0-4+b2 [54.9 kB]
Get: 8 http://deb.debian.org/debian trixie/main amd64 libopentracing-c-wrapper0t64 amd64 1.1.3-3.1+b1 [31.1 kB]
Get: 9 http://deb.debian.org/debian trixie/main amd64 haproxy amd64 3.0.8-1 [2622 kB]
Get: 10 http://deb.debian.org/debian trixie/main amd64 libsctp1 amd64 1.0.21+dfsg-1 [25.8 kB]
Get: 11 http://deb.debian.org/debian trixie/main amd64 libiperf0 amd64 3.18-2 [100 kB]
Get: 12 http://deb.debian.org/debian trixie/main amd64 iperf3 amd64 3.18-2 [37.2 kB]
Get: 13 http://deb.debian.org/debian trixie/main amd64 libelf1t64 amd64 0.192-4 [189 kB]
Get: 14 http://deb.debian.org/debian trixie/main amd64 libbpf1 amd64 1:1.5.0-2 [169 kB]
Get: 15 http://deb.debian.org/debian trixie/main amd64 libmnl0 amd64 1.0.5-3 [11.9 kB]
Get: 16 http://deb.debian.org/debian trixie/main amd64 libkrb5support0 amd64 1.21.3-4 [32.8 kB]
Get: 17 http://deb.debian.org/debian trixie/main amd64 libcom-err2 amd64 1.47.2-1 [24.0 kB]
Get: 18 http://deb.debian.org/debian trixie/main amd64 libk5crypto3 amd64 1.21.3-4 [80.9 kB]
Get: 19 http://deb.debian.org/debian trixie/main amd64 libkeyutils1 amd64 1.6.3-4 [9092 B]
Get: 20 http://deb.debian.org/debian trixie/main amd64 libkrb5-3 amd64 1.21.3-4 [326 kB]
Get: 21 http://deb.debian.org/debian trixie/main amd64 libgssapi-krb5-2 amd64 1.21.3-4 [138 kB]
Get: 22 http://deb.debian.org/debian trixie/main amd64 libtirpc-common all 1.3.4+ds-1.3 [10.9 kB]
Get: 23 http://deb.debian.org/debian trixie/main amd64 libtirpc3t64 amd64 1.3.4+ds-1.3+b1 [83.1 kB]
Get: 24 http://deb.debian.org/debian trixie/main amd64 libxtables12 amd64 1.8.11-2 [31.9 kB]
Get: 25 http://deb.debian.org/debian trixie/main amd64 libcap2-bin amd64 1:2.66-5+b1 [35.3 kB]
Get: 26 http://deb.debian.org/debian trixie/main amd64 iproute2 amd64 6.13.0-1 [1087 kB]
Get: 27 http://deb.debian.org/debian trixie/main amd64 libunistring5 amd64 1.3-1 [476 kB]
Get: 28 http://deb.debian.org/debian trixie/main amd64 libidn2-0 amd64 2.3.7-2+b1 [129 kB]
Get: 29 http://deb.debian.org/debian trixie/main amd64 iputils-ping amd64 3:20240905-1 [50.5 kB]
Get: 30 http://deb.debian.org/debian trixie/main amd64 sensible-utils all 0.0.24 [24.8 kB]
Get: 31 http://deb.debian.org/debian trixie/main amd64 openssl amd64 3.4.1-1 [1427 kB]
Get: 32 http://deb.debian.org/debian trixie/main amd64 ca-certificates all 20241223 [164 kB]
Get: 33 http://deb.debian.org/debian trixie/main amd64 libmagic-mgc amd64 1:5.45-3+b1 [314 kB]
Get: 34 http://deb.debian.org/debian trixie/main amd64 libmagic1t64 amd64 1:5.45-3+b1 [108 kB]
Get: 35 http://deb.debian.org/debian trixie/main amd64 file amd64 1:5.45-3+b1 [43.3 kB]
Get: 36 http://deb.debian.org/debian trixie/main amd64 gettext-base amd64 0.23.1-1 [243 kB]
Get: 37 http://deb.debian.org/debian trixie/main amd64 libuchardet0 amd64 0.0.8-1+b2 [68.9 kB]
Get: 38 http://deb.debian.org/debian trixie/main amd64 groff-base amd64 1.23.0-7 [1185 kB]
Get: 39 http://deb.debian.org/debian trixie/main amd64 bsdextrautils amd64 2.40.4-5 [92.4 kB]
Get: 40 http://deb.debian.org/debian trixie/main amd64 libpipeline1 amd64 1.5.8-1 [42.0 kB]
Get: 41 http://deb.debian.org/debian trixie/main amd64 man-db amd64 2.13.0-1 [1420 kB]
Get: 42 http://deb.debian.org/debian trixie/main amd64 m4 amd64 1.4.19-7 [294 kB]
Get: 43 http://deb.debian.org/debian trixie/main amd64 autoconf all 2.72-3 [493 kB]
Get: 44 http://deb.debian.org/debian trixie/main amd64 autotools-dev all 20220109.1 [51.6 kB]
Get: 45 http://deb.debian.org/debian trixie/main amd64 automake all 1:1.17-3 [862 kB]
Get: 46 http://deb.debian.org/debian trixie/main amd64 autopoint all 0.23.1-1 [770 kB]
Get: 47 http://deb.debian.org/debian trixie/main amd64 comerr-dev amd64 2.1-1.47.2-1 [55.7 kB]
Get: 48 http://deb.debian.org/debian trixie/main amd64 libdebhelper-perl all 13.24.1 [90.9 kB]
Get: 49 http://deb.debian.org/debian trixie/main amd64 libtool all 2.5.4-3 [539 kB]
Get: 50 http://deb.debian.org/debian trixie/main amd64 dh-autoreconf all 20 [17.1 kB]
Get: 51 http://deb.debian.org/debian trixie/main amd64 libarchive-zip-perl all 1.68-1 [104 kB]
Get: 52 http://deb.debian.org/debian trixie/main amd64 libfile-stripnondeterminism-perl all 1.14.1-2 [19.7 kB]
Get: 53 http://deb.debian.org/debian trixie/main amd64 dh-strip-nondeterminism all 1.14.1-2 [8620 B]
Get: 54 http://deb.debian.org/debian trixie/main amd64 dwz amd64 0.15-1+b1 [110 kB]
Get: 55 http://deb.debian.org/debian trixie/main amd64 libicu72 amd64 72.1-6 [9421 kB]
Get: 56 http://deb.debian.org/debian trixie/main amd64 libxml2 amd64 2.12.7+dfsg+really2.9.14-0.2+b2 [699 kB]
Get: 57 http://deb.debian.org/debian trixie/main amd64 gettext amd64 0.23.1-1 [1680 kB]
Get: 58 http://deb.debian.org/debian trixie/main amd64 intltool-debian all 0.35.0+20060710.6 [22.9 kB]
Get: 59 http://deb.debian.org/debian trixie/main amd64 po-debconf all 1.0.21+nmu1 [248 kB]
Get: 60 http://deb.debian.org/debian trixie/main amd64 debhelper all 13.24.1 [920 kB]
Get: 61 http://deb.debian.org/debian trixie/main amd64 freeradius-common all 3.2.7+dfsg-1 [245 kB]
Get: 62 http://deb.debian.org/debian trixie/main amd64 ssl-cert all 1.1.3 [16.8 kB]
Get: 63 http://deb.debian.org/debian trixie/main amd64 freeradius-config amd64 3.2.7+dfsg-1 [225 kB]
Get: 64 http://deb.debian.org/debian trixie/main amd64 libdbus-1-3 amd64 1.16.2-1 [177 kB]
Get: 65 http://deb.debian.org/debian trixie/main amd64 libpcap0.8t64 amd64 1.10.5-2 [169 kB]
Get: 66 http://deb.debian.org/debian trixie/main amd64 libtalloc2 amd64 2:2.4.2+samba4.21.4+dfsg-1 [58.8 kB]
Get: 67 http://deb.debian.org/debian trixie/main amd64 libfreeradius3 amd64 3.2.7+dfsg-1 [200 kB]
Get: 68 http://deb.debian.org/debian trixie/main amd64 libffi8 amd64 3.4.7-1 [23.9 kB]
Get: 69 http://deb.debian.org/debian trixie/main amd64 libp11-kit0 amd64 0.25.5-3 [425 kB]
Get: 70 http://deb.debian.org/debian trixie/main amd64 libtasn1-6 amd64 4.20.0-2 [49.9 kB]
Get: 71 http://deb.debian.org/debian trixie/main amd64 libgnutls30t64 amd64 3.8.9-2 [1464 kB]
Get: 72 http://deb.debian.org/debian trixie/main amd64 freetds-common all 1.3.17+ds-2 [28.9 kB]
Get: 73 http://deb.debian.org/debian trixie/main amd64 libct4 amd64 1.3.17+ds-2+b5 [163 kB]
Get: 74 http://deb.debian.org/debian trixie/main amd64 libjson-c5 amd64 0.18+ds-1 [46.0 kB]
Get: 75 http://deb.debian.org/debian trixie/main amd64 libwbclient0 amd64 2:4.21.4+dfsg-1 [67.2 kB]
Get: 76 http://deb.debian.org/debian trixie/main amd64 freeradius amd64 3.2.7+dfsg-1 [696 kB]
Get: 77 http://deb.debian.org/debian trixie/main amd64 libevent-2.1-7t64 amd64 2.1.12-stable-10+b1 [182 kB]
Get: 78 http://deb.debian.org/debian trixie/main amd64 libunbound8 amd64 1.22.0-1+b1 [598 kB]
Get: 79 http://deb.debian.org/debian trixie/main amd64 libgnutls-dane0t64 amd64 3.8.9-2 [455 kB]
Get: 80 http://deb.debian.org/debian trixie/main amd64 gnutls-bin amd64 3.8.9-2 [691 kB]
Get: 81 http://deb.debian.org/debian trixie/main amd64 gperf amd64 3.1-3 [148 kB]
Get: 82 http://deb.debian.org/debian trixie/main amd64 libxau6 amd64 1:1.0.11-1 [20.4 kB]
Get: 83 http://deb.debian.org/debian trixie/main amd64 libxdmcp6 amd64 1:1.1.5-1 [27.8 kB]
Get: 84 http://deb.debian.org/debian trixie/main amd64 libxcb1 amd64 1.17.0-2+b1 [144 kB]
Get: 85 http://deb.debian.org/debian trixie/main amd64 libx11-data all 2:1.8.10-2 [337 kB]
Get: 86 http://deb.debian.org/debian trixie/main amd64 libx11-6 amd64 2:1.8.10-2 [813 kB]
Get: 87 http://deb.debian.org/debian trixie/main amd64 libxext6 amd64 2:1.3.4-1+b3 [50.4 kB]
Get: 88 http://deb.debian.org/debian trixie/main amd64 x11-common all 1:7.7+24 [217 kB]
Get: 89 http://deb.debian.org/debian trixie/main amd64 libice6 amd64 2:1.1.1-1 [65.4 kB]
Get: 90 http://deb.debian.org/debian trixie/main amd64 libsm6 amd64 2:1.2.4-1 [35.2 kB]
Get: 91 http://deb.debian.org/debian trixie/main amd64 libxt6t64 amd64 1:1.2.1-1.2+b2 [188 kB]
Get: 92 http://deb.debian.org/debian trixie/main amd64 libxmu6 amd64 2:1.1.3-3+b4 [59.0 kB]
Get: 93 http://deb.debian.org/debian trixie/main amd64 libxpm4 amd64 1:3.5.17-1+b3 [56.2 kB]
Get: 94 http://deb.debian.org/debian trixie/main amd64 libxaw7 amd64 2:1.0.16-1 [212 kB]
Get: 95 http://deb.debian.org/debian trixie/main amd64 groff amd64 1.23.0-7 [11.6 MB]
Get: 96 http://deb.debian.org/debian trixie/main amd64 gss-ntlmssp amd64 1.2.0-1+b2 [55.2 kB]
Get: 97 http://deb.debian.org/debian trixie/main amd64 ipcalc-ng amd64 1.0.3-2 [29.5 kB]
Get: 98 http://deb.debian.org/debian trixie/main amd64 libgssrpc4t64 amd64 1.21.3-4 [60.0 kB]
Get: 99 http://deb.debian.org/debian trixie/main amd64 libkadm5clnt-mit12 amd64 1.21.3-4 [42.2 kB]
Get: 100 http://deb.debian.org/debian trixie/main amd64 libkdb5-10t64 amd64 1.21.3-4 [42.4 kB]
Get: 101 http://deb.debian.org/debian trixie/main amd64 libkadm5srv-mit12 amd64 1.21.3-4 [54.2 kB]
Get: 102 http://deb.debian.org/debian trixie/main amd64 krb5-multidev amd64 1.21.3-4 [126 kB]
Get: 103 http://deb.debian.org/debian trixie/main amd64 libbrotli1 amd64 1.1.0-2+b7 [307 kB]
Get: 104 http://deb.debian.org/debian trixie/main amd64 libbrotli-dev amd64 1.1.0-2+b7 [316 kB]
Get: 105 http://deb.debian.org/debian trixie/main amd64 libcap-dev amd64 1:2.66-5+b1 [535 kB]
Get: 106 http://deb.debian.org/debian trixie/main amd64 libcjose0 amd64 0.6.2.3-1+b1 [36.9 kB]
Get: 107 http://deb.debian.org/debian trixie/main amd64 libcjose-dev amd64 0.6.2.3-1+b1 [45.6 kB]
Get: 108 http://deb.debian.org/debian trixie/main amd64 libsasl2-modules-db amd64 2.1.28+dfsg1-9 [19.8 kB]
Get: 109 http://deb.debian.org/debian trixie/main amd64 libsasl2-2 amd64 2.1.28+dfsg1-9 [57.5 kB]
Get: 110 http://deb.debian.org/debian trixie/main amd64 libldap2 amd64 2.6.9+dfsg-1 [192 kB]
Get: 111 http://deb.debian.org/debian trixie/main amd64 libnghttp2-14 amd64 1.64.0-1 [75.5 kB]
Get: 112 http://deb.debian.org/debian trixie/main amd64 libnghttp3-9 amd64 1.8.0-1 [67.7 kB]
Get: 113 http://deb.debian.org/debian trixie/main amd64 libngtcp2-16 amd64 1.11.0-1 [131 kB]
Get: 114 http://deb.debian.org/debian trixie/main amd64 libngtcp2-crypto-gnutls8 amd64 1.11.0-1 [29.3 kB]
Get: 115 http://deb.debian.org/debian trixie/main amd64 libpsl5t64 amd64 0.21.2-1.1+b1 [57.2 kB]
Get: 116 http://deb.debian.org/debian trixie/main amd64 librtmp1 amd64 2.4+20151223.gitfa8646d.1-2+b5 [58.8 kB]
Get: 117 http://deb.debian.org/debian trixie/main amd64 libssh2-1t64 amd64 1.11.1-1 [245 kB]
Get: 118 http://deb.debian.org/debian trixie/main amd64 libcurl3t64-gnutls amd64 8.12.1-3 [365 kB]
Get: 119 http://deb.debian.org/debian trixie/main amd64 libgnutls-openssl27t64 amd64 3.8.9-2 [455 kB]
Get: 120 http://deb.debian.org/debian trixie/main amd64 libidn2-dev amd64 2.3.7-2+b1 [123 kB]
Get: 121 http://deb.debian.org/debian trixie/main amd64 libp11-kit-dev amd64 0.25.5-3 [208 kB]
Get: 122 http://deb.debian.org/debian trixie/main amd64 libtasn1-6-dev amd64 4.20.0-2 [99.2 kB]
Get: 123 http://deb.debian.org/debian trixie/main amd64 libgmpxx4ldbl amd64 2:6.3.0+dfsg-3 [329 kB]
Get: 124 http://deb.debian.org/debian trixie/main amd64 libgmp-dev amd64 2:6.3.0+dfsg-3 [642 kB]
Get: 125 http://deb.debian.org/debian trixie/main amd64 nettle-dev amd64 3.10.1-1 [1318 kB]
Get: 126 http://deb.debian.org/debian trixie/main amd64 libgnutls28-dev amd64 3.8.9-2 [1401 kB]
Get: 127 http://deb.debian.org/debian trixie/main amd64 libkrb5-dev amd64 1.21.3-4 [15.9 kB]
Get: 128 http://deb.debian.org/debian trixie/main amd64 libldap-dev amd64 2.6.9+dfsg-1 [307 kB]
Get: 129 http://deb.debian.org/debian trixie/main amd64 libpkgconf3 amd64 1.8.1-4 [36.4 kB]
Get: 130 http://deb.debian.org/debian trixie/main amd64 pkgconf-bin amd64 1.8.1-4 [30.2 kB]
Get: 131 http://deb.debian.org/debian trixie/main amd64 pkgconf amd64 1.8.1-4 [26.2 kB]
Get: 132 http://deb.debian.org/debian trixie/main amd64 libnghttp2-dev amd64 1.64.0-1 [115 kB]
Get: 133 http://deb.debian.org/debian trixie/main amd64 libnghttp3-dev amd64 1.8.0-1 [91.3 kB]
Get: 134 http://deb.debian.org/debian trixie/main amd64 libngtcp2-crypto-gnutls-dev amd64 1.11.0-1 [34.0 kB]
Get: 135 http://deb.debian.org/debian trixie/main amd64 libngtcp2-dev amd64 1.11.0-1 [179 kB]
Get: 136 http://deb.debian.org/debian trixie/main amd64 libpsl-dev amd64 0.21.2-1.1+b1 [77.6 kB]
Get: 137 http://deb.debian.org/debian trixie/main amd64 zlib1g-dev amd64 1:1.3.dfsg+really1.3.1-1+b1 [920 kB]
Get: 138 http://deb.debian.org/debian trixie/main amd64 librtmp-dev amd64 2.4+20151223.gitfa8646d.1-2+b5 [68.0 kB]
Get: 139 http://deb.debian.org/debian trixie/main amd64 libssl-dev amd64 3.4.1-1 [2787 kB]
Get: 140 http://deb.debian.org/debian trixie/main amd64 libssh2-1-dev amd64 1.11.1-1 [393 kB]
Get: 141 http://deb.debian.org/debian trixie/main amd64 libzstd-dev amd64 1.5.6+dfsg-2 [365 kB]
Get: 142 http://deb.debian.org/debian trixie/main amd64 libcurl4-gnutls-dev amd64 8.12.1-3 [480 kB]
Get: 143 http://deb.debian.org/debian trixie/main amd64 libev4t64 amd64 1:4.33-2.1+b1 [42.4 kB]
Get: 144 http://deb.debian.org/debian trixie/main amd64 libev-dev amd64 1:4.33-2.1+b1 [135 kB]
Get: 145 http://deb.debian.org/debian trixie/main amd64 libgpg-error0 amd64 1.51-3 [82.2 kB]
Get: 146 http://deb.debian.org/debian trixie/main amd64 libgcrypt20 amd64 1.11.0-7 [843 kB]
Get: 147 http://deb.debian.org/debian trixie/main amd64 libhttp-parser2.9 amd64 2.9.4-6+b2 [21.2 kB]
Get: 148 http://deb.debian.org/debian trixie/main amd64 libhttp-parser-dev amd64 2.9.4-6+b2 [20.9 kB]
Get: 149 http://deb.debian.org/debian trixie/main amd64 libjansson-dev amd64 2.14-2+b3 [43.2 kB]
Get: 150 http://deb.debian.org/debian trixie/main amd64 libjs-jquery all 3.6.1+dfsg+~3.5.14-1 [326 kB]
Get: 151 http://deb.debian.org/debian trixie/main amd64 libxxhash-dev amd64 0.8.3-2 [81.0 kB]
Get: 152 http://deb.debian.org/debian trixie/main amd64 liblz4-dev amd64 1.10.0-3 [88.3 kB]
Get: 153 http://deb.debian.org/debian trixie/main amd64 libmaxminddb0 amd64 1.12.2-1 [25.8 kB]
Get: 154 http://deb.debian.org/debian trixie/main amd64 libmaxminddb-dev amd64 1.12.2-1 [34.6 kB]
Get: 155 http://deb.debian.org/debian trixie/main amd64 libncurses6 amd64 6.5+20250216-1 [105 kB]
Get: 156 http://deb.debian.org/debian trixie/main amd64 libncurses-dev amd64 6.5+20250216-1 [353 kB]
Get: 157 http://deb.debian.org/debian trixie/main amd64 libnl-3-200 amd64 3.7.0-0.3+b1 [59.4 kB]
Get: 158 http://deb.debian.org/debian trixie/main amd64 libnl-3-dev amd64 3.7.0-0.3+b1 [100 kB]
Get: 159 http://deb.debian.org/debian trixie/main amd64 libnl-route-3-200 amd64 3.7.0-0.3+b1 [182 kB]
Get: 160 http://deb.debian.org/debian trixie/main amd64 libnl-route-3-dev amd64 3.7.0-0.3+b1 [200 kB]
Get: 161 http://deb.debian.org/debian trixie/main amd64 libnss-wrapper amd64 1.1.16-1 [32.2 kB]
Get: 162 http://deb.debian.org/debian trixie/main amd64 liboath0t64 amd64 2.6.12-1 [65.9 kB]
Get: 163 http://deb.debian.org/debian trixie/main amd64 liboath-dev amd64 2.6.12-1 [86.9 kB]
Get: 164 http://deb.debian.org/debian trixie/main amd64 libpam-wrapper amd64 1.1.7-1+b1 [27.4 kB]
Get: 165 http://deb.debian.org/debian trixie/main amd64 libpam0g-dev amd64 1.7.0-3 [69.2 kB]
Get: 166 http://deb.debian.org/debian trixie/main amd64 libprotobuf-c1 amd64 1.5.1-1 [20.5 kB]
Get: 167 http://deb.debian.org/debian trixie/main amd64 libprotobuf-c-dev amd64 1.5.1-1 [28.5 kB]
Get: 168 http://deb.debian.org/debian trixie/main amd64 libprotobuf32t64 amd64 3.21.12-10+b6 [981 kB]
Get: 169 http://deb.debian.org/debian trixie/main amd64 libprotoc32t64 amd64 3.21.12-10+b6 [923 kB]
Get: 170 http://deb.debian.org/debian trixie/main amd64 libradcli4 amd64 1.2.11-1+b3 [40.6 kB]
Get: 171 http://deb.debian.org/debian trixie/main amd64 libradcli-dev amd64 1.2.11-1+b3 [101 kB]
Get: 172 http://deb.debian.org/debian trixie/main amd64 libreadline-dev amd64 8.2-6 [153 kB]
Get: 173 http://deb.debian.org/debian trixie/main amd64 rubygems-integration all 1.19 [5488 B]
Get: 174 http://deb.debian.org/debian trixie/main amd64 ruby3.3 amd64 3.3.7-1 [827 kB]
Get: 175 http://deb.debian.org/debian trixie/main amd64 ruby-rubygems all 3.6.3-1 [406 kB]
Get: 176 http://deb.debian.org/debian trixie/main amd64 ruby amd64 1:3.3+b1 [6560 B]
Get: 177 http://deb.debian.org/debian trixie/main amd64 rake all 13.2.1-1 [65.2 kB]
Get: 178 http://deb.debian.org/debian trixie/main amd64 ruby-did-you-mean all 1.6.3-2 [20.9 kB]
Get: 179 http://deb.debian.org/debian trixie/main amd64 ruby-minitest all 5.25.4-2 [66.2 kB]
Get: 180 http://deb.debian.org/debian trixie/main amd64 ruby-net-telnet all 0.2.0-1 [13.1 kB]
Get: 181 http://deb.debian.org/debian trixie/main amd64 ruby-power-assert all 2.0.3-1 [11.8 kB]
Get: 182 http://deb.debian.org/debian trixie/main amd64 ruby-test-unit all 3.6.2-1 [79.1 kB]
Get: 183 http://deb.debian.org/debian trixie/main amd64 ruby-webrick all 1.8.1-1 [51.4 kB]
Get: 184 http://deb.debian.org/debian trixie/main amd64 ruby-xmlrpc all 0.3.3-2 [24.4 kB]
Get: 185 http://deb.debian.org/debian trixie/main amd64 libyaml-0-2 amd64 0.2.5-2 [52.5 kB]
Get: 186 http://deb.debian.org/debian trixie/main amd64 libruby3.3 amd64 3.3.7-1 [6274 kB]
Get: 187 http://deb.debian.org/debian trixie/main amd64 libruby amd64 1:3.3+b1 [5440 B]
Get: 188 http://deb.debian.org/debian trixie/main amd64 libseccomp-dev amd64 2.5.5-2+b1 [92.0 kB]
Get: 189 http://deb.debian.org/debian trixie/main amd64 libsocket-wrapper amd64 1.4.4-3 [46.2 kB]
Get: 190 http://deb.debian.org/debian trixie/main amd64 libsystemd-dev amd64 257.3-1 [1349 kB]
Get: 191 http://deb.debian.org/debian trixie/main amd64 libtalloc-dev amd64 2:2.4.2+samba4.21.4+dfsg-1 [70.3 kB]
Get: 192 http://deb.debian.org/debian trixie/main amd64 libuid-wrapper amd64 1.3.1-3 [20.3 kB]
Get: 193 http://deb.debian.org/debian trixie/main amd64 libxslt1.1 amd64 1.1.35-1.1+b1 [233 kB]
Get: 194 http://deb.debian.org/debian trixie/main amd64 libyajl2 amd64 2.1.0-5+b2 [23.3 kB]
Get: 195 http://deb.debian.org/debian trixie/main amd64 protobuf-c-compiler amd64 1.5.1-1 [88.2 kB]
Get: 196 http://deb.debian.org/debian trixie/main amd64 racc all 1.8.1-1 [75.4 kB]
Get: 197 http://deb.debian.org/debian trixie/main amd64 ruby-kramdown all 2.5.1-1 [317 kB]
Get: 198 http://deb.debian.org/debian trixie/main amd64 ruby-kramdown-parser-gfm all 1.1.0-3 [6528 B]
Get: 199 http://deb.debian.org/debian trixie/main amd64 ruby-mustache all 1.1.1-2 [26.6 kB]
Get: 200 http://deb.debian.org/debian trixie/main amd64 ruby-mini-portile2 all 2.8.7-1 [21.3 kB]
Get: 201 http://deb.debian.org/debian trixie/main amd64 ruby-pkg-config all 1.5.9-1 [8584 B]
Get: 202 http://deb.debian.org/debian trixie/main amd64 ruby-nokogiri amd64 1.18.2+dfsg-1+b1 [241 kB]
Get: 203 http://deb.debian.org/debian trixie/main amd64 ruby-ronn all 0.10.1-2 [28.0 kB]
Get: 204 http://deb.debian.org/debian trixie/main amd64 ronn all 0.10.1-2 [8708 B]
Get: 205 http://deb.debian.org/debian trixie/main amd64 tcpdump amd64 4.99.5-2 [471 kB]
Get: 206 http://deb.debian.org/debian trixie/main amd64 yajl-tools amd64 2.1.0-5+b2 [13.8 kB]
Fetched 78.4 MB in 6s (13.5 MB/s)
Preconfiguring packages ...
Selecting previously unselected package readline-common.
(Reading database ... 
(Reading database ... 5%
(Reading database ... 10%
(Reading database ... 15%
(Reading database ... 20%
(Reading database ... 25%
(Reading database ... 30%
(Reading database ... 35%
(Reading database ... 40%
(Reading database ... 45%
(Reading database ... 50%
(Reading database ... 55%
(Reading database ... 60%
(Reading database ... 65%
(Reading database ... 70%
(Reading database ... 75%
(Reading database ... 80%
(Reading database ... 85%
(Reading database ... 90%
(Reading database ... 95%
(Reading database ... 100%
(Reading database ... 19800 files and directories currently installed.)
Preparing to unpack .../readline-common_8.2-6_all.deb ...
Unpacking readline-common (8.2-6) ...
Selecting previously unselected package libreadline8t64:amd64.
Preparing to unpack .../libreadline8t64_8.2-6_amd64.deb ...
Adding 'diversion of /lib/x86_64-linux-gnu/libhistory.so.8 to /lib/x86_64-linux-gnu/libhistory.so.8.usr-is-merged by libreadline8t64'
Adding 'diversion of /lib/x86_64-linux-gnu/libhistory.so.8.2 to /lib/x86_64-linux-gnu/libhistory.so.8.2.usr-is-merged by libreadline8t64'
Adding 'diversion of /lib/x86_64-linux-gnu/libreadline.so.8 to /lib/x86_64-linux-gnu/libreadline.so.8.usr-is-merged by libreadline8t64'
Adding 'diversion of /lib/x86_64-linux-gnu/libreadline.so.8.2 to /lib/x86_64-linux-gnu/libreadline.so.8.2.usr-is-merged by libreadline8t64'
Unpacking libreadline8t64:amd64 (8.2-6) ...
Selecting previously unselected package libsigsegv2:amd64.
Preparing to unpack .../libsigsegv2_2.14-1+b2_amd64.deb ...
Unpacking libsigsegv2:amd64 (2.14-1+b2) ...
Setting up readline-common (8.2-6) ...
Setting up libreadline8t64:amd64 (8.2-6) ...
Setting up libsigsegv2:amd64 (2.14-1+b2) ...
Selecting previously unselected package gawk.
(Reading database ... 
(Reading database ... 5%
(Reading database ... 10%
(Reading database ... 15%
(Reading database ... 20%
(Reading database ... 25%
(Reading database ... 30%
(Reading database ... 35%
(Reading database ... 40%
(Reading database ... 45%
(Reading database ... 50%
(Reading database ... 55%
(Reading database ... 60%
(Reading database ... 65%
(Reading database ... 70%
(Reading database ... 75%
(Reading database ... 80%
(Reading database ... 85%
(Reading database ... 90%
(Reading database ... 95%
(Reading database ... 100%
(Reading database ... 19842 files and directories currently installed.)
Preparing to unpack .../000-gawk_1%3a5.2.1-2+b1_amd64.deb ...
Unpacking gawk (1:5.2.1-2+b1) ...
Selecting previously unselected package libjemalloc2:amd64.
Preparing to unpack .../001-libjemalloc2_5.3.0-3_amd64.deb ...
Unpacking libjemalloc2:amd64 (5.3.0-3) ...
Selecting previously unselected package liblua5.4-0:amd64.
Preparing to unpack .../002-liblua5.4-0_5.4.7-1+b2_amd64.deb ...
Unpacking liblua5.4-0:amd64 (5.4.7-1+b2) ...
Selecting previously unselected package libopentracing1:amd64.
Preparing to unpack .../003-libopentracing1_1.6.0-4+b2_amd64.deb ...
Unpacking libopentracing1:amd64 (1.6.0-4+b2) ...
Selecting previously unselected package libopentracing-c-wrapper0t64:amd64.
Preparing to unpack .../004-libopentracing-c-wrapper0t64_1.1.3-3.1+b1_amd64.deb ...
Unpacking libopentracing-c-wrapper0t64:amd64 (1.1.3-3.1+b1) ...
Selecting previously unselected package haproxy.
Preparing to unpack .../005-haproxy_3.0.8-1_amd64.deb ...
Unpacking haproxy (3.0.8-1) ...
Selecting previously unselected package libsctp1:amd64.
Preparing to unpack .../006-libsctp1_1.0.21+dfsg-1_amd64.deb ...
Unpacking libsctp1:amd64 (1.0.21+dfsg-1) ...
Selecting previously unselected package libiperf0:amd64.
Preparing to unpack .../007-libiperf0_3.18-2_amd64.deb ...
Unpacking libiperf0:amd64 (3.18-2) ...
Selecting previously unselected package iperf3.
Preparing to unpack .../008-iperf3_3.18-2_amd64.deb ...
Unpacking iperf3 (3.18-2) ...
Selecting previously unselected package libelf1t64:amd64.
Preparing to unpack .../009-libelf1t64_0.192-4_amd64.deb ...
Unpacking libelf1t64:amd64 (0.192-4) ...
Selecting previously unselected package libbpf1:amd64.
Preparing to unpack .../010-libbpf1_1%3a1.5.0-2_amd64.deb ...
Unpacking libbpf1:amd64 (1:1.5.0-2) ...
Selecting previously unselected package libmnl0:amd64.
Preparing to unpack .../011-libmnl0_1.0.5-3_amd64.deb ...
Unpacking libmnl0:amd64 (1.0.5-3) ...
Selecting previously unselected package libkrb5support0:amd64.
Preparing to unpack .../012-libkrb5support0_1.21.3-4_amd64.deb ...
Unpacking libkrb5support0:amd64 (1.21.3-4) ...
Selecting previously unselected package libcom-err2:amd64.
Preparing to unpack .../013-libcom-err2_1.47.2-1_amd64.deb ...
Unpacking libcom-err2:amd64 (1.47.2-1) ...
Selecting previously unselected package libk5crypto3:amd64.
Preparing to unpack .../014-libk5crypto3_1.21.3-4_amd64.deb ...
Unpacking libk5crypto3:amd64 (1.21.3-4) ...
Selecting previously unselected package libkeyutils1:amd64.
Preparing to unpack .../015-libkeyutils1_1.6.3-4_amd64.deb ...
Unpacking libkeyutils1:amd64 (1.6.3-4) ...
Selecting previously unselected package libkrb5-3:amd64.
Preparing to unpack .../016-libkrb5-3_1.21.3-4_amd64.deb ...
Unpacking libkrb5-3:amd64 (1.21.3-4) ...
Selecting previously unselected package libgssapi-krb5-2:amd64.
Preparing to unpack .../017-libgssapi-krb5-2_1.21.3-4_amd64.deb ...
Unpacking libgssapi-krb5-2:amd64 (1.21.3-4) ...
Selecting previously unselected package libtirpc-common.
Preparing to unpack .../018-libtirpc-common_1.3.4+ds-1.3_all.deb ...
Unpacking libtirpc-common (1.3.4+ds-1.3) ...
Selecting previously unselected package libtirpc3t64:amd64.
Preparing to unpack .../019-libtirpc3t64_1.3.4+ds-1.3+b1_amd64.deb ...
Adding 'diversion of /lib/x86_64-linux-gnu/libtirpc.so.3 to /lib/x86_64-linux-gnu/libtirpc.so.3.usr-is-merged by libtirpc3t64'
Adding 'diversion of /lib/x86_64-linux-gnu/libtirpc.so.3.0.0 to /lib/x86_64-linux-gnu/libtirpc.so.3.0.0.usr-is-merged by libtirpc3t64'
Unpacking libtirpc3t64:amd64 (1.3.4+ds-1.3+b1) ...
Selecting previously unselected package libxtables12:amd64.
Preparing to unpack .../020-libxtables12_1.8.11-2_amd64.deb ...
Unpacking libxtables12:amd64 (1.8.11-2) ...
Selecting previously unselected package libcap2-bin.
Preparing to unpack .../021-libcap2-bin_1%3a2.66-5+b1_amd64.deb ...
Unpacking libcap2-bin (1:2.66-5+b1) ...
Selecting previously unselected package iproute2.
Preparing to unpack .../022-iproute2_6.13.0-1_amd64.deb ...
Unpacking iproute2 (6.13.0-1) ...
Selecting previously unselected package libunistring5:amd64.
Preparing to unpack .../023-libunistring5_1.3-1_amd64.deb ...
Unpacking libunistring5:amd64 (1.3-1) ...
Selecting previously unselected package libidn2-0:amd64.
Preparing to unpack .../024-libidn2-0_2.3.7-2+b1_amd64.deb ...
Unpacking libidn2-0:amd64 (2.3.7-2+b1) ...
Selecting previously unselected package iputils-ping.
Preparing to unpack .../025-iputils-ping_3%3a20240905-1_amd64.deb ...
Unpacking iputils-ping (3:20240905-1) ...
Selecting previously unselected package sensible-utils.
Preparing to unpack .../026-sensible-utils_0.0.24_all.deb ...
Unpacking sensible-utils (0.0.24) ...
Selecting previously unselected package openssl.
Preparing to unpack .../027-openssl_3.4.1-1_amd64.deb ...
Unpacking openssl (3.4.1-1) ...
Selecting previously unselected package ca-certificates.
Preparing to unpack .../028-ca-certificates_20241223_all.deb ...
Unpacking ca-certificates (20241223) ...
Selecting previously unselected package libmagic-mgc.
Preparing to unpack .../029-libmagic-mgc_1%3a5.45-3+b1_amd64.deb ...
Unpacking libmagic-mgc (1:5.45-3+b1) ...
Selecting previously unselected package libmagic1t64:amd64.
Preparing to unpack .../030-libmagic1t64_1%3a5.45-3+b1_amd64.deb ...
Unpacking libmagic1t64:amd64 (1:5.45-3+b1) ...
Selecting previously unselected package file.
Preparing to unpack .../031-file_1%3a5.45-3+b1_amd64.deb ...
Unpacking file (1:5.45-3+b1) ...
Selecting previously unselected package gettext-base.
Preparing to unpack .../032-gettext-base_0.23.1-1_amd64.deb ...
Unpacking gettext-base (0.23.1-1) ...
Selecting previously unselected package libuchardet0:amd64.
Preparing to unpack .../033-libuchardet0_0.0.8-1+b2_amd64.deb ...
Unpacking libuchardet0:amd64 (0.0.8-1+b2) ...
Selecting previously unselected package groff-base.
Preparing to unpack .../034-groff-base_1.23.0-7_amd64.deb ...
Unpacking groff-base (1.23.0-7) ...
Selecting previously unselected package bsdextrautils.
Preparing to unpack .../035-bsdextrautils_2.40.4-5_amd64.deb ...
Unpacking bsdextrautils (2.40.4-5) ...
Selecting previously unselected package libpipeline1:amd64.
Preparing to unpack .../036-libpipeline1_1.5.8-1_amd64.deb ...
Unpacking libpipeline1:amd64 (1.5.8-1) ...
Selecting previously unselected package man-db.
Preparing to unpack .../037-man-db_2.13.0-1_amd64.deb ...
Unpacking man-db (2.13.0-1) ...
Selecting previously unselected package m4.
Preparing to unpack .../038-m4_1.4.19-7_amd64.deb ...
Unpacking m4 (1.4.19-7) ...
Selecting previously unselected package autoconf.
Preparing to unpack .../039-autoconf_2.72-3_all.deb ...
Unpacking autoconf (2.72-3) ...
Selecting previously unselected package autotools-dev.
Preparing to unpack .../040-autotools-dev_20220109.1_all.deb ...
Unpacking autotools-dev (20220109.1) ...
Selecting previously unselected package automake.
Preparing to unpack .../041-automake_1%3a1.17-3_all.deb ...
Unpacking automake (1:1.17-3) ...
Selecting previously unselected package autopoint.
Preparing to unpack .../042-autopoint_0.23.1-1_all.deb ...
Unpacking autopoint (0.23.1-1) ...
Selecting previously unselected package comerr-dev:amd64.
Preparing to unpack .../043-comerr-dev_2.1-1.47.2-1_amd64.deb ...
Unpacking comerr-dev:amd64 (2.1-1.47.2-1) ...
Selecting previously unselected package libdebhelper-perl.
Preparing to unpack .../044-libdebhelper-perl_13.24.1_all.deb ...
Unpacking libdebhelper-perl (13.24.1) ...
Selecting previously unselected package libtool.
Preparing to unpack .../045-libtool_2.5.4-3_all.deb ...
Unpacking libtool (2.5.4-3) ...
Selecting previously unselected package dh-autoreconf.
Preparing to unpack .../046-dh-autoreconf_20_all.deb ...
Unpacking dh-autoreconf (20) ...
Selecting previously unselected package libarchive-zip-perl.
Preparing to unpack .../047-libarchive-zip-perl_1.68-1_all.deb ...
Unpacking libarchive-zip-perl (1.68-1) ...
Selecting previously unselected package libfile-stripnondeterminism-perl.
Preparing to unpack .../048-libfile-stripnondeterminism-perl_1.14.1-2_all.deb ...
Unpacking libfile-stripnondeterminism-perl (1.14.1-2) ...
Selecting previously unselected package dh-strip-nondeterminism.
Preparing to unpack .../049-dh-strip-nondeterminism_1.14.1-2_all.deb ...
Unpacking dh-strip-nondeterminism (1.14.1-2) ...
Selecting previously unselected package dwz.
Preparing to unpack .../050-dwz_0.15-1+b1_amd64.deb ...
Unpacking dwz (0.15-1+b1) ...
Selecting previously unselected package libicu72:amd64.
Preparing to unpack .../051-libicu72_72.1-6_amd64.deb ...
Unpacking libicu72:amd64 (72.1-6) ...
Selecting previously unselected package libxml2:amd64.
Preparing to unpack .../052-libxml2_2.12.7+dfsg+really2.9.14-0.2+b2_amd64.deb ...
Unpacking libxml2:amd64 (2.12.7+dfsg+really2.9.14-0.2+b2) ...
Selecting previously unselected package gettext.
Preparing to unpack .../053-gettext_0.23.1-1_amd64.deb ...
Unpacking gettext (0.23.1-1) ...
Selecting previously unselected package intltool-debian.
Preparing to unpack .../054-intltool-debian_0.35.0+20060710.6_all.deb ...
Unpacking intltool-debian (0.35.0+20060710.6) ...
Selecting previously unselected package po-debconf.
Preparing to unpack .../055-po-debconf_1.0.21+nmu1_all.deb ...
Unpacking po-debconf (1.0.21+nmu1) ...
Selecting previously unselected package debhelper.
Preparing to unpack .../056-debhelper_13.24.1_all.deb ...
Unpacking debhelper (13.24.1) ...
Selecting previously unselected package freeradius-common.
Preparing to unpack .../057-freeradius-common_3.2.7+dfsg-1_all.deb ...
Unpacking freeradius-common (3.2.7+dfsg-1) ...
Selecting previously unselected package ssl-cert.
Preparing to unpack .../058-ssl-cert_1.1.3_all.deb ...
Unpacking ssl-cert (1.1.3) ...
Selecting previously unselected package freeradius-config.
Preparing to unpack .../059-freeradius-config_3.2.7+dfsg-1_amd64.deb ...
Unpacking freeradius-config (3.2.7+dfsg-1) ...
Selecting previously unselected package libdbus-1-3:amd64.
Preparing to unpack .../060-libdbus-1-3_1.16.2-1_amd64.deb ...
Unpacking libdbus-1-3:amd64 (1.16.2-1) ...
Selecting previously unselected package libpcap0.8t64:amd64.
Preparing to unpack .../061-libpcap0.8t64_1.10.5-2_amd64.deb ...
Unpacking libpcap0.8t64:amd64 (1.10.5-2) ...
Selecting previously unselected package libtalloc2:amd64.
Preparing to unpack .../062-libtalloc2_2%3a2.4.2+samba4.21.4+dfsg-1_amd64.deb ...
Unpacking libtalloc2:amd64 (2:2.4.2+samba4.21.4+dfsg-1) ...
Selecting previously unselected package libfreeradius3.
Preparing to unpack .../063-libfreeradius3_3.2.7+dfsg-1_amd64.deb ...
Unpacking libfreeradius3 (3.2.7+dfsg-1) ...
Selecting previously unselected package libffi8:amd64.
Preparing to unpack .../064-libffi8_3.4.7-1_amd64.deb ...
Unpacking libffi8:amd64 (3.4.7-1) ...
Selecting previously unselected package libp11-kit0:amd64.
Preparing to unpack .../065-libp11-kit0_0.25.5-3_amd64.deb ...
Unpacking libp11-kit0:amd64 (0.25.5-3) ...
Selecting previously unselected package libtasn1-6:amd64.
Preparing to unpack .../066-libtasn1-6_4.20.0-2_amd64.deb ...
Unpacking libtasn1-6:amd64 (4.20.0-2) ...
Selecting previously unselected package libgnutls30t64:amd64.
Preparing to unpack .../067-libgnutls30t64_3.8.9-2_amd64.deb ...
Unpacking libgnutls30t64:amd64 (3.8.9-2) ...
Selecting previously unselected package freetds-common.
Preparing to unpack .../068-freetds-common_1.3.17+ds-2_all.deb ...
Unpacking freetds-common (1.3.17+ds-2) ...
Selecting previously unselected package libct4:amd64.
Preparing to unpack .../069-libct4_1.3.17+ds-2+b5_amd64.deb ...
Unpacking libct4:amd64 (1.3.17+ds-2+b5) ...
Selecting previously unselected package libjson-c5:amd64.
Preparing to unpack .../070-libjson-c5_0.18+ds-1_amd64.deb ...
Unpacking libjson-c5:amd64 (0.18+ds-1) ...
Selecting previously unselected package libwbclient0:amd64.
Preparing to unpack .../071-libwbclient0_2%3a4.21.4+dfsg-1_amd64.deb ...
Unpacking libwbclient0:amd64 (2:4.21.4+dfsg-1) ...
Selecting previously unselected package freeradius.
Preparing to unpack .../072-freeradius_3.2.7+dfsg-1_amd64.deb ...
Unpacking freeradius (3.2.7+dfsg-1) ...
Selecting previously unselected package libevent-2.1-7t64:amd64.
Preparing to unpack .../073-libevent-2.1-7t64_2.1.12-stable-10+b1_amd64.deb ...
Unpacking libevent-2.1-7t64:amd64 (2.1.12-stable-10+b1) ...
Selecting previously unselected package libunbound8:amd64.
Preparing to unpack .../074-libunbound8_1.22.0-1+b1_amd64.deb ...
Unpacking libunbound8:amd64 (1.22.0-1+b1) ...
Selecting previously unselected package libgnutls-dane0t64:amd64.
Preparing to unpack .../075-libgnutls-dane0t64_3.8.9-2_amd64.deb ...
Unpacking libgnutls-dane0t64:amd64 (3.8.9-2) ...
Selecting previously unselected package gnutls-bin.
Preparing to unpack .../076-gnutls-bin_3.8.9-2_amd64.deb ...
Unpacking gnutls-bin (3.8.9-2) ...
Selecting previously unselected package gperf.
Preparing to unpack .../077-gperf_3.1-3_amd64.deb ...
Unpacking gperf (3.1-3) ...
Selecting previously unselected package libxau6:amd64.
Preparing to unpack .../078-libxau6_1%3a1.0.11-1_amd64.deb ...
Unpacking libxau6:amd64 (1:1.0.11-1) ...
Selecting previously unselected package libxdmcp6:amd64.
Preparing to unpack .../079-libxdmcp6_1%3a1.1.5-1_amd64.deb ...
Unpacking libxdmcp6:amd64 (1:1.1.5-1) ...
Selecting previously unselected package libxcb1:amd64.
Preparing to unpack .../080-libxcb1_1.17.0-2+b1_amd64.deb ...
Unpacking libxcb1:amd64 (1.17.0-2+b1) ...
Selecting previously unselected package libx11-data.
Preparing to unpack .../081-libx11-data_2%3a1.8.10-2_all.deb ...
Unpacking libx11-data (2:1.8.10-2) ...
Selecting previously unselected package libx11-6:amd64.
Preparing to unpack .../082-libx11-6_2%3a1.8.10-2_amd64.deb ...
Unpacking libx11-6:amd64 (2:1.8.10-2) ...
Selecting previously unselected package libxext6:amd64.
Preparing to unpack .../083-libxext6_2%3a1.3.4-1+b3_amd64.deb ...
Unpacking libxext6:amd64 (2:1.3.4-1+b3) ...
Selecting previously unselected package x11-common.
Preparing to unpack .../084-x11-common_1%3a7.7+24_all.deb ...
Unpacking x11-common (1:7.7+24) ...
Selecting previously unselected package libice6:amd64.
Preparing to unpack .../085-libice6_2%3a1.1.1-1_amd64.deb ...
Unpacking libice6:amd64 (2:1.1.1-1) ...
Selecting previously unselected package libsm6:amd64.
Preparing to unpack .../086-libsm6_2%3a1.2.4-1_amd64.deb ...
Unpacking libsm6:amd64 (2:1.2.4-1) ...
Selecting previously unselected package libxt6t64:amd64.
Preparing to unpack .../087-libxt6t64_1%3a1.2.1-1.2+b2_amd64.deb ...
Unpacking libxt6t64:amd64 (1:1.2.1-1.2+b2) ...
Selecting previously unselected package libxmu6:amd64.
Preparing to unpack .../088-libxmu6_2%3a1.1.3-3+b4_amd64.deb ...
Unpacking libxmu6:amd64 (2:1.1.3-3+b4) ...
Selecting previously unselected package libxpm4:amd64.
Preparing to unpack .../089-libxpm4_1%3a3.5.17-1+b3_amd64.deb ...
Unpacking libxpm4:amd64 (1:3.5.17-1+b3) ...
Selecting previously unselected package libxaw7:amd64.
Preparing to unpack .../090-libxaw7_2%3a1.0.16-1_amd64.deb ...
Unpacking libxaw7:amd64 (2:1.0.16-1) ...
Selecting previously unselected package groff.
Preparing to unpack .../091-groff_1.23.0-7_amd64.deb ...
Unpacking groff (1.23.0-7) ...
Selecting previously unselected package gss-ntlmssp.
Preparing to unpack .../092-gss-ntlmssp_1.2.0-1+b2_amd64.deb ...
Unpacking gss-ntlmssp (1.2.0-1+b2) ...
Selecting previously unselected package ipcalc-ng.
Preparing to unpack .../093-ipcalc-ng_1.0.3-2_amd64.deb ...
Unpacking ipcalc-ng (1.0.3-2) ...
Selecting previously unselected package libgssrpc4t64:amd64.
Preparing to unpack .../094-libgssrpc4t64_1.21.3-4_amd64.deb ...
Unpacking libgssrpc4t64:amd64 (1.21.3-4) ...
Selecting previously unselected package libkadm5clnt-mit12:amd64.
Preparing to unpack .../095-libkadm5clnt-mit12_1.21.3-4_amd64.deb ...
Unpacking libkadm5clnt-mit12:amd64 (1.21.3-4) ...
Selecting previously unselected package libkdb5-10t64:amd64.
Preparing to unpack .../096-libkdb5-10t64_1.21.3-4_amd64.deb ...
Unpacking libkdb5-10t64:amd64 (1.21.3-4) ...
Selecting previously unselected package libkadm5srv-mit12:amd64.
Preparing to unpack .../097-libkadm5srv-mit12_1.21.3-4_amd64.deb ...
Unpacking libkadm5srv-mit12:amd64 (1.21.3-4) ...
Selecting previously unselected package krb5-multidev:amd64.
Preparing to unpack .../098-krb5-multidev_1.21.3-4_amd64.deb ...
Unpacking krb5-multidev:amd64 (1.21.3-4) ...
Selecting previously unselected package libbrotli1:amd64.
Preparing to unpack .../099-libbrotli1_1.1.0-2+b7_amd64.deb ...
Unpacking libbrotli1:amd64 (1.1.0-2+b7) ...
Selecting previously unselected package libbrotli-dev:amd64.
Preparing to unpack .../100-libbrotli-dev_1.1.0-2+b7_amd64.deb ...
Unpacking libbrotli-dev:amd64 (1.1.0-2+b7) ...
Selecting previously unselected package libcap-dev:amd64.
Preparing to unpack .../101-libcap-dev_1%3a2.66-5+b1_amd64.deb ...
Unpacking libcap-dev:amd64 (1:2.66-5+b1) ...
Selecting previously unselected package libcjose0:amd64.
Preparing to unpack .../102-libcjose0_0.6.2.3-1+b1_amd64.deb ...
Unpacking libcjose0:amd64 (0.6.2.3-1+b1) ...
Selecting previously unselected package libcjose-dev.
Preparing to unpack .../103-libcjose-dev_0.6.2.3-1+b1_amd64.deb ...
Unpacking libcjose-dev (0.6.2.3-1+b1) ...
Selecting previously unselected package libsasl2-modules-db:amd64.
Preparing to unpack .../104-libsasl2-modules-db_2.1.28+dfsg1-9_amd64.deb ...
Unpacking libsasl2-modules-db:amd64 (2.1.28+dfsg1-9) ...
Selecting previously unselected package libsasl2-2:amd64.
Preparing to unpack .../105-libsasl2-2_2.1.28+dfsg1-9_amd64.deb ...
Unpacking libsasl2-2:amd64 (2.1.28+dfsg1-9) ...
Selecting previously unselected package libldap2:amd64.
Preparing to unpack .../106-libldap2_2.6.9+dfsg-1_amd64.deb ...
Unpacking libldap2:amd64 (2.6.9+dfsg-1) ...
Selecting previously unselected package libnghttp2-14:amd64.
Preparing to unpack .../107-libnghttp2-14_1.64.0-1_amd64.deb ...
Unpacking libnghttp2-14:amd64 (1.64.0-1) ...
Selecting previously unselected package libnghttp3-9:amd64.
Preparing to unpack .../108-libnghttp3-9_1.8.0-1_amd64.deb ...
Unpacking libnghttp3-9:amd64 (1.8.0-1) ...
Selecting previously unselected package libngtcp2-16:amd64.
Preparing to unpack .../109-libngtcp2-16_1.11.0-1_amd64.deb ...
Unpacking libngtcp2-16:amd64 (1.11.0-1) ...
Selecting previously unselected package libngtcp2-crypto-gnutls8:amd64.
Preparing to unpack .../110-libngtcp2-crypto-gnutls8_1.11.0-1_amd64.deb ...
Unpacking libngtcp2-crypto-gnutls8:amd64 (1.11.0-1) ...
Selecting previously unselected package libpsl5t64:amd64.
Preparing to unpack .../111-libpsl5t64_0.21.2-1.1+b1_amd64.deb ...
Unpacking libpsl5t64:amd64 (0.21.2-1.1+b1) ...
Selecting previously unselected package librtmp1:amd64.
Preparing to unpack .../112-librtmp1_2.4+20151223.gitfa8646d.1-2+b5_amd64.deb ...
Unpacking librtmp1:amd64 (2.4+20151223.gitfa8646d.1-2+b5) ...
Selecting previously unselected package libssh2-1t64:amd64.
Preparing to unpack .../113-libssh2-1t64_1.11.1-1_amd64.deb ...
Unpacking libssh2-1t64:amd64 (1.11.1-1) ...
Selecting previously unselected package libcurl3t64-gnutls:amd64.
Preparing to unpack .../114-libcurl3t64-gnutls_8.12.1-3_amd64.deb ...
Unpacking libcurl3t64-gnutls:amd64 (8.12.1-3) ...
Selecting previously unselected package libgnutls-openssl27t64:amd64.
Preparing to unpack .../115-libgnutls-openssl27t64_3.8.9-2_amd64.deb ...
Unpacking libgnutls-openssl27t64:amd64 (3.8.9-2) ...
Selecting previously unselected package libidn2-dev:amd64.
Preparing to unpack .../116-libidn2-dev_2.3.7-2+b1_amd64.deb ...
Unpacking libidn2-dev:amd64 (2.3.7-2+b1) ...
Selecting previously unselected package libp11-kit-dev:amd64.
Preparing to unpack .../117-libp11-kit-dev_0.25.5-3_amd64.deb ...
Unpacking libp11-kit-dev:amd64 (0.25.5-3) ...
Selecting previously unselected package libtasn1-6-dev:amd64.
Preparing to unpack .../118-libtasn1-6-dev_4.20.0-2_amd64.deb ...
Unpacking libtasn1-6-dev:amd64 (4.20.0-2) ...
Selecting previously unselected package libgmpxx4ldbl:amd64.
Preparing to unpack .../119-libgmpxx4ldbl_2%3a6.3.0+dfsg-3_amd64.deb ...
Unpacking libgmpxx4ldbl:amd64 (2:6.3.0+dfsg-3) ...
Selecting previously unselected package libgmp-dev:amd64.
Preparing to unpack .../120-libgmp-dev_2%3a6.3.0+dfsg-3_amd64.deb ...
Unpacking libgmp-dev:amd64 (2:6.3.0+dfsg-3) ...
Selecting previously unselected package nettle-dev:amd64.
Preparing to unpack .../121-nettle-dev_3.10.1-1_amd64.deb ...
Unpacking nettle-dev:amd64 (3.10.1-1) ...
Selecting previously unselected package libgnutls28-dev:amd64.
Preparing to unpack .../122-libgnutls28-dev_3.8.9-2_amd64.deb ...
Unpacking libgnutls28-dev:amd64 (3.8.9-2) ...
Selecting previously unselected package libkrb5-dev:amd64.
Preparing to unpack .../123-libkrb5-dev_1.21.3-4_amd64.deb ...
Unpacking libkrb5-dev:amd64 (1.21.3-4) ...
Selecting previously unselected package libldap-dev:amd64.
Preparing to unpack .../124-libldap-dev_2.6.9+dfsg-1_amd64.deb ...
Unpacking libldap-dev:amd64 (2.6.9+dfsg-1) ...
Selecting previously unselected package libpkgconf3:amd64.
Preparing to unpack .../125-libpkgconf3_1.8.1-4_amd64.deb ...
Unpacking libpkgconf3:amd64 (1.8.1-4) ...
Selecting previously unselected package pkgconf-bin.
Preparing to unpack .../126-pkgconf-bin_1.8.1-4_amd64.deb ...
Unpacking pkgconf-bin (1.8.1-4) ...
Selecting previously unselected package pkgconf:amd64.
Preparing to unpack .../127-pkgconf_1.8.1-4_amd64.deb ...
Unpacking pkgconf:amd64 (1.8.1-4) ...
Selecting previously unselected package libnghttp2-dev:amd64.
Preparing to unpack .../128-libnghttp2-dev_1.64.0-1_amd64.deb ...
Unpacking libnghttp2-dev:amd64 (1.64.0-1) ...
Selecting previously unselected package libnghttp3-dev:amd64.
Preparing to unpack .../129-libnghttp3-dev_1.8.0-1_amd64.deb ...
Unpacking libnghttp3-dev:amd64 (1.8.0-1) ...
Selecting previously unselected package libngtcp2-crypto-gnutls-dev:amd64.
Preparing to unpack .../130-libngtcp2-crypto-gnutls-dev_1.11.0-1_amd64.deb ...
Unpacking libngtcp2-crypto-gnutls-dev:amd64 (1.11.0-1) ...
Selecting previously unselected package libngtcp2-dev:amd64.
Preparing to unpack .../131-libngtcp2-dev_1.11.0-1_amd64.deb ...
Unpacking libngtcp2-dev:amd64 (1.11.0-1) ...
Selecting previously unselected package libpsl-dev:amd64.
Preparing to unpack .../132-libpsl-dev_0.21.2-1.1+b1_amd64.deb ...
Unpacking libpsl-dev:amd64 (0.21.2-1.1+b1) ...
Selecting previously unselected package zlib1g-dev:amd64.
Preparing to unpack .../133-zlib1g-dev_1%3a1.3.dfsg+really1.3.1-1+b1_amd64.deb ...
Unpacking zlib1g-dev:amd64 (1:1.3.dfsg+really1.3.1-1+b1) ...
Selecting previously unselected package librtmp-dev:amd64.
Preparing to unpack .../134-librtmp-dev_2.4+20151223.gitfa8646d.1-2+b5_amd64.deb ...
Unpacking librtmp-dev:amd64 (2.4+20151223.gitfa8646d.1-2+b5) ...
Selecting previously unselected package libssl-dev:amd64.
Preparing to unpack .../135-libssl-dev_3.4.1-1_amd64.deb ...
Unpacking libssl-dev:amd64 (3.4.1-1) ...
Selecting previously unselected package libssh2-1-dev:amd64.
Preparing to unpack .../136-libssh2-1-dev_1.11.1-1_amd64.deb ...
Unpacking libssh2-1-dev:amd64 (1.11.1-1) ...
Selecting previously unselected package libzstd-dev:amd64.
Preparing to unpack .../137-libzstd-dev_1.5.6+dfsg-2_amd64.deb ...
Unpacking libzstd-dev:amd64 (1.5.6+dfsg-2) ...
Selecting previously unselected package libcurl4-gnutls-dev:amd64.
Preparing to unpack .../138-libcurl4-gnutls-dev_8.12.1-3_amd64.deb ...
Unpacking libcurl4-gnutls-dev:amd64 (8.12.1-3) ...
Selecting previously unselected package libev4t64:amd64.
Preparing to unpack .../139-libev4t64_1%3a4.33-2.1+b1_amd64.deb ...
Unpacking libev4t64:amd64 (1:4.33-2.1+b1) ...
Selecting previously unselected package libev-dev:amd64.
Preparing to unpack .../140-libev-dev_1%3a4.33-2.1+b1_amd64.deb ...
Unpacking libev-dev:amd64 (1:4.33-2.1+b1) ...
Selecting previously unselected package libgpg-error0:amd64.
Preparing to unpack .../141-libgpg-error0_1.51-3_amd64.deb ...
Unpacking libgpg-error0:amd64 (1.51-3) ...
Selecting previously unselected package libgcrypt20:amd64.
Preparing to unpack .../142-libgcrypt20_1.11.0-7_amd64.deb ...
Unpacking libgcrypt20:amd64 (1.11.0-7) ...
Selecting previously unselected package libhttp-parser2.9:amd64.
Preparing to unpack .../143-libhttp-parser2.9_2.9.4-6+b2_amd64.deb ...
Unpacking libhttp-parser2.9:amd64 (2.9.4-6+b2) ...
Selecting previously unselected package libhttp-parser-dev:amd64.
Preparing to unpack .../144-libhttp-parser-dev_2.9.4-6+b2_amd64.deb ...
Unpacking libhttp-parser-dev:amd64 (2.9.4-6+b2) ...
Selecting previously unselected package libjansson-dev:amd64.
Preparing to unpack .../145-libjansson-dev_2.14-2+b3_amd64.deb ...
Unpacking libjansson-dev:amd64 (2.14-2+b3) ...
Selecting previously unselected package libjs-jquery.
Preparing to unpack .../146-libjs-jquery_3.6.1+dfsg+~3.5.14-1_all.deb ...
Unpacking libjs-jquery (3.6.1+dfsg+~3.5.14-1) ...
Selecting previously unselected package libxxhash-dev:amd64.
Preparing to unpack .../147-libxxhash-dev_0.8.3-2_amd64.deb ...
Unpacking libxxhash-dev:amd64 (0.8.3-2) ...
Selecting previously unselected package liblz4-dev:amd64.
Preparing to unpack .../148-liblz4-dev_1.10.0-3_amd64.deb ...
Unpacking liblz4-dev:amd64 (1.10.0-3) ...
Selecting previously unselected package libmaxminddb0:amd64.
Preparing to unpack .../149-libmaxminddb0_1.12.2-1_amd64.deb ...
Unpacking libmaxminddb0:amd64 (1.12.2-1) ...
Selecting previously unselected package libmaxminddb-dev:amd64.
Preparing to unpack .../150-libmaxminddb-dev_1.12.2-1_amd64.deb ...
Unpacking libmaxminddb-dev:amd64 (1.12.2-1) ...
Selecting previously unselected package libncurses6:amd64.
Preparing to unpack .../151-libncurses6_6.5+20250216-1_amd64.deb ...
Unpacking libncurses6:amd64 (6.5+20250216-1) ...
Selecting previously unselected package libncurses-dev:amd64.
Preparing to unpack .../152-libncurses-dev_6.5+20250216-1_amd64.deb ...
Unpacking libncurses-dev:amd64 (6.5+20250216-1) ...
Selecting previously unselected package libnl-3-200:amd64.
Preparing to unpack .../153-libnl-3-200_3.7.0-0.3+b1_amd64.deb ...
Unpacking libnl-3-200:amd64 (3.7.0-0.3+b1) ...
Selecting previously unselected package libnl-3-dev:amd64.
Preparing to unpack .../154-libnl-3-dev_3.7.0-0.3+b1_amd64.deb ...
Unpacking libnl-3-dev:amd64 (3.7.0-0.3+b1) ...
Selecting previously unselected package libnl-route-3-200:amd64.
Preparing to unpack .../155-libnl-route-3-200_3.7.0-0.3+b1_amd64.deb ...
Unpacking libnl-route-3-200:amd64 (3.7.0-0.3+b1) ...
Selecting previously unselected package libnl-route-3-dev:amd64.
Preparing to unpack .../156-libnl-route-3-dev_3.7.0-0.3+b1_amd64.deb ...
Unpacking libnl-route-3-dev:amd64 (3.7.0-0.3+b1) ...
Selecting previously unselected package libnss-wrapper:amd64.
Preparing to unpack .../157-libnss-wrapper_1.1.16-1_amd64.deb ...
Unpacking libnss-wrapper:amd64 (1.1.16-1) ...
Selecting previously unselected package liboath0t64:amd64.
Preparing to unpack .../158-liboath0t64_2.6.12-1_amd64.deb ...
Unpacking liboath0t64:amd64 (2.6.12-1) ...
Selecting previously unselected package liboath-dev:amd64.
Preparing to unpack .../159-liboath-dev_2.6.12-1_amd64.deb ...
Unpacking liboath-dev:amd64 (2.6.12-1) ...
Selecting previously unselected package libpam-wrapper:amd64.
Preparing to unpack .../160-libpam-wrapper_1.1.7-1+b1_amd64.deb ...
Unpacking libpam-wrapper:amd64 (1.1.7-1+b1) ...
Selecting previously unselected package libpam0g-dev:amd64.
Preparing to unpack .../161-libpam0g-dev_1.7.0-3_amd64.deb ...
Unpacking libpam0g-dev:amd64 (1.7.0-3) ...
Selecting previously unselected package libprotobuf-c1:amd64.
Preparing to unpack .../162-libprotobuf-c1_1.5.1-1_amd64.deb ...
Unpacking libprotobuf-c1:amd64 (1.5.1-1) ...
Selecting previously unselected package libprotobuf-c-dev:amd64.
Preparing to unpack .../163-libprotobuf-c-dev_1.5.1-1_amd64.deb ...
Unpacking libprotobuf-c-dev:amd64 (1.5.1-1) ...
Selecting previously unselected package libprotobuf32t64:amd64.
Preparing to unpack .../164-libprotobuf32t64_3.21.12-10+b6_amd64.deb ...
Unpacking libprotobuf32t64:amd64 (3.21.12-10+b6) ...
Selecting previously unselected package libprotoc32t64:amd64.
Preparing to unpack .../165-libprotoc32t64_3.21.12-10+b6_amd64.deb ...
Unpacking libprotoc32t64:amd64 (3.21.12-10+b6) ...
Selecting previously unselected package libradcli4.
Preparing to unpack .../166-libradcli4_1.2.11-1+b3_amd64.deb ...
Unpacking libradcli4 (1.2.11-1+b3) ...
Selecting previously unselected package libradcli-dev.
Preparing to unpack .../167-libradcli-dev_1.2.11-1+b3_amd64.deb ...
Unpacking libradcli-dev (1.2.11-1+b3) ...
Selecting previously unselected package libreadline-dev:amd64.
Preparing to unpack .../168-libreadline-dev_8.2-6_amd64.deb ...
Unpacking libreadline-dev:amd64 (8.2-6) ...
Selecting previously unselected package rubygems-integration.
Preparing to unpack .../169-rubygems-integration_1.19_all.deb ...
Unpacking rubygems-integration (1.19) ...
Selecting previously unselected package ruby3.3.
Preparing to unpack .../170-ruby3.3_3.3.7-1_amd64.deb ...
Unpacking ruby3.3 (3.3.7-1) ...
Selecting previously unselected package ruby-rubygems.
Preparing to unpack .../171-ruby-rubygems_3.6.3-1_all.deb ...
Unpacking ruby-rubygems (3.6.3-1) ...
Selecting previously unselected package ruby.
Preparing to unpack .../172-ruby_1%3a3.3+b1_amd64.deb ...
Unpacking ruby (1:3.3+b1) ...
Selecting previously unselected package rake.
Preparing to unpack .../173-rake_13.2.1-1_all.deb ...
Unpacking rake (13.2.1-1) ...
Selecting previously unselected package ruby-did-you-mean.
Preparing to unpack .../174-ruby-did-you-mean_1.6.3-2_all.deb ...
Unpacking ruby-did-you-mean (1.6.3-2) ...
Selecting previously unselected package ruby-minitest.
Preparing to unpack .../175-ruby-minitest_5.25.4-2_all.deb ...
Unpacking ruby-minitest (5.25.4-2) ...
Selecting previously unselected package ruby-net-telnet.
Preparing to unpack .../176-ruby-net-telnet_0.2.0-1_all.deb ...
Unpacking ruby-net-telnet (0.2.0-1) ...
Selecting previously unselected package ruby-power-assert.
Preparing to unpack .../177-ruby-power-assert_2.0.3-1_all.deb ...
Unpacking ruby-power-assert (2.0.3-1) ...
Selecting previously unselected package ruby-test-unit.
Preparing to unpack .../178-ruby-test-unit_3.6.2-1_all.deb ...
Unpacking ruby-test-unit (3.6.2-1) ...
Selecting previously unselected package ruby-webrick.
Preparing to unpack .../179-ruby-webrick_1.8.1-1_all.deb ...
Unpacking ruby-webrick (1.8.1-1) ...
Selecting previously unselected package ruby-xmlrpc.
Preparing to unpack .../180-ruby-xmlrpc_0.3.3-2_all.deb ...
Unpacking ruby-xmlrpc (0.3.3-2) ...
Selecting previously unselected package libyaml-0-2:amd64.
Preparing to unpack .../181-libyaml-0-2_0.2.5-2_amd64.deb ...
Unpacking libyaml-0-2:amd64 (0.2.5-2) ...
Selecting previously unselected package libruby3.3:amd64.
Preparing to unpack .../182-libruby3.3_3.3.7-1_amd64.deb ...
Unpacking libruby3.3:amd64 (3.3.7-1) ...
Selecting previously unselected package libruby:amd64.
Preparing to unpack .../183-libruby_1%3a3.3+b1_amd64.deb ...
Unpacking libruby:amd64 (1:3.3+b1) ...
Selecting previously unselected package libseccomp-dev:amd64.
Preparing to unpack .../184-libseccomp-dev_2.5.5-2+b1_amd64.deb ...
Unpacking libseccomp-dev:amd64 (2.5.5-2+b1) ...
Selecting previously unselected package libsocket-wrapper:amd64.
Preparing to unpack .../185-libsocket-wrapper_1.4.4-3_amd64.deb ...
Unpacking libsocket-wrapper:amd64 (1.4.4-3) ...
Selecting previously unselected package libsystemd-dev:amd64.
Preparing to unpack .../186-libsystemd-dev_257.3-1_amd64.deb ...
Unpacking libsystemd-dev:amd64 (257.3-1) ...
Selecting previously unselected package libtalloc-dev:amd64.
Preparing to unpack .../187-libtalloc-dev_2%3a2.4.2+samba4.21.4+dfsg-1_amd64.deb ...
Unpacking libtalloc-dev:amd64 (2:2.4.2+samba4.21.4+dfsg-1) ...
Selecting previously unselected package libuid-wrapper:amd64.
Preparing to unpack .../188-libuid-wrapper_1.3.1-3_amd64.deb ...
Unpacking libuid-wrapper:amd64 (1.3.1-3) ...
Selecting previously unselected package libxslt1.1:amd64.
Preparing to unpack .../189-libxslt1.1_1.1.35-1.1+b1_amd64.deb ...
Unpacking libxslt1.1:amd64 (1.1.35-1.1+b1) ...
Selecting previously unselected package libyajl2:amd64.
Preparing to unpack .../190-libyajl2_2.1.0-5+b2_amd64.deb ...
Unpacking libyajl2:amd64 (2.1.0-5+b2) ...
Selecting previously unselected package protobuf-c-compiler.
Preparing to unpack .../191-protobuf-c-compiler_1.5.1-1_amd64.deb ...
Unpacking protobuf-c-compiler (1.5.1-1) ...
Selecting previously unselected package racc.
Preparing to unpack .../192-racc_1.8.1-1_all.deb ...
Unpacking racc (1.8.1-1) ...
Selecting previously unselected package ruby-kramdown.
Preparing to unpack .../193-ruby-kramdown_2.5.1-1_all.deb ...
Unpacking ruby-kramdown (2.5.1-1) ...
Selecting previously unselected package ruby-kramdown-parser-gfm.
Preparing to unpack .../194-ruby-kramdown-parser-gfm_1.1.0-3_all.deb ...
Unpacking ruby-kramdown-parser-gfm (1.1.0-3) ...
Selecting previously unselected package ruby-mustache.
Preparing to unpack .../195-ruby-mustache_1.1.1-2_all.deb ...
Unpacking ruby-mustache (1.1.1-2) ...
Selecting previously unselected package ruby-mini-portile2.
Preparing to unpack .../196-ruby-mini-portile2_2.8.7-1_all.deb ...
Unpacking ruby-mini-portile2 (2.8.7-1) ...
Selecting previously unselected package ruby-pkg-config.
Preparing to unpack .../197-ruby-pkg-config_1.5.9-1_all.deb ...
Unpacking ruby-pkg-config (1.5.9-1) ...
Selecting previously unselected package ruby-nokogiri.
Preparing to unpack .../198-ruby-nokogiri_1.18.2+dfsg-1+b1_amd64.deb ...
Unpacking ruby-nokogiri (1.18.2+dfsg-1+b1) ...
Selecting previously unselected package ruby-ronn.
Preparing to unpack .../199-ruby-ronn_0.10.1-2_all.deb ...
Unpacking ruby-ronn (0.10.1-2) ...
Selecting previously unselected package ronn.
Preparing to unpack .../200-ronn_0.10.1-2_all.deb ...
Unpacking ronn (0.10.1-2) ...
Selecting previously unselected package tcpdump.
Preparing to unpack .../201-tcpdump_4.99.5-2_amd64.deb ...
Unpacking tcpdump (4.99.5-2) ...
Selecting previously unselected package yajl-tools.
Preparing to unpack .../202-yajl-tools_2.1.0-5+b2_amd64.deb ...
Unpacking yajl-tools (2.1.0-5+b2) ...
Setting up ipcalc-ng (1.0.3-2) ...
Setting up libpipeline1:amd64 (1.5.8-1) ...
Setting up libev4t64:amd64 (1:4.33-2.1+b1) ...
Setting up libprotobuf32t64:amd64 (3.21.12-10+b6) ...
Setting up libxau6:amd64 (1:1.0.11-1) ...
Setting up libxdmcp6:amd64 (1:1.1.5-1) ...
Setting up libseccomp-dev:amd64 (2.5.5-2+b1) ...
Setting up libkeyutils1:amd64 (1.6.3-4) ...
Setting up libxcb1:amd64 (1.17.0-2+b1) ...
Setting up libicu72:amd64 (72.1-6) ...
Setting up libzstd-dev:amd64 (1.5.6+dfsg-2) ...
Setting up bsdextrautils (2.40.4-5) ...
Setting up libgpg-error0:amd64 (1.51-3) ...
Setting up ruby-power-assert (2.0.3-1) ...
Setting up libpam0g-dev:amd64 (1.7.0-3) ...
Setting up libmagic-mgc (1:5.45-3+b1) ...
Setting up gawk (1:5.2.1-2+b1) ...
Setting up libarchive-zip-perl (1.68-1) ...
Setting up libyaml-0-2:amd64 (0.2.5-2) ...
Setting up libtirpc-common (1.3.4+ds-1.3) ...
Setting up libmaxminddb0:amd64 (1.12.2-1) ...
Setting up libdebhelper-perl (13.24.1) ...
Setting up libbrotli1:amd64 (1.1.0-2+b7) ...
Setting up libmaxminddb-dev:amd64 (1.12.2-1) ...
Setting up libmagic1t64:amd64 (1:5.45-3+b1) ...
Setting up libyajl2:amd64 (2.1.0-5+b2) ...
Setting up x11-common (1:7.7+24) ...
invoke-rc.d: could not determine current runlevel
Setting up X socket directories... /tmp/.X11-unix /tmp/.ICE-unix.
Setting up libnghttp2-14:amd64 (1.64.0-1) ...
Setting up gettext-base (0.23.1-1) ...
Setting up m4 (1.4.19-7) ...
Setting up libevent-2.1-7t64:amd64 (2.1.12-stable-10+b1) ...
Setting up libgcrypt20:amd64 (1.11.0-7) ...
Setting up ruby-mini-portile2 (2.8.7-1) ...
Setting up libsocket-wrapper:amd64 (1.4.4-3) ...
Setting up libcom-err2:amd64 (1.47.2-1) ...
Setting up file (1:5.45-3+b1) ...
Setting up libjemalloc2:amd64 (5.3.0-3) ...
Setting up libprotobuf-c1:amd64 (1.5.1-1) ...
Setting up gperf (3.1-3) ...
Setting up libwbclient0:amd64 (2:4.21.4+dfsg-1) ...
Setting up libprotobuf-c-dev:amd64 (1.5.1-1) ...
Setting up libelf1t64:amd64 (0.192-4) ...
Setting up libkrb5support0:amd64 (1.21.3-4) ...
Setting up libsasl2-modules-db:amd64 (2.1.28+dfsg1-9) ...
Setting up libcap2-bin (1:2.66-5+b1) ...
Setting up libtalloc2:amd64 (2:2.4.2+samba4.21.4+dfsg-1) ...
Setting up ruby-minitest (5.25.4-2) ...
Setting up libtalloc-dev:amd64 (2:2.4.2+samba4.21.4+dfsg-1) ...
Setting up autotools-dev (20220109.1) ...
Setting up libunbound8:amd64 (1.22.0-1+b1) ...
Setting up libpkgconf3:amd64 (1.8.1-4) ...
Setting up libgmpxx4ldbl:amd64 (2:6.3.0+dfsg-3) ...
Setting up ruby-test-unit (3.6.2-1) ...
Setting up libx11-data (2:1.8.10-2) ...
Setting up libncurses6:amd64 (6.5+20250216-1) ...
Setting up libdbus-1-3:amd64 (1.16.2-1) ...
Setting up ruby-net-telnet (0.2.0-1) ...
Setting up comerr-dev:amd64 (2.1-1.47.2-1) ...
Setting up libunistring5:amd64 (1.3-1) ...
Setting up libssl-dev:amd64 (3.4.1-1) ...
Setting up libmnl0:amd64 (1.0.5-3) ...
Setting up autopoint (0.23.1-1) ...
Setting up pkgconf-bin (1.8.1-4) ...
Setting up libk5crypto3:amd64 (1.21.3-4) ...
Setting up libxtables12:amd64 (1.8.11-2) ...
Setting up libsasl2-2:amd64 (2.1.28+dfsg1-9) ...
Setting up autoconf (2.72-3) ...
Setting up libnghttp3-9:amd64 (1.8.0-1) ...
Setting up libxxhash-dev:amd64 (0.8.3-2) ...
Setting up libnghttp3-dev:amd64 (1.8.0-1) ...
Setting up ruby-webrick (1.8.1-1) ...
Setting up zlib1g-dev:amd64 (1:1.3.dfsg+really1.3.1-1+b1) ...
Setting up libffi8:amd64 (3.4.7-1) ...
Setting up dwz (0.15-1+b1) ...
Setting up libsctp1:amd64 (1.0.21+dfsg-1) ...
Setting up sensible-utils (0.0.24) ...
Setting up libpam-wrapper:amd64 (1.1.7-1+b1) ...
Setting up libuchardet0:amd64 (0.0.8-1+b2) ...
Setting up libnl-3-200:amd64 (3.7.0-0.3+b1) ...
Setting up libtasn1-6:amd64 (4.20.0-2) ...
Setting up liblua5.4-0:amd64 (5.4.7-1+b2) ...
Setting up libpcap0.8t64:amd64 (1.10.5-2) ...
Setting up libx11-6:amd64 (2:1.8.10-2) ...
Setting up liboath0t64:amd64 (2.6.12-1) ...
Setting up libngtcp2-16:amd64 (1.11.0-1) ...
Setting up libkrb5-3:amd64 (1.21.3-4) ...
Setting up freeradius-common (3.2.7+dfsg-1) ...
useradd: Warning: missing or non-executable shell '/usr/sbin/nologin'
Setting up libev-dev:amd64 (1:4.33-2.1+b1) ...
Setting up libssh2-1t64:amd64 (1.11.1-1) ...
Setting up freetds-common (1.3.17+ds-2) ...
Setting up libjs-jquery (3.6.1+dfsg+~3.5.14-1) ...
Setting up libprotoc32t64:amd64 (3.21.12-10+b6) ...
Setting up ruby-did-you-mean (1.6.3-2) ...
Setting up libtasn1-6-dev:amd64 (4.20.0-2) ...
Setting up openssl (3.4.1-1) ...
Setting up libcap-dev:amd64 (1:2.66-5+b1) ...
Setting up libjson-c5:amd64 (0.18+ds-1) ...
Setting up libcjose0:amd64 (0.6.2.3-1+b1) ...
Setting up ruby-xmlrpc (0.3.3-2) ...
Setting up libxml2:amd64 (2.12.7+dfsg+really2.9.14-0.2+b2) ...
Setting up libnss-wrapper:amd64 (1.1.16-1) ...
Setting up libldap2:amd64 (2.6.9+dfsg-1) ...
Setting up libjansson-dev:amd64 (2.14-2+b3) ...
Setting up libsystemd-dev:amd64 (257.3-1) ...
Setting up libbrotli-dev:amd64 (1.1.0-2+b7) ...
Setting up libbpf1:amd64 (1:1.5.0-2) ...
Setting up libhttp-parser2.9:amd64 (2.9.4-6+b2) ...
Setting up libuid-wrapper:amd64 (1.3.1-3) ...
Setting up libopentracing1:amd64 (1.6.0-4+b2) ...
Setting up automake (1:1.17-3) ...
update-alternatives: using /usr/bin/automake-1.17 to provide /usr/bin/automake (automake) in auto mode
Setting up libfile-stripnondeterminism-perl (1.14.1-2) ...
Setting up libhttp-parser-dev:amd64 (2.9.4-6+b2) ...
Setting up libice6:amd64 (2:1.1.1-1) ...
Setting up tcpdump (4.99.5-2) ...
useradd: Warning: missing or non-executable shell '/usr/sbin/nologin'
Setting up libncurses-dev:amd64 (6.5+20250216-1) ...
Setting up gettext (0.23.1-1) ...
Setting up yajl-tools (2.1.0-5+b2) ...
Setting up libgmp-dev:amd64 (2:6.3.0+dfsg-3) ...
Setting up libxpm4:amd64 (1:3.5.17-1+b3) ...
Setting up nettle-dev:amd64 (3.10.1-1) ...
Setting up libtool (2.5.4-3) ...
Setting up libfreeradius3 (3.2.7+dfsg-1) ...
Setting up libxext6:amd64 (2:1.3.4-1+b3) ...
Setting up libidn2-0:amd64 (2.3.7-2+b1) ...
Setting up libngtcp2-dev:amd64 (1.11.0-1) ...
Setting up libreadline-dev:amd64 (8.2-6) ...
Setting up libcjose-dev (0.6.2.3-1+b1) ...
Setting up pkgconf:amd64 (1.8.1-4) ...
Setting up intltool-debian (0.35.0+20060710.6) ...
Setting up libnl-route-3-200:amd64 (3.7.0-0.3+b1) ...
Setting up protobuf-c-compiler (1.5.1-1) ...
Setting up dh-autoreconf (20) ...
Setting up ca-certificates (20241223) ...
Updating certificates in /etc/ssl/certs...
152 added, 0 removed; done.
Setting up ssl-cert (1.1.3) ...
Setting up libldap-dev:amd64 (2.6.9+dfsg-1) ...
Setting up libp11-kit0:amd64 (0.25.5-3) ...
Setting up libiperf0:amd64 (3.18-2) ...
Setting up libgssapi-krb5-2:amd64 (1.21.3-4) ...
Setting up liblz4-dev:amd64 (1.10.0-3) ...
Setting up freeradius-config (3.2.7+dfsg-1) ...
Generating DH parameters, 1024 bit long safe prime
........................................................+.....................................+...............................+...............................................................................................................................................................................+...+.........................................................+.........+..........................................................+..............+............................................................................+.+...........+......................................+.........................+................++*++*++*++*++*++*++*++*++*++*++*++*++*++*++*++*++*++*++*++*++*++*++*++*++*++*++*++*++*++*++*++*++*++*++*++*++*++*++*++*++*++*++*++*++*++*++*++*++*++*++*++*++*++*++*++*++*++*++*++*++*++*++*++*
Setting up libssh2-1-dev:amd64 (1.11.1-1) ...
Setting up libidn2-dev:amd64 (2.3.7-2+b1) ...
Setting up libopentracing-c-wrapper0t64:amd64 (1.1.3-3.1+b1) ...
Setting up dh-strip-nondeterminism (1.14.1-2) ...
Setting up libnl-3-dev:amd64 (3.7.0-0.3+b1) ...
Setting up groff-base (1.23.0-7) ...
Setting up liboath-dev:amd64 (2.6.12-1) ...
Setting up libxslt1.1:amd64 (1.1.35-1.1+b1) ...
Setting up libsm6:amd64 (2:1.2.4-1) ...
Setting up iputils-ping (3:20240905-1) ...
Setting up libp11-kit-dev:amd64 (0.25.5-3) ...
Setting up libgnutls30t64:amd64 (3.8.9-2) ...
Setting up libgnutls-openssl27t64:amd64 (3.8.9-2) ...
Setting up libnghttp2-dev:amd64 (1.64.0-1) ...
Setting up gss-ntlmssp (1.2.0-1+b2) ...
Setting up libtirpc3t64:amd64 (1.3.4+ds-1.3+b1) ...
Setting up iperf3 (3.18-2) ...
useradd: Warning: missing or non-executable shell '/usr/sbin/nologin'
Setting up iproute2 (6.13.0-1) ...
Setting up po-debconf (1.0.21+nmu1) ...
Setting up libpsl5t64:amd64 (0.21.2-1.1+b1) ...
Setting up haproxy (3.0.8-1) ...
useradd: Warning: missing or non-executable shell '/usr/sbin/nologin'
invoke-rc.d: could not determine current runlevel
invoke-rc.d: policy-rc.d denied execution of start.
Setting up rubygems-integration (1.19) ...
Setting up man-db (2.13.0-1) ...
Not building database; man-db/auto-update is not 'true'.
Setting up libpsl-dev:amd64 (0.21.2-1.1+b1) ...
Setting up libnl-route-3-dev:amd64 (3.7.0-0.3+b1) ...
Setting up libgnutls-dane0t64:amd64 (3.8.9-2) ...
Setting up libct4:amd64 (1.3.17+ds-2+b5) ...
Setting up librtmp1:amd64 (2.4+20151223.gitfa8646d.1-2+b5) ...
Setting up libradcli4 (1.2.11-1+b3) ...
Setting up libgssrpc4t64:amd64 (1.21.3-4) ...
Setting up libxt6t64:amd64 (1:1.2.1-1.2+b2) ...
Setting up libngtcp2-crypto-gnutls8:amd64 (1.11.0-1) ...
Setting up libkadm5clnt-mit12:amd64 (1.21.3-4) ...
Setting up freeradius (3.2.7+dfsg-1) ...
update-rc.d: warning: start and stop actions are no longer supported; falling back to defaults
invoke-rc.d: could not determine current runlevel
invoke-rc.d: policy-rc.d denied execution of start.
Setting up gnutls-bin (3.8.9-2) ...
Setting up libgnutls28-dev:amd64 (3.8.9-2) ...
Setting up libxmu6:amd64 (2:1.1.3-3+b4) ...
Setting up libkdb5-10t64:amd64 (1.21.3-4) ...
Setting up libradcli-dev (1.2.11-1+b3) ...
Setting up libcurl3t64-gnutls:amd64 (8.12.1-3) ...
Setting up debhelper (13.24.1) ...
Setting up libngtcp2-crypto-gnutls-dev:amd64 (1.11.0-1) ...
Setting up libxaw7:amd64 (2:1.0.16-1) ...
Setting up groff (1.23.0-7) ...
Setting up librtmp-dev:amd64 (2.4+20151223.gitfa8646d.1-2+b5) ...
Setting up libkadm5srv-mit12:amd64 (1.21.3-4) ...
Setting up krb5-multidev:amd64 (1.21.3-4) ...
Setting up libkrb5-dev:amd64 (1.21.3-4) ...
Setting up libcurl4-gnutls-dev:amd64 (8.12.1-3) ...
Setting up rake (13.2.1-1) ...
Setting up libruby3.3:amd64 (3.3.7-1) ...
Setting up ruby-rubygems (3.6.3-1) ...
Setting up ruby3.3 (3.3.7-1) ...
Setting up libruby:amd64 (1:3.3+b1) ...
Setting up ruby (1:3.3+b1) ...
Setting up racc (1.8.1-1) ...
Setting up ruby-pkg-config (1.5.9-1) ...
Setting up ruby-mustache (1.1.1-2) ...
Setting up ruby-kramdown (2.5.1-1) ...
Setting up ruby-nokogiri (1.18.2+dfsg-1+b1) ...
Setting up ruby-kramdown-parser-gfm (1.1.0-3) ...
Setting up ruby-ronn (0.10.1-2) ...
Setting up ronn (0.10.1-2) ...
Processing triggers for libc-bin (2.40-7) ...
Processing triggers for ca-certificates (20241223) ...
Updating certificates in /etc/ssl/certs...
0 added, 0 removed; done.
Running hooks in /etc/ca-certificates/update.d...
done.
Reading package lists...
Building dependency tree...
Reading state information...
Reading extended state information...
Initializing package states...
Writing extended state information...
Building tag database...
 -> Finished parsing the build-deps
Reading package lists...
Building dependency tree...
Reading state information...
fakeroot is already the newest version (1.37-1).
0 upgraded, 0 newly installed, 0 to remove and 0 not upgraded.
I: Building the package
I: Running cd /build/reproducible-path/ocserv-1.3.0/ && env PATH="/usr/sbin:/usr/bin:/sbin:/bin:/usr/games" HOME="/nonexistent/first-build" dpkg-buildpackage -us -uc -b && env PATH="/usr/sbin:/usr/bin:/sbin:/bin:/usr/games" HOME="/nonexistent/first-build" dpkg-genchanges -S  > ../ocserv_1.3.0-1_source.changes
dpkg-buildpackage: info: source package ocserv
dpkg-buildpackage: info: source version 1.3.0-1
dpkg-buildpackage: info: source distribution unstable
dpkg-buildpackage: info: source changed by Shengqi Chen <harry-chen@outlook.com>
 dpkg-source --before-build .
dpkg-buildpackage: info: host architecture amd64
 debian/rules clean
dh clean
   dh_clean
 debian/rules binary
dh binary
   dh_update_autotools_config
   dh_autoreconf
   debian/rules override_dh_auto_configure
make[1]: Entering directory '/build/reproducible-path/ocserv-1.3.0'
dh_auto_configure -- --disable-rpath --disable-silent-rules \
    --enable-latency-stats \
    --without-nuttcp-tests --without-docker-tests \
    --enable-systemd
	./configure --build=x86_64-linux-gnu --prefix=/usr --includedir=\${prefix}/include --mandir=\${prefix}/share/man --infodir=\${prefix}/share/info --sysconfdir=/etc --localstatedir=/var --disable-option-checking --disable-silent-rules --libdir=\${prefix}/lib/x86_64-linux-gnu --runstatedir=/run --disable-maintainer-mode --disable-dependency-tracking --disable-rpath --disable-silent-rules --enable-latency-stats --without-nuttcp-tests --without-docker-tests --enable-systemd
checking for pkg-config... /usr/bin/pkg-config
checking pkg-config is at least version 0.9.0... yes
checking for a BSD-compatible install... /usr/bin/install -c
checking whether sleep supports fractional seconds... yes
checking filesystem timestamp resolution... 0.01
checking whether build environment is sane... yes
checking for a race-free mkdir -p... /usr/bin/mkdir -p
checking for gawk... gawk
checking whether make sets $(MAKE)... yes
checking whether make supports nested variables... yes
checking xargs -n works... yes
checking whether make supports the include directive... yes (GNU style)
checking for gcc... gcc
checking whether the C compiler works... yes
checking for C compiler default output file name... a.out
checking for suffix of executables... 
checking whether we are cross compiling... no
checking for suffix of object files... o
checking whether the compiler supports GNU C... yes
checking whether gcc accepts -g... yes
checking for gcc option to enable C11 features... none needed
checking whether gcc understands -c and -o together... yes
checking dependency style of gcc... none
checking for stdio.h... yes
checking for stdlib.h... yes
checking for string.h... yes
checking for inttypes.h... yes
checking for stdint.h... yes
checking for strings.h... yes
checking for sys/stat.h... yes
checking for sys/types.h... yes
checking for unistd.h... yes
checking for wchar.h... yes
checking for minix/config.h... no
checking whether it is safe to define __EXTENSIONS__... yes
checking whether _XOPEN_SOURCE should be defined... no
checking for gcc... (cached) gcc
checking whether the compiler supports GNU C... (cached) yes
checking whether gcc accepts -g... (cached) yes
checking for gcc option to enable C11 features... (cached) none needed
checking whether gcc understands -c and -o together... (cached) yes
checking dependency style of gcc... (cached) none
checking for ranlib... ranlib
checking for ar... ar
checking the archiver (ar) interface... ar
checking for a sed that does not truncate output... /usr/bin/sed
checking for ipcalc... no
checking for ipcalc-ng... ipcalc-ng
checking for ctags... :
checking for cscope... :
checking for ronn... ronn
checking whether to enable maintainer-specific portions of Makefiles... no
checking whether to build with code coverage support... no
checking for sighandler_t... yes
checking for sig_t... yes
checking for __sighandler_t... yes
checking for struct ucred... yes
checking for struct iphdr.ihl... yes
checking size of unsigned long... 8
checking whether byte ordering is bigendian... no
checking for nettle >= 2.7... yes
checking for gnutls >= 3.3.0... yes
checking build system type... x86_64-pc-linux-gnu
checking host system type... x86_64-pc-linux-gnu
checking for ld used by gcc... /usr/bin/ld
checking if the linker (/usr/bin/ld) is GNU ld... yes
checking for shared library run path origin... done
checking 32-bit host C ABI... no
checking how to run the C preprocessor... gcc -E
checking for egrep -e... /usr/bin/grep -E
checking for ELF binary format... yes
checking for the common suffixes of directories in the library search path... lib,lib,lib64
checking for libprotobuf-c... yes
checking for libev... yes
checking how to link with libev... /usr/lib/x86_64-linux-gnu/libev.so
checking whether to enable broken in asan tests... yes
checking for talloc... yes
checking for libnl-route-3.0 >= 3.1... yes
checking for libmaxminddb >= 1.0.0... yes
checking for libreadline... yes
checking how to link with libreadline... /usr/lib/x86_64-linux-gnu/libreadline.so
checking for liboath... yes
checking for libc... yes
checking how to link with libc... /usr/lib/x86_64-linux-gnu/libc.a
checking for pam library... yes
checking for uid_wrapper, socket_wrapper... yes
checking for pam_wrapper... yes
checking for nss_wrapper... yes
checking for radcli >= 1.2.5... yes
checking for net/if_tun.h... no
checking for linux/if_tun.h... yes
checking for netinet/in_systm.h... yes
checking for crypt.h... yes
checking for libcrypt... yes
checking how to link with libcrypt... /usr/lib/x86_64-linux-gnu/libcrypt.so
od: cannot skip past end of combined input
checking for libutil... yes
checking how to link with libutil... -lutil
checking for libwrap... no
checking for struct sockaddr.sa_len... no
checking for setproctitle... no
checking for vasprintf... yes
checking for clock_gettime... yes
checking for isatty... yes
checking for pselect... yes
checking for ppoll... yes
checking for getpeereid... no
checking for sigaltstack... yes
checking for strlcpy... yes
checking for posix_memalign... yes
checking for malloc_trim... yes
checking for strsep... yes
checking for libseccomp... yes
checking how to link with libseccomp... /usr/lib/x86_64-linux-gnu/libseccomp.so
checking for libsystemd... yes
checking how to link with libsystemd... /usr/lib/x86_64-linux-gnu/libsystemd.so
checking for llhttp library... no
configure: WARNING:
***
*** libhttp-parser not found.
*** An included version of the library will be used.
*** 
checking for liblz4... yes
checking for krb5-gssapi... yes
checking for libtasn1 >= 3.4... yes
checking for working volatile... yes
checking for an ANSI C-conforming const... yes
checking for memset... yes
checking for malloc... yes
checking for free... yes
checking for makecontext... yes
checking for getcontext... yes
checking for swapcontext... yes
checking for sigaction... yes
checking for longjmp... yes
checking for setjmp... yes
checking for sigaltstack... (cached) yes
checking for linux/net_tstamp.h... yes
checking for struct scm_timestamping... yes
ar: /usr/lib/x86_64-linux-gnu/libm.a: file format not recognized
od: cannot skip past end of combined input
checking for libm... yes
checking how to link with libm... -lm
checking for linux/netlink.h... yes
checking for linux/rtnetlink.h... yes
checking for linux/sock_diag.h... yes
checking for linux/unix_diag.h... yes
checking for pcl library... no
configure: WARNING:
***
*** libpcl (portable co-routines) was not found.
*** An included version of the library will be used.
*** 
checking for /proc/self/exe... yes
checking that generated files are newer than configure... done
configure: creating ./config.status
config.status: creating Makefile
config.status: creating src/version.inc
config.status: creating src/Makefile
config.status: creating doc/Makefile
config.status: creating tests/data/pam/ocserv
config.status: creating tests/data/pam/nss-passwd
config.status: creating tests/data/pam/nss-group
config.status: creating tests/data/raddb/radiusd.conf
config.status: creating tests/Makefile
config.status: creating config.h
config.status: executing depfiles commands
configure:
Summary of build options:
  version:              1.3.0
  Host type:            x86_64-pc-linux-gnu
  Install prefix:       /usr
  Compiler:             gcc
  CFlags:               -g -O2 -Werror=implicit-function-declaration -ffile-prefix-map=/build/reproducible-path/ocserv-1.3.0=. -fstack-protector-strong -fstack-clash-protection -Wformat -Werror=format-security -fcf-protection -Wall -Wno-strict-aliasing -Wextra -Wno-unused-parameter -Wno-sign-compare -Wno-missing-field-initializers -Wno-implicit-fallthrough -Wno-stringop-truncation
  CWrap testing:        yes
  CWrap PAM testing:    yes
  CWrap NSS testing:    yes

  PAM auth backend:     yes
  Radius auth backend:  radcli
  GSSAPI auth backend:  yes
  OIDC Auth backend:    no
  Anyconnect compat:    yes
  TCP wrappers:         no
  namespaces:           yes
  systemd:              yes
  (socket activation)
  worker isolation:     seccomp
  Compression:          yes
  LZ4 compression:      yes
  readline:             yes
  libnl3:               yes
  liboath:              yes
  libgeoip:             no
  libmaxminddb:         yes
  glibc (sha2crypt):    yes
  local talloc:         no
  local protobuf-c:     no
  local PCL library:    yes
  local llhttp:         yes
  seccomp trap:		no
  capture latency stats yes

make[1]: Leaving directory '/build/reproducible-path/ocserv-1.3.0'
   dh_auto_build
	make -j42
make[1]: Entering directory '/build/reproducible-path/ocserv-1.3.0'
make  all-recursive
make[2]: Entering directory '/build/reproducible-path/ocserv-1.3.0'
Making all in src
make[3]: Entering directory '/build/reproducible-path/ocserv-1.3.0/src'
make  all-am
make[4]: Entering directory '/build/reproducible-path/ocserv-1.3.0/src'
gcc -DHAVE_CONFIG_H -I. -I..   -I../src/llhttp/  -I./ -I./../ -I./../ -I/usr/include/p11-kit-1  -I./common -I./common       -I/usr/include/liboath  -isystem /usr/include/mit-krb5   -I/usr/include/p11-kit-1    -I./pcl/  -I./common -Wdate-time -D_FORTIFY_SOURCE=2  -g -O2 -Werror=implicit-function-declaration -ffile-prefix-map=/build/reproducible-path/ocserv-1.3.0=. -fstack-protector-strong -fstack-clash-protection -Wformat -Werror=format-security -fcf-protection -Wall -Wno-strict-aliasing -Wextra -Wno-unused-parameter -Wno-sign-compare -Wno-missing-field-initializers -Wno-implicit-fallthrough -Wno-stringop-truncation -c -o libcommon_a-log.o `test -f 'log.c' || echo './'`log.c
gcc -DHAVE_CONFIG_H -I. -I..   -I../src/llhttp/  -I./ -I./../ -I./../ -I/usr/include/p11-kit-1  -I./common -I./common       -I/usr/include/liboath  -isystem /usr/include/mit-krb5   -I/usr/include/p11-kit-1    -I./pcl/  -Wdate-time -D_FORTIFY_SOURCE=2  -g -O2 -Werror=implicit-function-declaration -ffile-prefix-map=/build/reproducible-path/ocserv-1.3.0=. -fstack-protector-strong -fstack-clash-protection -Wformat -Werror=format-security -fcf-protection -Wall -Wno-strict-aliasing -Wextra -Wno-unused-parameter -Wno-sign-compare -Wno-missing-field-initializers -Wno-implicit-fallthrough -Wno-stringop-truncation -c -o ctl.pb-c.o ctl.pb-c.c
gcc -DHAVE_CONFIG_H -I. -I..   -I../src/llhttp/  -I./ -I./../ -I./../ -I/usr/include/p11-kit-1  -I./common -I./common       -I/usr/include/liboath  -isystem /usr/include/mit-krb5   -I/usr/include/p11-kit-1    -I./pcl/  -Wdate-time -D_FORTIFY_SOURCE=2  -g -O2 -Werror=implicit-function-declaration -ffile-prefix-map=/build/reproducible-path/ocserv-1.3.0=. -fstack-protector-strong -fstack-clash-protection -Wformat -Werror=format-security -fcf-protection -Wall -Wno-strict-aliasing -Wextra -Wno-unused-parameter -Wno-sign-compare -Wno-missing-field-initializers -Wno-implicit-fallthrough -Wno-stringop-truncation -c -o ipc.pb-c.o ipc.pb-c.c
gcc -DHAVE_CONFIG_H -I. -I..   -I../src/llhttp/  -I./ -I./../ -I./../ -I/usr/include/p11-kit-1  -I./common -I./common       -I/usr/include/liboath  -isystem /usr/include/mit-krb5   -I/usr/include/p11-kit-1    -I./pcl/  -Wdate-time -D_FORTIFY_SOURCE=2  -g -O2 -Werror=implicit-function-declaration -ffile-prefix-map=/build/reproducible-path/ocserv-1.3.0=. -fstack-protector-strong -fstack-clash-protection -Wformat -Werror=format-security -fcf-protection -Wall -Wno-strict-aliasing -Wextra -Wno-unused-parameter -Wno-sign-compare -Wno-missing-field-initializers -Wno-implicit-fallthrough -Wno-stringop-truncation -c -o common/hmac.o common/hmac.c
gcc -DHAVE_CONFIG_H -I. -I..   -I../src/llhttp/  -I./ -I./../ -I./../ -I/usr/include/p11-kit-1  -I./common -I./common       -I/usr/include/liboath  -isystem /usr/include/mit-krb5   -I/usr/include/p11-kit-1    -I./pcl/  -Wdate-time -D_FORTIFY_SOURCE=2  -g -O2 -Werror=implicit-function-declaration -ffile-prefix-map=/build/reproducible-path/ocserv-1.3.0=. -fstack-protector-strong -fstack-clash-protection -Wformat -Werror=format-security -fcf-protection -Wall -Wno-strict-aliasing -Wextra -Wno-unused-parameter -Wno-sign-compare -Wno-missing-field-initializers -Wno-implicit-fallthrough -Wno-stringop-truncation -c -o common/snapshot.o common/snapshot.c
gcc -DHAVE_CONFIG_H -I. -I..   -I../src/llhttp/  -I./ -I./../ -I./../ -I/usr/include/p11-kit-1  -I./common -I./common       -I/usr/include/liboath  -isystem /usr/include/mit-krb5   -I/usr/include/p11-kit-1    -I./pcl/  -Wdate-time -D_FORTIFY_SOURCE=2  -g -O2 -Werror=implicit-function-declaration -ffile-prefix-map=/build/reproducible-path/ocserv-1.3.0=. -fstack-protector-strong -fstack-clash-protection -Wformat -Werror=format-security -fcf-protection -Wall -Wno-strict-aliasing -Wextra -Wno-unused-parameter -Wno-sign-compare -Wno-missing-field-initializers -Wno-implicit-fallthrough -Wno-stringop-truncation -c -o config.o config.c
gcc -DHAVE_CONFIG_H -I. -I..   -I../src/llhttp/  -I./ -I./../ -I./../ -I/usr/include/p11-kit-1  -I./common -I./common       -I/usr/include/liboath  -isystem /usr/include/mit-krb5   -I/usr/include/p11-kit-1    -I./pcl/  -Wdate-time -D_FORTIFY_SOURCE=2  -g -O2 -Werror=implicit-function-declaration -ffile-prefix-map=/build/reproducible-path/ocserv-1.3.0=. -fstack-protector-strong -fstack-clash-protection -Wformat -Werror=format-security -fcf-protection -Wall -Wno-strict-aliasing -Wextra -Wno-unused-parameter -Wno-sign-compare -Wno-missing-field-initializers -Wno-implicit-fallthrough -Wno-stringop-truncation -c -o config-kkdcp.o config-kkdcp.c
gcc -DHAVE_CONFIG_H -I. -I..   -I../src/llhttp/  -I./ -I./../ -I./../ -I/usr/include/p11-kit-1  -I./common -I./common       -I/usr/include/liboath  -isystem /usr/include/mit-krb5   -I/usr/include/p11-kit-1    -I./pcl/  -Wdate-time -D_FORTIFY_SOURCE=2  -g -O2 -Werror=implicit-function-declaration -ffile-prefix-map=/build/reproducible-path/ocserv-1.3.0=. -fstack-protector-strong -fstack-clash-protection -Wformat -Werror=format-security -fcf-protection -Wall -Wno-strict-aliasing -Wextra -Wno-unused-parameter -Wno-sign-compare -Wno-missing-field-initializers -Wno-implicit-fallthrough -Wno-stringop-truncation -c -o config-ports.o config-ports.c
gcc -DHAVE_CONFIG_H -I. -I..   -I../src/llhttp/  -I./ -I./../ -I./../ -I/usr/include/p11-kit-1  -I./common -I./common       -I/usr/include/liboath  -isystem /usr/include/mit-krb5   -I/usr/include/p11-kit-1    -I./pcl/  -Wdate-time -D_FORTIFY_SOURCE=2  -g -O2 -Werror=implicit-function-declaration -ffile-prefix-map=/build/reproducible-path/ocserv-1.3.0=. -fstack-protector-strong -fstack-clash-protection -Wformat -Werror=format-security -fcf-protection -Wall -Wno-strict-aliasing -Wextra -Wno-unused-parameter -Wno-sign-compare -Wno-missing-field-initializers -Wno-implicit-fallthrough -Wno-stringop-truncation -c -o ip-util.o ip-util.c
gcc -DHAVE_CONFIG_H -I. -I..   -I../src/llhttp/  -I./ -I./../ -I./../ -I/usr/include/p11-kit-1  -I./common -I./common       -I/usr/include/liboath  -isystem /usr/include/mit-krb5   -I/usr/include/p11-kit-1    -I./pcl/  -Wdate-time -D_FORTIFY_SOURCE=2  -g -O2 -Werror=implicit-function-declaration -ffile-prefix-map=/build/reproducible-path/ocserv-1.3.0=. -fstack-protector-strong -fstack-clash-protection -Wformat -Werror=format-security -fcf-protection -Wall -Wno-strict-aliasing -Wextra -Wno-unused-parameter -Wno-sign-compare -Wno-missing-field-initializers -Wno-implicit-fallthrough -Wno-stringop-truncation -c -o setproctitle.o setproctitle.c
gcc -DHAVE_CONFIG_H -I. -I..   -I../src/llhttp/  -I./ -I./../ -I./../ -I/usr/include/p11-kit-1  -I./common -I./common       -I/usr/include/liboath  -isystem /usr/include/mit-krb5   -I/usr/include/p11-kit-1    -I./pcl/  -Wdate-time -D_FORTIFY_SOURCE=2  -g -O2 -Werror=implicit-function-declaration -ffile-prefix-map=/build/reproducible-path/ocserv-1.3.0=. -fstack-protector-strong -fstack-clash-protection -Wformat -Werror=format-security -fcf-protection -Wall -Wno-strict-aliasing -Wextra -Wno-unused-parameter -Wno-sign-compare -Wno-missing-field-initializers -Wno-implicit-fallthrough -Wno-stringop-truncation -c -o str.o str.c
gcc -DHAVE_CONFIG_H -I. -I..   -I../src/llhttp/  -I./ -I./../ -I./../ -I/usr/include/p11-kit-1  -I./common -I./common       -I/usr/include/liboath  -isystem /usr/include/mit-krb5   -I/usr/include/p11-kit-1    -I./pcl/  -Wdate-time -D_FORTIFY_SOURCE=2  -g -O2 -Werror=implicit-function-declaration -ffile-prefix-map=/build/reproducible-path/ocserv-1.3.0=. -fstack-protector-strong -fstack-clash-protection -Wformat -Werror=format-security -fcf-protection -Wall -Wno-strict-aliasing -Wextra -Wno-unused-parameter -Wno-sign-compare -Wno-missing-field-initializers -Wno-implicit-fallthrough -Wno-stringop-truncation -c -o subconfig.o subconfig.c
gcc -DHAVE_CONFIG_H -I. -I..   -I../src/llhttp/  -I./ -I./../ -I./../ -I/usr/include/p11-kit-1  -I./common -I./common       -I/usr/include/liboath  -isystem /usr/include/mit-krb5   -I/usr/include/p11-kit-1    -I./pcl/  -Wdate-time -D_FORTIFY_SOURCE=2  -g -O2 -Werror=implicit-function-declaration -ffile-prefix-map=/build/reproducible-path/ocserv-1.3.0=. -fstack-protector-strong -fstack-clash-protection -Wformat -Werror=format-security -fcf-protection -Wall -Wno-strict-aliasing -Wextra -Wno-unused-parameter -Wno-sign-compare -Wno-missing-field-initializers -Wno-implicit-fallthrough -Wno-stringop-truncation -c -o tlslib.o tlslib.c
gcc -DHAVE_CONFIG_H -I. -I..   -I../src/llhttp/  -I./ -I./../ -I./../ -I/usr/include/p11-kit-1  -I./common -I./common       -I/usr/include/liboath  -isystem /usr/include/mit-krb5   -I/usr/include/p11-kit-1    -I./pcl/  -Wdate-time -D_FORTIFY_SOURCE=2  -g -O2 -Werror=implicit-function-declaration -ffile-prefix-map=/build/reproducible-path/ocserv-1.3.0=. -fstack-protector-strong -fstack-clash-protection -Wformat -Werror=format-security -fcf-protection -Wall -Wno-strict-aliasing -Wextra -Wno-unused-parameter -Wno-sign-compare -Wno-missing-field-initializers -Wno-implicit-fallthrough -Wno-stringop-truncation -c -o valid-hostname.o valid-hostname.c
gcc -DHAVE_CONFIG_H -I. -I..   -I../src/llhttp/  -I./ -I./../ -I./../ -I/usr/include/p11-kit-1  -I./common -I./common       -I/usr/include/liboath  -isystem /usr/include/mit-krb5   -I/usr/include/p11-kit-1    -I./pcl/  -Wdate-time -D_FORTIFY_SOURCE=2  -g -O2 -Werror=implicit-function-declaration -ffile-prefix-map=/build/reproducible-path/ocserv-1.3.0=. -fstack-protector-strong -fstack-clash-protection -Wformat -Werror=format-security -fcf-protection -Wall -Wno-strict-aliasing -Wextra -Wno-unused-parameter -Wno-sign-compare -Wno-missing-field-initializers -Wno-implicit-fallthrough -Wno-stringop-truncation -c -o vasprintf.o vasprintf.c
gcc -DHAVE_CONFIG_H -I. -I..   -I../src/llhttp/  -I./ -I./../ -I./../ -I/usr/include/p11-kit-1  -I./common -I./common       -I/usr/include/liboath  -isystem /usr/include/mit-krb5   -I/usr/include/p11-kit-1    -I./pcl/  -Wdate-time -D_FORTIFY_SOURCE=2  -g -O2 -Werror=implicit-function-declaration -ffile-prefix-map=/build/reproducible-path/ocserv-1.3.0=. -fstack-protector-strong -fstack-clash-protection -Wformat -Werror=format-security -fcf-protection -Wall -Wno-strict-aliasing -Wextra -Wno-unused-parameter -Wno-sign-compare -Wno-missing-field-initializers -Wno-implicit-fallthrough -Wno-stringop-truncation -c -o worker-log.o worker-log.c
gcc -DHAVE_CONFIG_H -I. -I..   -I../src/llhttp/  -I./ -I./../ -I./../ -I/usr/include/p11-kit-1  -I./common -I./common       -I/usr/include/liboath  -isystem /usr/include/mit-krb5   -I/usr/include/p11-kit-1    -I./pcl/  -Wdate-time -D_FORTIFY_SOURCE=2  -g -O2 -Werror=implicit-function-declaration -ffile-prefix-map=/build/reproducible-path/ocserv-1.3.0=. -fstack-protector-strong -fstack-clash-protection -Wformat -Werror=format-security -fcf-protection -Wall -Wno-strict-aliasing -Wextra -Wno-unused-parameter -Wno-sign-compare -Wno-missing-field-initializers -Wno-implicit-fallthrough -Wno-stringop-truncation -c -o lzs.o lzs.c
gcc -DHAVE_CONFIG_H -I. -I..   -I../src/llhttp/  -I./ -I./../ -I./../ -I/usr/include/p11-kit-1  -I./common -I./common       -I/usr/include/liboath  -isystem /usr/include/mit-krb5   -I/usr/include/p11-kit-1    -I./pcl/  -Wdate-time -D_FORTIFY_SOURCE=2  -g -O2 -Werror=implicit-function-declaration -ffile-prefix-map=/build/reproducible-path/ocserv-1.3.0=. -fstack-protector-strong -fstack-clash-protection -Wformat -Werror=format-security -fcf-protection -Wall -Wno-strict-aliasing -Wextra -Wno-unused-parameter -Wno-sign-compare -Wno-missing-field-initializers -Wno-implicit-fallthrough -Wno-stringop-truncation -c -o kkdcp_asn1_tab.o kkdcp_asn1_tab.c
gcc -DHAVE_CONFIG_H -I. -I..   -I../src/llhttp/  -I./ -I./../ -I./../ -I/usr/include/p11-kit-1  -I./common -I./common       -I/usr/include/liboath  -isystem /usr/include/mit-krb5   -I/usr/include/p11-kit-1    -I./pcl/  -Wdate-time -D_FORTIFY_SOURCE=2  -g -O2 -Werror=implicit-function-declaration -ffile-prefix-map=/build/reproducible-path/ocserv-1.3.0=. -fstack-protector-strong -fstack-clash-protection -Wformat -Werror=format-security -fcf-protection -Wall -Wno-strict-aliasing -Wextra -Wno-unused-parameter -Wno-sign-compare -Wno-missing-field-initializers -Wno-implicit-fallthrough -Wno-stringop-truncation -c -o auth-unix.o auth-unix.c
gcc -DHAVE_CONFIG_H -I. -I..   -I../src/llhttp/  -I./ -I./../ -I./../ -I/usr/include/p11-kit-1  -I./common -I./common       -I/usr/include/liboath  -isystem /usr/include/mit-krb5   -I/usr/include/p11-kit-1    -I./pcl/  -Wdate-time -D_FORTIFY_SOURCE=2  -g -O2 -Werror=implicit-function-declaration -ffile-prefix-map=/build/reproducible-path/ocserv-1.3.0=. -fstack-protector-strong -fstack-clash-protection -Wformat -Werror=format-security -fcf-protection -Wall -Wno-strict-aliasing -Wextra -Wno-unused-parameter -Wno-sign-compare -Wno-missing-field-initializers -Wno-implicit-fallthrough -Wno-stringop-truncation -c -o main.o main.c
gcc -DHAVE_CONFIG_H -I. -I..   -I../src/llhttp/  -I./ -I./../ -I./../ -I/usr/include/p11-kit-1  -I./common -I./common       -I/usr/include/liboath  -isystem /usr/include/mit-krb5   -I/usr/include/p11-kit-1    -I./pcl/  -Wdate-time -D_FORTIFY_SOURCE=2  -g -O2 -Werror=implicit-function-declaration -ffile-prefix-map=/build/reproducible-path/ocserv-1.3.0=. -fstack-protector-strong -fstack-clash-protection -Wformat -Werror=format-security -fcf-protection -Wall -Wno-strict-aliasing -Wextra -Wno-unused-parameter -Wno-sign-compare -Wno-missing-field-initializers -Wno-implicit-fallthrough -Wno-stringop-truncation -c -o main-auth.o main-auth.c
gcc -DHAVE_CONFIG_H -I. -I..   -I../src/llhttp/  -I./ -I./../ -I./../ -I/usr/include/p11-kit-1  -I./common -I./common       -I/usr/include/liboath  -isystem /usr/include/mit-krb5   -I/usr/include/p11-kit-1    -I./pcl/  -Wdate-time -D_FORTIFY_SOURCE=2  -g -O2 -Werror=implicit-function-declaration -ffile-prefix-map=/build/reproducible-path/ocserv-1.3.0=. -fstack-protector-strong -fstack-clash-protection -Wformat -Werror=format-security -fcf-protection -Wall -Wno-strict-aliasing -Wextra -Wno-unused-parameter -Wno-sign-compare -Wno-missing-field-initializers -Wno-implicit-fallthrough -Wno-stringop-truncation -c -o main-ban.o main-ban.c
gcc -DHAVE_CONFIG_H -I. -I..   -I../src/llhttp/  -I./ -I./../ -I./../ -I/usr/include/p11-kit-1  -I./common -I./common       -I/usr/include/liboath  -isystem /usr/include/mit-krb5   -I/usr/include/p11-kit-1    -I./pcl/  -Wdate-time -D_FORTIFY_SOURCE=2  -g -O2 -Werror=implicit-function-declaration -ffile-prefix-map=/build/reproducible-path/ocserv-1.3.0=. -fstack-protector-strong -fstack-clash-protection -Wformat -Werror=format-security -fcf-protection -Wall -Wno-strict-aliasing -Wextra -Wno-unused-parameter -Wno-sign-compare -Wno-missing-field-initializers -Wno-implicit-fallthrough -Wno-stringop-truncation -c -o main-ctl-unix.o main-ctl-unix.c
gcc -DHAVE_CONFIG_H -I. -I..   -I../src/llhttp/  -I./ -I./../ -I./../ -I/usr/include/p11-kit-1  -I./common -I./common       -I/usr/include/liboath  -isystem /usr/include/mit-krb5   -I/usr/include/p11-kit-1    -I./pcl/  -Wdate-time -D_FORTIFY_SOURCE=2  -g -O2 -Werror=implicit-function-declaration -ffile-prefix-map=/build/reproducible-path/ocserv-1.3.0=. -fstack-protector-strong -fstack-clash-protection -Wformat -Werror=format-security -fcf-protection -Wall -Wno-strict-aliasing -Wextra -Wno-unused-parameter -Wno-sign-compare -Wno-missing-field-initializers -Wno-implicit-fallthrough -Wno-stringop-truncation -c -o main-proc.o main-proc.c
gcc -DHAVE_CONFIG_H -I. -I..   -I../src/llhttp/  -I./ -I./../ -I./../ -I/usr/include/p11-kit-1  -I./common -I./common       -I/usr/include/liboath  -isystem /usr/include/mit-krb5   -I/usr/include/p11-kit-1    -I./pcl/  -Wdate-time -D_FORTIFY_SOURCE=2  -g -O2 -Werror=implicit-function-declaration -ffile-prefix-map=/build/reproducible-path/ocserv-1.3.0=. -fstack-protector-strong -fstack-clash-protection -Wformat -Werror=format-security -fcf-protection -Wall -Wno-strict-aliasing -Wextra -Wno-unused-parameter -Wno-sign-compare -Wno-missing-field-initializers -Wno-implicit-fallthrough -Wno-stringop-truncation -c -o main-sec-mod-cmd.o main-sec-mod-cmd.c
gcc -DHAVE_CONFIG_H -I. -I..   -I../src/llhttp/  -I./ -I./../ -I./../ -I/usr/include/p11-kit-1  -I./common -I./common       -I/usr/include/liboath  -isystem /usr/include/mit-krb5   -I/usr/include/p11-kit-1    -I./pcl/  -Wdate-time -D_FORTIFY_SOURCE=2  -g -O2 -Werror=implicit-function-declaration -ffile-prefix-map=/build/reproducible-path/ocserv-1.3.0=. -fstack-protector-strong -fstack-clash-protection -Wformat -Werror=format-security -fcf-protection -Wall -Wno-strict-aliasing -Wextra -Wno-unused-parameter -Wno-sign-compare -Wno-missing-field-initializers -Wno-implicit-fallthrough -Wno-stringop-truncation -c -o main-user.o main-user.c
gcc -DHAVE_CONFIG_H -I. -I..   -I../src/llhttp/  -I./ -I./../ -I./../ -I/usr/include/p11-kit-1  -I./common -I./common       -I/usr/include/liboath  -isystem /usr/include/mit-krb5   -I/usr/include/p11-kit-1    -I./pcl/  -Wdate-time -D_FORTIFY_SOURCE=2  -g -O2 -Werror=implicit-function-declaration -ffile-prefix-map=/build/reproducible-path/ocserv-1.3.0=. -fstack-protector-strong -fstack-clash-protection -Wformat -Werror=format-security -fcf-protection -Wall -Wno-strict-aliasing -Wextra -Wno-unused-parameter -Wno-sign-compare -Wno-missing-field-initializers -Wno-implicit-fallthrough -Wno-stringop-truncation -c -o main-worker-cmd.o main-worker-cmd.c
gcc -DHAVE_CONFIG_H -I. -I..   -I../src/llhttp/  -I./ -I./../ -I./../ -I/usr/include/p11-kit-1  -I./common -I./common       -I/usr/include/liboath  -isystem /usr/include/mit-krb5   -I/usr/include/p11-kit-1    -I./pcl/  -Wdate-time -D_FORTIFY_SOURCE=2  -g -O2 -Werror=implicit-function-declaration -ffile-prefix-map=/build/reproducible-path/ocserv-1.3.0=. -fstack-protector-strong -fstack-clash-protection -Wformat -Werror=format-security -fcf-protection -Wall -Wno-strict-aliasing -Wextra -Wno-unused-parameter -Wno-sign-compare -Wno-missing-field-initializers -Wno-implicit-fallthrough -Wno-stringop-truncation -c -o proc-search.o proc-search.c
gcc -DHAVE_CONFIG_H -I. -I..   -I../src/llhttp/  -I./ -I./../ -I./../ -I/usr/include/p11-kit-1  -I./common -I./common       -I/usr/include/liboath  -isystem /usr/include/mit-krb5   -I/usr/include/p11-kit-1    -I./pcl/  -Wdate-time -D_FORTIFY_SOURCE=2  -g -O2 -Werror=implicit-function-declaration -ffile-prefix-map=/build/reproducible-path/ocserv-1.3.0=. -fstack-protector-strong -fstack-clash-protection -Wformat -Werror=format-security -fcf-protection -Wall -Wno-strict-aliasing -Wextra -Wno-unused-parameter -Wno-sign-compare -Wno-missing-field-initializers -Wno-implicit-fallthrough -Wno-stringop-truncation -c -o route-add.o route-add.c
gcc -DHAVE_CONFIG_H -I. -I..   -I../src/llhttp/  -I./ -I./../ -I./../ -I/usr/include/p11-kit-1  -I./common -I./common       -I/usr/include/liboath  -isystem /usr/include/mit-krb5   -I/usr/include/p11-kit-1    -I./pcl/  -Wdate-time -D_FORTIFY_SOURCE=2  -g -O2 -Werror=implicit-function-declaration -ffile-prefix-map=/build/reproducible-path/ocserv-1.3.0=. -fstack-protector-strong -fstack-clash-protection -Wformat -Werror=format-security -fcf-protection -Wall -Wno-strict-aliasing -Wextra -Wno-unused-parameter -Wno-sign-compare -Wno-missing-field-initializers -Wno-implicit-fallthrough -Wno-stringop-truncation -c -o sec-mod.o sec-mod.c
gcc -DHAVE_CONFIG_H -I. -I..   -I../src/llhttp/  -I./ -I./../ -I./../ -I/usr/include/p11-kit-1  -I./common -I./common       -I/usr/include/liboath  -isystem /usr/include/mit-krb5   -I/usr/include/p11-kit-1    -I./pcl/  -Wdate-time -D_FORTIFY_SOURCE=2  -g -O2 -Werror=implicit-function-declaration -ffile-prefix-map=/build/reproducible-path/ocserv-1.3.0=. -fstack-protector-strong -fstack-clash-protection -Wformat -Werror=format-security -fcf-protection -Wall -Wno-strict-aliasing -Wextra -Wno-unused-parameter -Wno-sign-compare -Wno-missing-field-initializers -Wno-implicit-fallthrough -Wno-stringop-truncation -c -o sec-mod-auth.o sec-mod-auth.c
gcc -DHAVE_CONFIG_H -I. -I..   -I../src/llhttp/  -I./ -I./../ -I./../ -I/usr/include/p11-kit-1  -I./common -I./common       -I/usr/include/liboath  -isystem /usr/include/mit-krb5   -I/usr/include/p11-kit-1    -I./pcl/  -Wdate-time -D_FORTIFY_SOURCE=2  -g -O2 -Werror=implicit-function-declaration -ffile-prefix-map=/build/reproducible-path/ocserv-1.3.0=. -fstack-protector-strong -fstack-clash-protection -Wformat -Werror=format-security -fcf-protection -Wall -Wno-strict-aliasing -Wextra -Wno-unused-parameter -Wno-sign-compare -Wno-missing-field-initializers -Wno-implicit-fallthrough -Wno-stringop-truncation -c -o sec-mod-cookies.o sec-mod-cookies.c
gcc -DHAVE_CONFIG_H -I. -I..   -I../src/llhttp/  -I./ -I./../ -I./../ -I/usr/include/p11-kit-1  -I./common -I./common       -I/usr/include/liboath  -isystem /usr/include/mit-krb5   -I/usr/include/p11-kit-1    -I./pcl/  -Wdate-time -D_FORTIFY_SOURCE=2  -g -O2 -Werror=implicit-function-declaration -ffile-prefix-map=/build/reproducible-path/ocserv-1.3.0=. -fstack-protector-strong -fstack-clash-protection -Wformat -Werror=format-security -fcf-protection -Wall -Wno-strict-aliasing -Wextra -Wno-unused-parameter -Wno-sign-compare -Wno-missing-field-initializers -Wno-implicit-fallthrough -Wno-stringop-truncation -c -o sec-mod-db.o sec-mod-db.c
gcc -DHAVE_CONFIG_H -I. -I..   -I../src/llhttp/  -I./ -I./../ -I./../ -I/usr/include/p11-kit-1  -I./common -I./common       -I/usr/include/liboath  -isystem /usr/include/mit-krb5   -I/usr/include/p11-kit-1    -I./pcl/  -Wdate-time -D_FORTIFY_SOURCE=2  -g -O2 -Werror=implicit-function-declaration -ffile-prefix-map=/build/reproducible-path/ocserv-1.3.0=. -fstack-protector-strong -fstack-clash-protection -Wformat -Werror=format-security -fcf-protection -Wall -Wno-strict-aliasing -Wextra -Wno-unused-parameter -Wno-sign-compare -Wno-missing-field-initializers -Wno-implicit-fallthrough -Wno-stringop-truncation -c -o sec-mod-resume.o sec-mod-resume.c
gcc -DHAVE_CONFIG_H -I. -I..   -I../src/llhttp/  -I./ -I./../ -I./../ -I/usr/include/p11-kit-1  -I./common -I./common       -I/usr/include/liboath  -isystem /usr/include/mit-krb5   -I/usr/include/p11-kit-1    -I./pcl/  -Wdate-time -D_FORTIFY_SOURCE=2  -g -O2 -Werror=implicit-function-declaration -ffile-prefix-map=/build/reproducible-path/ocserv-1.3.0=. -fstack-protector-strong -fstack-clash-protection -Wformat -Werror=format-security -fcf-protection -Wall -Wno-strict-aliasing -Wextra -Wno-unused-parameter -Wno-sign-compare -Wno-missing-field-initializers -Wno-implicit-fallthrough -Wno-stringop-truncation -c -o sec-mod-sup-config.o sec-mod-sup-config.c
gcc -DHAVE_CONFIG_H -I. -I..   -I../src/llhttp/  -I./ -I./../ -I./../ -I/usr/include/p11-kit-1  -I./common -I./common       -I/usr/include/liboath  -isystem /usr/include/mit-krb5   -I/usr/include/p11-kit-1    -I./pcl/  -Wdate-time -D_FORTIFY_SOURCE=2  -g -O2 -Werror=implicit-function-declaration -ffile-prefix-map=/build/reproducible-path/ocserv-1.3.0=. -fstack-protector-strong -fstack-clash-protection -Wformat -Werror=format-security -fcf-protection -Wall -Wno-strict-aliasing -Wextra -Wno-unused-parameter -Wno-sign-compare -Wno-missing-field-initializers -Wno-implicit-fallthrough -Wno-stringop-truncation -c -o common/sockdiag.o common/sockdiag.c
gcc -DHAVE_CONFIG_H -I. -I..   -I../src/llhttp/  -I./ -I./../ -I./../ -I/usr/include/p11-kit-1  -I./common -I./common       -I/usr/include/liboath  -isystem /usr/include/mit-krb5   -I/usr/include/p11-kit-1    -I./pcl/  -Wdate-time -D_FORTIFY_SOURCE=2  -g -O2 -Werror=implicit-function-declaration -ffile-prefix-map=/build/reproducible-path/ocserv-1.3.0=. -fstack-protector-strong -fstack-clash-protection -Wformat -Werror=format-security -fcf-protection -Wall -Wno-strict-aliasing -Wextra -Wno-unused-parameter -Wno-sign-compare -Wno-missing-field-initializers -Wno-implicit-fallthrough -Wno-stringop-truncation -c -o namespace.o namespace.c
gcc -DHAVE_CONFIG_H -I. -I..   -I../src/llhttp/  -I./ -I./../ -I./../ -I/usr/include/p11-kit-1  -I./common -I./common       -I/usr/include/liboath  -isystem /usr/include/mit-krb5   -I/usr/include/p11-kit-1    -I./pcl/  -Wdate-time -D_FORTIFY_SOURCE=2  -g -O2 -Werror=implicit-function-declaration -ffile-prefix-map=/build/reproducible-path/ocserv-1.3.0=. -fstack-protector-strong -fstack-clash-protection -Wformat -Werror=format-security -fcf-protection -Wall -Wno-strict-aliasing -Wextra -Wno-unused-parameter -Wno-sign-compare -Wno-missing-field-initializers -Wno-implicit-fallthrough -Wno-stringop-truncation -c -o main-log.o main-log.c
gcc -DHAVE_CONFIG_H -I. -I..   -I../src/llhttp/  -I./ -I./../ -I./../ -I/usr/include/p11-kit-1  -I./common -I./common       -I/usr/include/liboath  -isystem /usr/include/mit-krb5   -I/usr/include/p11-kit-1    -I./pcl/  -Wdate-time -D_FORTIFY_SOURCE=2  -g -O2 -Werror=implicit-function-declaration -ffile-prefix-map=/build/reproducible-path/ocserv-1.3.0=. -fstack-protector-strong -fstack-clash-protection -Wformat -Werror=format-security -fcf-protection -Wall -Wno-strict-aliasing -Wextra -Wno-unused-parameter -Wno-sign-compare -Wno-missing-field-initializers -Wno-implicit-fallthrough -Wno-stringop-truncation -c -o icmp-ping.o icmp-ping.c
gcc -DHAVE_CONFIG_H -I. -I..   -I../src/llhttp/  -I./ -I./../ -I./../ -I/usr/include/p11-kit-1  -I./common -I./common       -I/usr/include/liboath  -isystem /usr/include/mit-krb5   -I/usr/include/p11-kit-1    -I./pcl/  -Wdate-time -D_FORTIFY_SOURCE=2  -g -O2 -Werror=implicit-function-declaration -ffile-prefix-map=/build/reproducible-path/ocserv-1.3.0=. -fstack-protector-strong -fstack-clash-protection -Wformat -Werror=format-security -fcf-protection -Wall -Wno-strict-aliasing -Wextra -Wno-unused-parameter -Wno-sign-compare -Wno-missing-field-initializers -Wno-implicit-fallthrough -Wno-stringop-truncation -c -o ip-lease.o ip-lease.c
gcc -DHAVE_CONFIG_H -I. -I..   -I../src/llhttp/  -I./ -I./../ -I./../ -I/usr/include/p11-kit-1  -I./common -I./common       -I/usr/include/liboath  -isystem /usr/include/mit-krb5   -I/usr/include/p11-kit-1    -I./pcl/  -Wdate-time -D_FORTIFY_SOURCE=2  -g -O2 -Werror=implicit-function-declaration -ffile-prefix-map=/build/reproducible-path/ocserv-1.3.0=. -fstack-protector-strong -fstack-clash-protection -Wformat -Werror=format-security -fcf-protection -Wall -Wno-strict-aliasing -Wextra -Wno-unused-parameter -Wno-sign-compare -Wno-missing-field-initializers -Wno-implicit-fallthrough -Wno-stringop-truncation -c -o tun.o tun.c
gcc -DHAVE_CONFIG_H -I. -I..   -I../src/llhttp/  -I./ -I./../ -I./../ -I/usr/include/p11-kit-1  -I./common -I./common       -I/usr/include/liboath  -isystem /usr/include/mit-krb5   -I/usr/include/p11-kit-1    -I./pcl/  -Wdate-time -D_FORTIFY_SOURCE=2  -g -O2 -Werror=implicit-function-declaration -ffile-prefix-map=/build/reproducible-path/ocserv-1.3.0=. -fstack-protector-strong -fstack-clash-protection -Wformat -Werror=format-security -fcf-protection -Wall -Wno-strict-aliasing -Wextra -Wno-unused-parameter -Wno-sign-compare -Wno-missing-field-initializers -Wno-implicit-fallthrough -Wno-stringop-truncation -c -o main-limits.o main-limits.c
gcc -DHAVE_CONFIG_H -I. -I..   -I../src/llhttp/  -I./ -I./../ -I./../ -I/usr/include/p11-kit-1  -I./common -I./common       -I/usr/include/liboath  -isystem /usr/include/mit-krb5   -I/usr/include/p11-kit-1    -I./pcl/  -DOCSERV_WORKER_PROCESS -Wdate-time -D_FORTIFY_SOURCE=2  -g -O2 -Werror=implicit-function-declaration -ffile-prefix-map=/build/reproducible-path/ocserv-1.3.0=. -fstack-protector-strong -fstack-clash-protection -Wformat -Werror=format-security -fcf-protection -Wall -Wno-strict-aliasing -Wextra -Wno-unused-parameter -Wno-sign-compare -Wno-missing-field-initializers -Wno-implicit-fallthrough -Wno-stringop-truncation -c -o llhttp/ocserv_worker-llhttp.o `test -f 'llhttp/llhttp.c' || echo './'`llhttp/llhttp.c
gcc -DHAVE_CONFIG_H -I. -I..   -I../src/llhttp/  -I./ -I./../ -I./../ -I/usr/include/p11-kit-1  -I./common -I./common       -I/usr/include/liboath  -isystem /usr/include/mit-krb5   -I/usr/include/p11-kit-1    -I./pcl/  -DOCSERV_WORKER_PROCESS -Wdate-time -D_FORTIFY_SOURCE=2  -g -O2 -Werror=implicit-function-declaration -ffile-prefix-map=/build/reproducible-path/ocserv-1.3.0=. -fstack-protector-strong -fstack-clash-protection -Wformat -Werror=format-security -fcf-protection -Wall -Wno-strict-aliasing -Wextra -Wno-unused-parameter -Wno-sign-compare -Wno-missing-field-initializers -Wno-implicit-fallthrough -Wno-stringop-truncation -c -o llhttp/ocserv_worker-api.o `test -f 'llhttp/api.c' || echo './'`llhttp/api.c
gcc -DHAVE_CONFIG_H -I. -I..   -I../src/llhttp/  -I./ -I./../ -I./../ -I/usr/include/p11-kit-1  -I./common -I./common       -I/usr/include/liboath  -isystem /usr/include/mit-krb5   -I/usr/include/p11-kit-1    -I./pcl/  -DOCSERV_WORKER_PROCESS -Wdate-time -D_FORTIFY_SOURCE=2  -g -O2 -Werror=implicit-function-declaration -ffile-prefix-map=/build/reproducible-path/ocserv-1.3.0=. -fstack-protector-strong -fstack-clash-protection -Wformat -Werror=format-security -fcf-protection -Wall -Wno-strict-aliasing -Wextra -Wno-unused-parameter -Wno-sign-compare -Wno-missing-field-initializers -Wno-implicit-fallthrough -Wno-stringop-truncation -c -o llhttp/ocserv_worker-http.o `test -f 'llhttp/http.c' || echo './'`llhttp/http.c
gcc -DHAVE_CONFIG_H -I. -I..   -I../src/llhttp/  -I./ -I./../ -I./../ -I/usr/include/p11-kit-1  -I./common -I./common       -I/usr/include/liboath  -isystem /usr/include/mit-krb5   -I/usr/include/p11-kit-1    -I./pcl/  -DOCSERV_WORKER_PROCESS -Wdate-time -D_FORTIFY_SOURCE=2  -g -O2 -Werror=implicit-function-declaration -ffile-prefix-map=/build/reproducible-path/ocserv-1.3.0=. -fstack-protector-strong -fstack-clash-protection -Wformat -Werror=format-security -fcf-protection -Wall -Wno-strict-aliasing -Wextra -Wno-unused-parameter -Wno-sign-compare -Wno-missing-field-initializers -Wno-implicit-fallthrough -Wno-stringop-truncation -c -o common/ocserv_worker-hmac.o `test -f 'common/hmac.c' || echo './'`common/hmac.c
gcc -DHAVE_CONFIG_H -I. -I..   -I../src/llhttp/  -I./ -I./../ -I./../ -I/usr/include/p11-kit-1  -I./common -I./common       -I/usr/include/liboath  -isystem /usr/include/mit-krb5   -I/usr/include/p11-kit-1    -I./pcl/  -DOCSERV_WORKER_PROCESS -Wdate-time -D_FORTIFY_SOURCE=2  -g -O2 -Werror=implicit-function-declaration -ffile-prefix-map=/build/reproducible-path/ocserv-1.3.0=. -fstack-protector-strong -fstack-clash-protection -Wformat -Werror=format-security -fcf-protection -Wall -Wno-strict-aliasing -Wextra -Wno-unused-parameter -Wno-sign-compare -Wno-missing-field-initializers -Wno-implicit-fallthrough -Wno-stringop-truncation -c -o common/ocserv_worker-snapshot.o `test -f 'common/snapshot.c' || echo './'`common/snapshot.c
gcc -DHAVE_CONFIG_H -I. -I..   -I../src/llhttp/  -I./ -I./../ -I./../ -I/usr/include/p11-kit-1  -I./common -I./common       -I/usr/include/liboath  -isystem /usr/include/mit-krb5   -I/usr/include/p11-kit-1    -I./pcl/  -DOCSERV_WORKER_PROCESS -Wdate-time -D_FORTIFY_SOURCE=2  -g -O2 -Werror=implicit-function-declaration -ffile-prefix-map=/build/reproducible-path/ocserv-1.3.0=. -fstack-protector-strong -fstack-clash-protection -Wformat -Werror=format-security -fcf-protection -Wall -Wno-strict-aliasing -Wextra -Wno-unused-parameter -Wno-sign-compare -Wno-missing-field-initializers -Wno-implicit-fallthrough -Wno-stringop-truncation -c -o ocserv_worker-config.o `test -f 'config.c' || echo './'`config.c
gcc -DHAVE_CONFIG_H -I. -I..   -I../src/llhttp/  -I./ -I./../ -I./../ -I/usr/include/p11-kit-1  -I./common -I./common       -I/usr/include/liboath  -isystem /usr/include/mit-krb5   -I/usr/include/p11-kit-1    -I./pcl/  -DOCSERV_WORKER_PROCESS -Wdate-time -D_FORTIFY_SOURCE=2  -g -O2 -Werror=implicit-function-declaration -ffile-prefix-map=/build/reproducible-path/ocserv-1.3.0=. -fstack-protector-strong -fstack-clash-protection -Wformat -Werror=format-security -fcf-protection -Wall -Wno-strict-aliasing -Wextra -Wno-unused-parameter -Wno-sign-compare -Wno-missing-field-initializers -Wno-implicit-fallthrough -Wno-stringop-truncation -c -o ocserv_worker-config-kkdcp.o `test -f 'config-kkdcp.c' || echo './'`config-kkdcp.c
gcc -DHAVE_CONFIG_H -I. -I..   -I../src/llhttp/  -I./ -I./../ -I./../ -I/usr/include/p11-kit-1  -I./common -I./common       -I/usr/include/liboath  -isystem /usr/include/mit-krb5   -I/usr/include/p11-kit-1    -I./pcl/  -DOCSERV_WORKER_PROCESS -Wdate-time -D_FORTIFY_SOURCE=2  -g -O2 -Werror=implicit-function-declaration -ffile-prefix-map=/build/reproducible-path/ocserv-1.3.0=. -fstack-protector-strong -fstack-clash-protection -Wformat -Werror=format-security -fcf-protection -Wall -Wno-strict-aliasing -Wextra -Wno-unused-parameter -Wno-sign-compare -Wno-missing-field-initializers -Wno-implicit-fallthrough -Wno-stringop-truncation -c -o ocserv_worker-config-ports.o `test -f 'config-ports.c' || echo './'`config-ports.c
gcc -DHAVE_CONFIG_H -I. -I..   -I../src/llhttp/  -I./ -I./../ -I./../ -I/usr/include/p11-kit-1  -I./common -I./common       -I/usr/include/liboath  -isystem /usr/include/mit-krb5   -I/usr/include/p11-kit-1    -I./pcl/  -DOCSERV_WORKER_PROCESS -Wdate-time -D_FORTIFY_SOURCE=2  -g -O2 -Werror=implicit-function-declaration -ffile-prefix-map=/build/reproducible-path/ocserv-1.3.0=. -fstack-protector-strong -fstack-clash-protection -Wformat -Werror=format-security -fcf-protection -Wall -Wno-strict-aliasing -Wextra -Wno-unused-parameter -Wno-sign-compare -Wno-missing-field-initializers -Wno-implicit-fallthrough -Wno-stringop-truncation -c -o inih/ocserv_worker-ini.o `test -f 'inih/ini.c' || echo './'`inih/ini.c
gcc -DHAVE_CONFIG_H -I. -I..   -I../src/llhttp/  -I./ -I./../ -I./../ -I/usr/include/p11-kit-1  -I./common -I./common       -I/usr/include/liboath  -isystem /usr/include/mit-krb5   -I/usr/include/p11-kit-1    -I./pcl/  -DOCSERV_WORKER_PROCESS -Wdate-time -D_FORTIFY_SOURCE=2  -g -O2 -Werror=implicit-function-declaration -ffile-prefix-map=/build/reproducible-path/ocserv-1.3.0=. -fstack-protector-strong -fstack-clash-protection -Wformat -Werror=format-security -fcf-protection -Wall -Wno-strict-aliasing -Wextra -Wno-unused-parameter -Wno-sign-compare -Wno-missing-field-initializers -Wno-implicit-fallthrough -Wno-stringop-truncation -c -o ocserv_worker-ip-util.o `test -f 'ip-util.c' || echo './'`ip-util.c
gcc -DHAVE_CONFIG_H -I. -I..   -I../src/llhttp/  -I./ -I./../ -I./../ -I/usr/include/p11-kit-1  -I./common -I./common       -I/usr/include/liboath  -isystem /usr/include/mit-krb5   -I/usr/include/p11-kit-1    -I./pcl/  -DOCSERV_WORKER_PROCESS -Wdate-time -D_FORTIFY_SOURCE=2  -g -O2 -Werror=implicit-function-declaration -ffile-prefix-map=/build/reproducible-path/ocserv-1.3.0=. -fstack-protector-strong -fstack-clash-protection -Wformat -Werror=format-security -fcf-protection -Wall -Wno-strict-aliasing -Wextra -Wno-unused-parameter -Wno-sign-compare -Wno-missing-field-initializers -Wno-implicit-fallthrough -Wno-stringop-truncation -c -o ocserv_worker-setproctitle.o `test -f 'setproctitle.c' || echo './'`setproctitle.c
gcc -DHAVE_CONFIG_H -I. -I..   -I../src/llhttp/  -I./ -I./../ -I./../ -I/usr/include/p11-kit-1  -I./common -I./common       -I/usr/include/liboath  -isystem /usr/include/mit-krb5   -I/usr/include/p11-kit-1    -I./pcl/  -DOCSERV_WORKER_PROCESS -Wdate-time -D_FORTIFY_SOURCE=2  -g -O2 -Werror=implicit-function-declaration -ffile-prefix-map=/build/reproducible-path/ocserv-1.3.0=. -fstack-protector-strong -fstack-clash-protection -Wformat -Werror=format-security -fcf-protection -Wall -Wno-strict-aliasing -Wextra -Wno-unused-parameter -Wno-sign-compare -Wno-missing-field-initializers -Wno-implicit-fallthrough -Wno-stringop-truncation -c -o ocserv_worker-str.o `test -f 'str.c' || echo './'`str.c
gcc -DHAVE_CONFIG_H -I. -I..   -I../src/llhttp/  -I./ -I./../ -I./../ -I/usr/include/p11-kit-1  -I./common -I./common       -I/usr/include/liboath  -isystem /usr/include/mit-krb5   -I/usr/include/p11-kit-1    -I./pcl/  -DOCSERV_WORKER_PROCESS -Wdate-time -D_FORTIFY_SOURCE=2  -g -O2 -Werror=implicit-function-declaration -ffile-prefix-map=/build/reproducible-path/ocserv-1.3.0=. -fstack-protector-strong -fstack-clash-protection -Wformat -Werror=format-security -fcf-protection -Wall -Wno-strict-aliasing -Wextra -Wno-unused-parameter -Wno-sign-compare -Wno-missing-field-initializers -Wno-implicit-fallthrough -Wno-stringop-truncation -c -o ocserv_worker-subconfig.o `test -f 'subconfig.c' || echo './'`subconfig.c
gcc -DHAVE_CONFIG_H -I. -I..   -I../src/llhttp/  -I./ -I./../ -I./../ -I/usr/include/p11-kit-1  -I./common -I./common       -I/usr/include/liboath  -isystem /usr/include/mit-krb5   -I/usr/include/p11-kit-1    -I./pcl/  -DOCSERV_WORKER_PROCESS -Wdate-time -D_FORTIFY_SOURCE=2  -g -O2 -Werror=implicit-function-declaration -ffile-prefix-map=/build/reproducible-path/ocserv-1.3.0=. -fstack-protector-strong -fstack-clash-protection -Wformat -Werror=format-security -fcf-protection -Wall -Wno-strict-aliasing -Wextra -Wno-unused-parameter -Wno-sign-compare -Wno-missing-field-initializers -Wno-implicit-fallthrough -Wno-stringop-truncation -c -o sup-config/ocserv_worker-file.o `test -f 'sup-config/file.c' || echo './'`sup-config/file.c
gcc -DHAVE_CONFIG_H -I. -I..   -I../src/llhttp/  -I./ -I./../ -I./../ -I/usr/include/p11-kit-1  -I./common -I./common       -I/usr/include/liboath  -isystem /usr/include/mit-krb5   -I/usr/include/p11-kit-1    -I./pcl/  -DOCSERV_WORKER_PROCESS -Wdate-time -D_FORTIFY_SOURCE=2  -g -O2 -Werror=implicit-function-declaration -ffile-prefix-map=/build/reproducible-path/ocserv-1.3.0=. -fstack-protector-strong -fstack-clash-protection -Wformat -Werror=format-security -fcf-protection -Wall -Wno-strict-aliasing -Wextra -Wno-unused-parameter -Wno-sign-compare -Wno-missing-field-initializers -Wno-implicit-fallthrough -Wno-stringop-truncation -c -o sup-config/ocserv_worker-radius.o `test -f 'sup-config/radius.c' || echo './'`sup-config/radius.c
gcc -DHAVE_CONFIG_H -I. -I..   -I../src/llhttp/  -I./ -I./../ -I./../ -I/usr/include/p11-kit-1  -I./common -I./common       -I/usr/include/liboath  -isystem /usr/include/mit-krb5   -I/usr/include/p11-kit-1    -I./pcl/  -DOCSERV_WORKER_PROCESS -Wdate-time -D_FORTIFY_SOURCE=2  -g -O2 -Werror=implicit-function-declaration -ffile-prefix-map=/build/reproducible-path/ocserv-1.3.0=. -fstack-protector-strong -fstack-clash-protection -Wformat -Werror=format-security -fcf-protection -Wall -Wno-strict-aliasing -Wextra -Wno-unused-parameter -Wno-sign-compare -Wno-missing-field-initializers -Wno-implicit-fallthrough -Wno-stringop-truncation -c -o ocserv_worker-tlslib.o `test -f 'tlslib.c' || echo './'`tlslib.c
gcc -DHAVE_CONFIG_H -I. -I..   -I../src/llhttp/  -I./ -I./../ -I./../ -I/usr/include/p11-kit-1  -I./common -I./common       -I/usr/include/liboath  -isystem /usr/include/mit-krb5   -I/usr/include/p11-kit-1    -I./pcl/  -DOCSERV_WORKER_PROCESS -Wdate-time -D_FORTIFY_SOURCE=2  -g -O2 -Werror=implicit-function-declaration -ffile-prefix-map=/build/reproducible-path/ocserv-1.3.0=. -fstack-protector-strong -fstack-clash-protection -Wformat -Werror=format-security -fcf-protection -Wall -Wno-strict-aliasing -Wextra -Wno-unused-parameter -Wno-sign-compare -Wno-missing-field-initializers -Wno-implicit-fallthrough -Wno-stringop-truncation -c -o ocserv_worker-valid-hostname.o `test -f 'valid-hostname.c' || echo './'`valid-hostname.c
gcc -DHAVE_CONFIG_H -I. -I..   -I../src/llhttp/  -I./ -I./../ -I./../ -I/usr/include/p11-kit-1  -I./common -I./common       -I/usr/include/liboath  -isystem /usr/include/mit-krb5   -I/usr/include/p11-kit-1    -I./pcl/  -DOCSERV_WORKER_PROCESS -Wdate-time -D_FORTIFY_SOURCE=2  -g -O2 -Werror=implicit-function-declaration -ffile-prefix-map=/build/reproducible-path/ocserv-1.3.0=. -fstack-protector-strong -fstack-clash-protection -Wformat -Werror=format-security -fcf-protection -Wall -Wno-strict-aliasing -Wextra -Wno-unused-parameter -Wno-sign-compare -Wno-missing-field-initializers -Wno-implicit-fallthrough -Wno-stringop-truncation -c -o ocserv_worker-vasprintf.o `test -f 'vasprintf.c' || echo './'`vasprintf.c
gcc -DHAVE_CONFIG_H -I. -I..   -I../src/llhttp/  -I./ -I./../ -I./../ -I/usr/include/p11-kit-1  -I./common -I./common       -I/usr/include/liboath  -isystem /usr/include/mit-krb5   -I/usr/include/p11-kit-1    -I./pcl/  -DOCSERV_WORKER_PROCESS -Wdate-time -D_FORTIFY_SOURCE=2  -g -O2 -Werror=implicit-function-declaration -ffile-prefix-map=/build/reproducible-path/ocserv-1.3.0=. -fstack-protector-strong -fstack-clash-protection -Wformat -Werror=format-security -fcf-protection -Wall -Wno-strict-aliasing -Wextra -Wno-unused-parameter -Wno-sign-compare -Wno-missing-field-initializers -Wno-implicit-fallthrough -Wno-stringop-truncation -c -o ocserv_worker-worker-log.o `test -f 'worker-log.c' || echo './'`worker-log.c
gcc -DHAVE_CONFIG_H -I. -I..   -I../src/llhttp/  -I./ -I./../ -I./../ -I/usr/include/p11-kit-1  -I./common -I./common       -I/usr/include/liboath  -isystem /usr/include/mit-krb5   -I/usr/include/p11-kit-1    -I./pcl/  -DOCSERV_WORKER_PROCESS -Wdate-time -D_FORTIFY_SOURCE=2  -g -O2 -Werror=implicit-function-declaration -ffile-prefix-map=/build/reproducible-path/ocserv-1.3.0=. -fstack-protector-strong -fstack-clash-protection -Wformat -Werror=format-security -fcf-protection -Wall -Wno-strict-aliasing -Wextra -Wno-unused-parameter -Wno-sign-compare -Wno-missing-field-initializers -Wno-implicit-fallthrough -Wno-stringop-truncation -c -o ocserv_worker-lzs.o `test -f 'lzs.c' || echo './'`lzs.c
gcc -DHAVE_CONFIG_H -I. -I..   -I../src/llhttp/  -I./ -I./../ -I./../ -I/usr/include/p11-kit-1  -I./common -I./common       -I/usr/include/liboath  -isystem /usr/include/mit-krb5   -I/usr/include/p11-kit-1    -I./pcl/  -DOCSERV_WORKER_PROCESS -Wdate-time -D_FORTIFY_SOURCE=2  -g -O2 -Werror=implicit-function-declaration -ffile-prefix-map=/build/reproducible-path/ocserv-1.3.0=. -fstack-protector-strong -fstack-clash-protection -Wformat -Werror=format-security -fcf-protection -Wall -Wno-strict-aliasing -Wextra -Wno-unused-parameter -Wno-sign-compare -Wno-missing-field-initializers -Wno-implicit-fallthrough -Wno-stringop-truncation -c -o ocserv_worker-kkdcp_asn1_tab.o `test -f 'kkdcp_asn1_tab.c' || echo './'`kkdcp_asn1_tab.c
gcc -DHAVE_CONFIG_H -I. -I..   -I../src/llhttp/  -I./ -I./../ -I./../ -I/usr/include/p11-kit-1  -I./common -I./common       -I/usr/include/liboath  -isystem /usr/include/mit-krb5   -I/usr/include/p11-kit-1    -I./pcl/  -DOCSERV_WORKER_PROCESS -Wdate-time -D_FORTIFY_SOURCE=2  -g -O2 -Werror=implicit-function-declaration -ffile-prefix-map=/build/reproducible-path/ocserv-1.3.0=. -fstack-protector-strong -fstack-clash-protection -Wformat -Werror=format-security -fcf-protection -Wall -Wno-strict-aliasing -Wextra -Wno-unused-parameter -Wno-sign-compare -Wno-missing-field-initializers -Wno-implicit-fallthrough -Wno-stringop-truncation -c -o ocserv_worker-html.o `test -f 'html.c' || echo './'`html.c
gcc -DHAVE_CONFIG_H -I. -I..   -I../src/llhttp/  -I./ -I./../ -I./../ -I/usr/include/p11-kit-1  -I./common -I./common       -I/usr/include/liboath  -isystem /usr/include/mit-krb5   -I/usr/include/p11-kit-1    -I./pcl/  -DOCSERV_WORKER_PROCESS -Wdate-time -D_FORTIFY_SOURCE=2  -g -O2 -Werror=implicit-function-declaration -ffile-prefix-map=/build/reproducible-path/ocserv-1.3.0=. -fstack-protector-strong -fstack-clash-protection -Wformat -Werror=format-security -fcf-protection -Wall -Wno-strict-aliasing -Wextra -Wno-unused-parameter -Wno-sign-compare -Wno-missing-field-initializers -Wno-implicit-fallthrough -Wno-stringop-truncation -c -o ocserv_worker-worker.o `test -f 'worker.c' || echo './'`worker.c
gcc -DHAVE_CONFIG_H -I. -I..   -I../src/llhttp/  -I./ -I./../ -I./../ -I/usr/include/p11-kit-1  -I./common -I./common       -I/usr/include/liboath  -isystem /usr/include/mit-krb5   -I/usr/include/p11-kit-1    -I./pcl/  -DOCSERV_WORKER_PROCESS -Wdate-time -D_FORTIFY_SOURCE=2  -g -O2 -Werror=implicit-function-declaration -ffile-prefix-map=/build/reproducible-path/ocserv-1.3.0=. -fstack-protector-strong -fstack-clash-protection -Wformat -Werror=format-security -fcf-protection -Wall -Wno-strict-aliasing -Wextra -Wno-unused-parameter -Wno-sign-compare -Wno-missing-field-initializers -Wno-implicit-fallthrough -Wno-stringop-truncation -c -o ocserv_worker-worker-auth.o `test -f 'worker-auth.c' || echo './'`worker-auth.c
gcc -DHAVE_CONFIG_H -I. -I..   -I../src/llhttp/  -I./ -I./../ -I./../ -I/usr/include/p11-kit-1  -I./common -I./common       -I/usr/include/liboath  -isystem /usr/include/mit-krb5   -I/usr/include/p11-kit-1    -I./pcl/  -DOCSERV_WORKER_PROCESS -Wdate-time -D_FORTIFY_SOURCE=2  -g -O2 -Werror=implicit-function-declaration -ffile-prefix-map=/build/reproducible-path/ocserv-1.3.0=. -fstack-protector-strong -fstack-clash-protection -Wformat -Werror=format-security -fcf-protection -Wall -Wno-strict-aliasing -Wextra -Wno-unused-parameter -Wno-sign-compare -Wno-missing-field-initializers -Wno-implicit-fallthrough -Wno-stringop-truncation -c -o ocserv_worker-worker-bandwidth.o `test -f 'worker-bandwidth.c' || echo './'`worker-bandwidth.c
gcc -DHAVE_CONFIG_H -I. -I..   -I../src/llhttp/  -I./ -I./../ -I./../ -I/usr/include/p11-kit-1  -I./common -I./common       -I/usr/include/liboath  -isystem /usr/include/mit-krb5   -I/usr/include/p11-kit-1    -I./pcl/  -DOCSERV_WORKER_PROCESS -Wdate-time -D_FORTIFY_SOURCE=2  -g -O2 -Werror=implicit-function-declaration -ffile-prefix-map=/build/reproducible-path/ocserv-1.3.0=. -fstack-protector-strong -fstack-clash-protection -Wformat -Werror=format-security -fcf-protection -Wall -Wno-strict-aliasing -Wextra -Wno-unused-parameter -Wno-sign-compare -Wno-missing-field-initializers -Wno-implicit-fallthrough -Wno-stringop-truncation -c -o ocserv_worker-worker-http.o `test -f 'worker-http.c' || echo './'`worker-http.c
gcc -DHAVE_CONFIG_H -I. -I..   -I../src/llhttp/  -I./ -I./../ -I./../ -I/usr/include/p11-kit-1  -I./common -I./common       -I/usr/include/liboath  -isystem /usr/include/mit-krb5   -I/usr/include/p11-kit-1    -I./pcl/  -DOCSERV_WORKER_PROCESS -Wdate-time -D_FORTIFY_SOURCE=2  -g -O2 -Werror=implicit-function-declaration -ffile-prefix-map=/build/reproducible-path/ocserv-1.3.0=. -fstack-protector-strong -fstack-clash-protection -Wformat -Werror=format-security -fcf-protection -Wall -Wno-strict-aliasing -Wextra -Wno-unused-parameter -Wno-sign-compare -Wno-missing-field-initializers -Wno-implicit-fallthrough -Wno-stringop-truncation -c -o ocserv_worker-worker-http-handlers.o `test -f 'worker-http-handlers.c' || echo './'`worker-http-handlers.c
gcc -DHAVE_CONFIG_H -I. -I..   -I../src/llhttp/  -I./ -I./../ -I./../ -I/usr/include/p11-kit-1  -I./common -I./common       -I/usr/include/liboath  -isystem /usr/include/mit-krb5   -I/usr/include/p11-kit-1    -I./pcl/  -DOCSERV_WORKER_PROCESS -Wdate-time -D_FORTIFY_SOURCE=2  -g -O2 -Werror=implicit-function-declaration -ffile-prefix-map=/build/reproducible-path/ocserv-1.3.0=. -fstack-protector-strong -fstack-clash-protection -Wformat -Werror=format-security -fcf-protection -Wall -Wno-strict-aliasing -Wextra -Wno-unused-parameter -Wno-sign-compare -Wno-missing-field-initializers -Wno-implicit-fallthrough -Wno-stringop-truncation -c -o ocserv_worker-worker-kkdcp.o `test -f 'worker-kkdcp.c' || echo './'`worker-kkdcp.c
gcc -DHAVE_CONFIG_H -I. -I..   -I../src/llhttp/  -I./ -I./../ -I./../ -I/usr/include/p11-kit-1  -I./common -I./common       -I/usr/include/liboath  -isystem /usr/include/mit-krb5   -I/usr/include/p11-kit-1    -I./pcl/  -DOCSERV_WORKER_PROCESS -Wdate-time -D_FORTIFY_SOURCE=2  -g -O2 -Werror=implicit-function-declaration -ffile-prefix-map=/build/reproducible-path/ocserv-1.3.0=. -fstack-protector-strong -fstack-clash-protection -Wformat -Werror=format-security -fcf-protection -Wall -Wno-strict-aliasing -Wextra -Wno-unused-parameter -Wno-sign-compare -Wno-missing-field-initializers -Wno-implicit-fallthrough -Wno-stringop-truncation -c -o ocserv_worker-worker-misc.o `test -f 'worker-misc.c' || echo './'`worker-misc.c
gcc -DHAVE_CONFIG_H -I. -I..   -I../src/llhttp/  -I./ -I./../ -I./../ -I/usr/include/p11-kit-1  -I./common -I./common       -I/usr/include/liboath  -isystem /usr/include/mit-krb5   -I/usr/include/p11-kit-1    -I./pcl/  -DOCSERV_WORKER_PROCESS -Wdate-time -D_FORTIFY_SOURCE=2  -g -O2 -Werror=implicit-function-declaration -ffile-prefix-map=/build/reproducible-path/ocserv-1.3.0=. -fstack-protector-strong -fstack-clash-protection -Wformat -Werror=format-security -fcf-protection -Wall -Wno-strict-aliasing -Wextra -Wno-unused-parameter -Wno-sign-compare -Wno-missing-field-initializers -Wno-implicit-fallthrough -Wno-stringop-truncation -c -o ocserv_worker-worker-privs.o `test -f 'worker-privs.c' || echo './'`worker-privs.c
gcc -DHAVE_CONFIG_H -I. -I..   -I../src/llhttp/  -I./ -I./../ -I./../ -I/usr/include/p11-kit-1  -I./common -I./common       -I/usr/include/liboath  -isystem /usr/include/mit-krb5   -I/usr/include/p11-kit-1    -I./pcl/  -DOCSERV_WORKER_PROCESS -Wdate-time -D_FORTIFY_SOURCE=2  -g -O2 -Werror=implicit-function-declaration -ffile-prefix-map=/build/reproducible-path/ocserv-1.3.0=. -fstack-protector-strong -fstack-clash-protection -Wformat -Werror=format-security -fcf-protection -Wall -Wno-strict-aliasing -Wextra -Wno-unused-parameter -Wno-sign-compare -Wno-missing-field-initializers -Wno-implicit-fallthrough -Wno-stringop-truncation -c -o ocserv_worker-worker-proxyproto.o `test -f 'worker-proxyproto.c' || echo './'`worker-proxyproto.c
gcc -DHAVE_CONFIG_H -I. -I..   -I../src/llhttp/  -I./ -I./../ -I./../ -I/usr/include/p11-kit-1  -I./common -I./common       -I/usr/include/liboath  -isystem /usr/include/mit-krb5   -I/usr/include/p11-kit-1    -I./pcl/  -DOCSERV_WORKER_PROCESS -Wdate-time -D_FORTIFY_SOURCE=2  -g -O2 -Werror=implicit-function-declaration -ffile-prefix-map=/build/reproducible-path/ocserv-1.3.0=. -fstack-protector-strong -fstack-clash-protection -Wformat -Werror=format-security -fcf-protection -Wall -Wno-strict-aliasing -Wextra -Wno-unused-parameter -Wno-sign-compare -Wno-missing-field-initializers -Wno-implicit-fallthrough -Wno-stringop-truncation -c -o ocserv_worker-worker-resume.o `test -f 'worker-resume.c' || echo './'`worker-resume.c
gcc -DHAVE_CONFIG_H -I. -I..   -I../src/llhttp/  -I./ -I./../ -I./../ -I/usr/include/p11-kit-1  -I./common -I./common       -I/usr/include/liboath  -isystem /usr/include/mit-krb5   -I/usr/include/p11-kit-1    -I./pcl/  -DOCSERV_WORKER_PROCESS -Wdate-time -D_FORTIFY_SOURCE=2  -g -O2 -Werror=implicit-function-declaration -ffile-prefix-map=/build/reproducible-path/ocserv-1.3.0=. -fstack-protector-strong -fstack-clash-protection -Wformat -Werror=format-security -fcf-protection -Wall -Wno-strict-aliasing -Wextra -Wno-unused-parameter -Wno-sign-compare -Wno-missing-field-initializers -Wno-implicit-fallthrough -Wno-stringop-truncation -c -o ocserv_worker-worker-vpn.o `test -f 'worker-vpn.c' || echo './'`worker-vpn.c
gcc -DHAVE_CONFIG_H -I. -I..   -I../src/llhttp/  -I./ -I./../ -I./../ -I/usr/include/p11-kit-1  -I./common -I./common       -I/usr/include/liboath  -isystem /usr/include/mit-krb5   -I/usr/include/p11-kit-1    -I./pcl/  -DOCSERV_WORKER_PROCESS -Wdate-time -D_FORTIFY_SOURCE=2  -g -O2 -Werror=implicit-function-declaration -ffile-prefix-map=/build/reproducible-path/ocserv-1.3.0=. -fstack-protector-strong -fstack-clash-protection -Wformat -Werror=format-security -fcf-protection -Wall -Wno-strict-aliasing -Wextra -Wno-unused-parameter -Wno-sign-compare -Wno-missing-field-initializers -Wno-implicit-fallthrough -Wno-stringop-truncation -c -o ocserv_worker-worker-svc.o `test -f 'worker-svc.c' || echo './'`worker-svc.c
gcc -DHAVE_CONFIG_H -I. -I..   -I../src/llhttp/  -I./ -I./../ -I./../ -I/usr/include/p11-kit-1  -I./common -I./common       -I/usr/include/liboath  -isystem /usr/include/mit-krb5   -I/usr/include/p11-kit-1    -I./pcl/  -DOCSERV_WORKER_PROCESS -Wdate-time -D_FORTIFY_SOURCE=2  -g -O2 -Werror=implicit-function-declaration -ffile-prefix-map=/build/reproducible-path/ocserv-1.3.0=. -fstack-protector-strong -fstack-clash-protection -Wformat -Werror=format-security -fcf-protection -Wall -Wno-strict-aliasing -Wextra -Wno-unused-parameter -Wno-sign-compare -Wno-missing-field-initializers -Wno-implicit-fallthrough -Wno-stringop-truncation -c -o ocserv_worker-worker-tun.o `test -f 'worker-tun.c' || echo './'`worker-tun.c
gcc -DHAVE_CONFIG_H -I. -I..   -I../src/llhttp/  -I./ -I./../ -I./../ -I/usr/include/p11-kit-1  -I./common -I./common       -I/usr/include/liboath  -isystem /usr/include/mit-krb5   -I/usr/include/p11-kit-1    -I./pcl/  -DOCSERV_WORKER_PROCESS -Wdate-time -D_FORTIFY_SOURCE=2  -g -O2 -Werror=implicit-function-declaration -ffile-prefix-map=/build/reproducible-path/ocserv-1.3.0=. -fstack-protector-strong -fstack-clash-protection -Wformat -Werror=format-security -fcf-protection -Wall -Wno-strict-aliasing -Wextra -Wno-unused-parameter -Wno-sign-compare -Wno-missing-field-initializers -Wno-implicit-fallthrough -Wno-stringop-truncation -c -o ocserv_worker-isolate.o `test -f 'isolate.c' || echo './'`isolate.c
gcc -DHAVE_CONFIG_H -I. -I..   -I../src/llhttp/  -I./ -I./../ -I./../ -I/usr/include/p11-kit-1  -I./common -I./common       -I/usr/include/liboath  -isystem /usr/include/mit-krb5   -I/usr/include/p11-kit-1    -I./pcl/  -DOCSERV_WORKER_PROCESS -Wdate-time -D_FORTIFY_SOURCE=2  -g -O2 -Werror=implicit-function-declaration -ffile-prefix-map=/build/reproducible-path/ocserv-1.3.0=. -fstack-protector-strong -fstack-clash-protection -Wformat -Werror=format-security -fcf-protection -Wall -Wno-strict-aliasing -Wextra -Wno-unused-parameter -Wno-sign-compare -Wno-missing-field-initializers -Wno-implicit-fallthrough -Wno-stringop-truncation -c -o ocserv_worker-worker-latency.o `test -f 'worker-latency.c' || echo './'`worker-latency.c
gcc -DHAVE_CONFIG_H -I. -I..   -I../src/llhttp/  -I./ -I./../ -I./../ -I/usr/include/p11-kit-1  -I./common -I./common       -I/usr/include/liboath  -isystem /usr/include/mit-krb5   -I/usr/include/p11-kit-1    -I./pcl/  -I./occtl -I/usr/include/libnl3   -I/usr/include/x86_64-linux-gnu  -Wdate-time -D_FORTIFY_SOURCE=2  -g -O2 -Werror=implicit-function-declaration -ffile-prefix-map=/build/reproducible-path/ocserv-1.3.0=. -fstack-protector-strong -fstack-clash-protection -Wformat -Werror=format-security -fcf-protection -Wall -Wno-strict-aliasing -Wextra -Wno-unused-parameter -Wno-sign-compare -Wno-missing-field-initializers -Wno-implicit-fallthrough -Wno-stringop-truncation -c -o occtl/occtl-occtl.o `test -f 'occtl/occtl.c' || echo './'`occtl/occtl.c
gcc -DHAVE_CONFIG_H -I. -I..   -I../src/llhttp/  -I./ -I./../ -I./../ -I/usr/include/p11-kit-1  -I./common -I./common       -I/usr/include/liboath  -isystem /usr/include/mit-krb5   -I/usr/include/p11-kit-1    -I./pcl/  -I./occtl -I/usr/include/libnl3   -I/usr/include/x86_64-linux-gnu  -Wdate-time -D_FORTIFY_SOURCE=2  -g -O2 -Werror=implicit-function-declaration -ffile-prefix-map=/build/reproducible-path/ocserv-1.3.0=. -fstack-protector-strong -fstack-clash-protection -Wformat -Werror=format-security -fcf-protection -Wall -Wno-strict-aliasing -Wextra -Wno-unused-parameter -Wno-sign-compare -Wno-missing-field-initializers -Wno-implicit-fallthrough -Wno-stringop-truncation -c -o occtl/occtl-pager.o `test -f 'occtl/pager.c' || echo './'`occtl/pager.c
gcc -DHAVE_CONFIG_H -I. -I..   -I../src/llhttp/  -I./ -I./../ -I./../ -I/usr/include/p11-kit-1  -I./common -I./common       -I/usr/include/liboath  -isystem /usr/include/mit-krb5   -I/usr/include/p11-kit-1    -I./pcl/  -I./occtl -I/usr/include/libnl3   -I/usr/include/x86_64-linux-gnu  -Wdate-time -D_FORTIFY_SOURCE=2  -g -O2 -Werror=implicit-function-declaration -ffile-prefix-map=/build/reproducible-path/ocserv-1.3.0=. -fstack-protector-strong -fstack-clash-protection -Wformat -Werror=format-security -fcf-protection -Wall -Wno-strict-aliasing -Wextra -Wno-unused-parameter -Wno-sign-compare -Wno-missing-field-initializers -Wno-implicit-fallthrough -Wno-stringop-truncation -c -o occtl/occtl-time.o `test -f 'occtl/time.c' || echo './'`occtl/time.c
gcc -DHAVE_CONFIG_H -I. -I..   -I../src/llhttp/  -I./ -I./../ -I./../ -I/usr/include/p11-kit-1  -I./common -I./common       -I/usr/include/liboath  -isystem /usr/include/mit-krb5   -I/usr/include/p11-kit-1    -I./pcl/  -I./occtl -I/usr/include/libnl3   -I/usr/include/x86_64-linux-gnu  -Wdate-time -D_FORTIFY_SOURCE=2  -g -O2 -Werror=implicit-function-declaration -ffile-prefix-map=/build/reproducible-path/ocserv-1.3.0=. -fstack-protector-strong -fstack-clash-protection -Wformat -Werror=format-security -fcf-protection -Wall -Wno-strict-aliasing -Wextra -Wno-unused-parameter -Wno-sign-compare -Wno-missing-field-initializers -Wno-implicit-fallthrough -Wno-stringop-truncation -c -o occtl/occtl-cache.o `test -f 'occtl/cache.c' || echo './'`occtl/cache.c
gcc -DHAVE_CONFIG_H -I. -I..   -I../src/llhttp/  -I./ -I./../ -I./../ -I/usr/include/p11-kit-1  -I./common -I./common       -I/usr/include/liboath  -isystem /usr/include/mit-krb5   -I/usr/include/p11-kit-1    -I./pcl/  -I./occtl -I/usr/include/libnl3   -I/usr/include/x86_64-linux-gnu  -Wdate-time -D_FORTIFY_SOURCE=2  -g -O2 -Werror=implicit-function-declaration -ffile-prefix-map=/build/reproducible-path/ocserv-1.3.0=. -fstack-protector-strong -fstack-clash-protection -Wformat -Werror=format-security -fcf-protection -Wall -Wno-strict-aliasing -Wextra -Wno-unused-parameter -Wno-sign-compare -Wno-missing-field-initializers -Wno-implicit-fallthrough -Wno-stringop-truncation -c -o occtl/occtl-ip-cache.o `test -f 'occtl/ip-cache.c' || echo './'`occtl/ip-cache.c
gcc -DHAVE_CONFIG_H -I. -I..   -I../src/llhttp/  -I./ -I./../ -I./../ -I/usr/include/p11-kit-1  -I./common -I./common       -I/usr/include/liboath  -isystem /usr/include/mit-krb5   -I/usr/include/p11-kit-1    -I./pcl/  -I./occtl -I/usr/include/libnl3   -I/usr/include/x86_64-linux-gnu  -Wdate-time -D_FORTIFY_SOURCE=2  -g -O2 -Werror=implicit-function-declaration -ffile-prefix-map=/build/reproducible-path/ocserv-1.3.0=. -fstack-protector-strong -fstack-clash-protection -Wformat -Werror=format-security -fcf-protection -Wall -Wno-strict-aliasing -Wextra -Wno-unused-parameter -Wno-sign-compare -Wno-missing-field-initializers -Wno-implicit-fallthrough -Wno-stringop-truncation -c -o occtl/occtl-nl.o `test -f 'occtl/nl.c' || echo './'`occtl/nl.c
gcc -DHAVE_CONFIG_H -I. -I..   -I../src/llhttp/  -I./ -I./../ -I./../ -I/usr/include/p11-kit-1  -I./common -I./common       -I/usr/include/liboath  -isystem /usr/include/mit-krb5   -I/usr/include/p11-kit-1    -I./pcl/  -I./occtl -I/usr/include/libnl3   -I/usr/include/x86_64-linux-gnu  -Wdate-time -D_FORTIFY_SOURCE=2  -g -O2 -Werror=implicit-function-declaration -ffile-prefix-map=/build/reproducible-path/ocserv-1.3.0=. -fstack-protector-strong -fstack-clash-protection -Wformat -Werror=format-security -fcf-protection -Wall -Wno-strict-aliasing -Wextra -Wno-unused-parameter -Wno-sign-compare -Wno-missing-field-initializers -Wno-implicit-fallthrough -Wno-stringop-truncation -c -o occtl/occtl-print.o `test -f 'occtl/print.c' || echo './'`occtl/print.c
gcc -DHAVE_CONFIG_H -I. -I..   -I../src/llhttp/  -I./ -I./../ -I./../ -I/usr/include/p11-kit-1  -I./common -I./common       -I/usr/include/liboath  -isystem /usr/include/mit-krb5   -I/usr/include/p11-kit-1    -I./pcl/  -I./occtl -I/usr/include/libnl3   -I/usr/include/x86_64-linux-gnu  -Wdate-time -D_FORTIFY_SOURCE=2  -g -O2 -Werror=implicit-function-declaration -ffile-prefix-map=/build/reproducible-path/ocserv-1.3.0=. -fstack-protector-strong -fstack-clash-protection -Wformat -Werror=format-security -fcf-protection -Wall -Wno-strict-aliasing -Wextra -Wno-unused-parameter -Wno-sign-compare -Wno-missing-field-initializers -Wno-implicit-fallthrough -Wno-stringop-truncation -c -o occtl/occtl-json.o `test -f 'occtl/json.c' || echo './'`occtl/json.c
gcc -DHAVE_CONFIG_H -I. -I..   -I../src/llhttp/  -I./ -I./../ -I./../ -I/usr/include/p11-kit-1  -I./common -I./common       -I/usr/include/liboath  -isystem /usr/include/mit-krb5   -I/usr/include/p11-kit-1    -I./pcl/  -I./occtl -I/usr/include/libnl3   -I/usr/include/x86_64-linux-gnu  -Wdate-time -D_FORTIFY_SOURCE=2  -g -O2 -Werror=implicit-function-declaration -ffile-prefix-map=/build/reproducible-path/ocserv-1.3.0=. -fstack-protector-strong -fstack-clash-protection -Wformat -Werror=format-security -fcf-protection -Wall -Wno-strict-aliasing -Wextra -Wno-unused-parameter -Wno-sign-compare -Wno-missing-field-initializers -Wno-implicit-fallthrough -Wno-stringop-truncation -c -o occtl/occtl-unix.o `test -f 'occtl/unix.c' || echo './'`occtl/unix.c
gcc -DHAVE_CONFIG_H -I. -I..   -I../src/llhttp/  -I./ -I./../ -I./../ -I/usr/include/p11-kit-1  -I./common -I./common       -I/usr/include/liboath  -isystem /usr/include/mit-krb5   -I/usr/include/p11-kit-1    -I./pcl/  -I./occtl -I/usr/include/libnl3   -I/usr/include/x86_64-linux-gnu  -Wdate-time -D_FORTIFY_SOURCE=2  -g -O2 -Werror=implicit-function-declaration -ffile-prefix-map=/build/reproducible-path/ocserv-1.3.0=. -fstack-protector-strong -fstack-clash-protection -Wformat -Werror=format-security -fcf-protection -Wall -Wno-strict-aliasing -Wextra -Wno-unused-parameter -Wno-sign-compare -Wno-missing-field-initializers -Wno-implicit-fallthrough -Wno-stringop-truncation -c -o occtl/occtl-session-cache.o `test -f 'occtl/session-cache.c' || echo './'`occtl/session-cache.c
gcc -DHAVE_CONFIG_H -I. -I..   -I../src/llhttp/  -I./ -I./../ -I./../ -I/usr/include/p11-kit-1  -I./common -I./common       -I/usr/include/liboath  -isystem /usr/include/mit-krb5   -I/usr/include/p11-kit-1    -I./pcl/  -I./occtl -I/usr/include/libnl3   -I/usr/include/x86_64-linux-gnu  -Wdate-time -D_FORTIFY_SOURCE=2  -g -O2 -Werror=implicit-function-declaration -ffile-prefix-map=/build/reproducible-path/ocserv-1.3.0=. -fstack-protector-strong -fstack-clash-protection -Wformat -Werror=format-security -fcf-protection -Wall -Wno-strict-aliasing -Wextra -Wno-unused-parameter -Wno-sign-compare -Wno-missing-field-initializers -Wno-implicit-fallthrough -Wno-stringop-truncation -c -o occtl/occtl-maxmind.o `test -f 'occtl/maxmind.c' || echo './'`occtl/maxmind.c
gcc -DHAVE_CONFIG_H -I. -I..   -I../src/llhttp/  -I./ -I./../ -I./../ -I/usr/include/p11-kit-1  -I./common -I./common       -I/usr/include/liboath  -isystem /usr/include/mit-krb5   -I/usr/include/p11-kit-1    -I./pcl/  -I./common -Wdate-time -D_FORTIFY_SOURCE=2  -g -O2 -Werror=implicit-function-declaration -ffile-prefix-map=/build/reproducible-path/ocserv-1.3.0=. -fstack-protector-strong -fstack-clash-protection -Wformat -Werror=format-security -fcf-protection -Wall -Wno-strict-aliasing -Wextra -Wno-unused-parameter -Wno-sign-compare -Wno-missing-field-initializers -Wno-implicit-fallthrough -Wno-stringop-truncation -c -o common/libcommon_a-common.o `test -f 'common/common.c' || echo './'`common/common.c
gcc -DHAVE_CONFIG_H -I. -I..   -I../src/llhttp/  -I./ -I./../ -I./../ -I/usr/include/p11-kit-1  -I./common -I./common       -I/usr/include/liboath  -isystem /usr/include/mit-krb5   -I/usr/include/p11-kit-1    -I./pcl/  -I./common -Wdate-time -D_FORTIFY_SOURCE=2  -g -O2 -Werror=implicit-function-declaration -ffile-prefix-map=/build/reproducible-path/ocserv-1.3.0=. -fstack-protector-strong -fstack-clash-protection -Wformat -Werror=format-security -fcf-protection -Wall -Wno-strict-aliasing -Wextra -Wno-unused-parameter -Wno-sign-compare -Wno-missing-field-initializers -Wno-implicit-fallthrough -Wno-stringop-truncation -c -o common/libcommon_a-system.o `test -f 'common/system.c' || echo './'`common/system.c
gcc -DHAVE_CONFIG_H -I. -I..   -I../src/llhttp/  -I./ -I./../ -I./../ -I/usr/include/p11-kit-1  -I./common -I./common       -I/usr/include/liboath  -isystem /usr/include/mit-krb5   -I/usr/include/p11-kit-1    -I./pcl/  -I./common -Wdate-time -D_FORTIFY_SOURCE=2  -g -O2 -Werror=implicit-function-declaration -ffile-prefix-map=/build/reproducible-path/ocserv-1.3.0=. -fstack-protector-strong -fstack-clash-protection -Wformat -Werror=format-security -fcf-protection -Wall -Wno-strict-aliasing -Wextra -Wno-unused-parameter -Wno-sign-compare -Wno-missing-field-initializers -Wno-implicit-fallthrough -Wno-stringop-truncation -c -o common/libcommon_a-cloexec.o `test -f 'common/cloexec.c' || echo './'`common/cloexec.c
gcc -DHAVE_CONFIG_H -I. -I..   -I../src/llhttp/  -I./ -I./../ -I./../ -I/usr/include/p11-kit-1  -I./common -I./common       -I/usr/include/liboath  -isystem /usr/include/mit-krb5   -I/usr/include/p11-kit-1    -I./pcl/  -I./common -Wdate-time -D_FORTIFY_SOURCE=2  -g -O2 -Werror=implicit-function-declaration -ffile-prefix-map=/build/reproducible-path/ocserv-1.3.0=. -fstack-protector-strong -fstack-clash-protection -Wformat -Werror=format-security -fcf-protection -Wall -Wno-strict-aliasing -Wextra -Wno-unused-parameter -Wno-sign-compare -Wno-missing-field-initializers -Wno-implicit-fallthrough -Wno-stringop-truncation -c -o common/libcommon_a-base64-helper.o `test -f 'common/base64-helper.c' || echo './'`common/base64-helper.c
gcc -DHAVE_CONFIG_H -I. -I..   -I../src/llhttp/  -I./ -I./../ -I./../ -I/usr/include/p11-kit-1  -I./common -I./common       -I/usr/include/liboath  -isystem /usr/include/mit-krb5   -I/usr/include/p11-kit-1    -I./pcl/  -I. -I./ccan -Wdate-time -D_FORTIFY_SOURCE=2  -g -O2 -Werror=implicit-function-declaration -ffile-prefix-map=/build/reproducible-path/ocserv-1.3.0=. -fstack-protector-strong -fstack-clash-protection -Wformat -Werror=format-security -fcf-protection -Wall -Wno-strict-aliasing -Wextra -Wno-unused-parameter -Wno-sign-compare -Wno-missing-field-initializers -Wno-implicit-fallthrough -Wno-stringop-truncation -c -o ccan/hash/libccan_a-hash.o `test -f 'ccan/hash/hash.c' || echo './'`ccan/hash/hash.c
gcc -DHAVE_CONFIG_H -I. -I..   -I../src/llhttp/  -I./ -I./../ -I./../ -I/usr/include/p11-kit-1  -I./common -I./common       -I/usr/include/liboath  -isystem /usr/include/mit-krb5   -I/usr/include/p11-kit-1    -I./pcl/  -I. -I./ccan -Wdate-time -D_FORTIFY_SOURCE=2  -g -O2 -Werror=implicit-function-declaration -ffile-prefix-map=/build/reproducible-path/ocserv-1.3.0=. -fstack-protector-strong -fstack-clash-protection -Wformat -Werror=format-security -fcf-protection -Wall -Wno-strict-aliasing -Wextra -Wno-unused-parameter -Wno-sign-compare -Wno-missing-field-initializers -Wno-implicit-fallthrough -Wno-stringop-truncation -c -o ccan/htable/libccan_a-htable.o `test -f 'ccan/htable/htable.c' || echo './'`ccan/htable/htable.c
gcc -DHAVE_CONFIG_H -I. -I..   -I../src/llhttp/  -I./ -I./../ -I./../ -I/usr/include/p11-kit-1  -I./common -I./common       -I/usr/include/liboath  -isystem /usr/include/mit-krb5   -I/usr/include/p11-kit-1    -I./pcl/  -I. -I./ccan -Wdate-time -D_FORTIFY_SOURCE=2  -g -O2 -Werror=implicit-function-declaration -ffile-prefix-map=/build/reproducible-path/ocserv-1.3.0=. -fstack-protector-strong -fstack-clash-protection -Wformat -Werror=format-security -fcf-protection -Wall -Wno-strict-aliasing -Wextra -Wno-unused-parameter -Wno-sign-compare -Wno-missing-field-initializers -Wno-implicit-fallthrough -Wno-stringop-truncation -c -o ccan/list/libccan_a-list.o `test -f 'ccan/list/list.c' || echo './'`ccan/list/list.c
gcc -DHAVE_CONFIG_H -I. -I..   -I../src/llhttp/  -I./ -I./../ -I./../ -I/usr/include/p11-kit-1  -I./common -I./common       -I/usr/include/liboath  -isystem /usr/include/mit-krb5   -I/usr/include/p11-kit-1    -I./pcl/  -I. -I./ccan -Wdate-time -D_FORTIFY_SOURCE=2  -g -O2 -Werror=implicit-function-declaration -ffile-prefix-map=/build/reproducible-path/ocserv-1.3.0=. -fstack-protector-strong -fstack-clash-protection -Wformat -Werror=format-security -fcf-protection -Wall -Wno-strict-aliasing -Wextra -Wno-unused-parameter -Wno-sign-compare -Wno-missing-field-initializers -Wno-implicit-fallthrough -Wno-stringop-truncation -c -o ccan/str/hex/libccan_a-hex.o `test -f 'ccan/str/hex/hex.c' || echo './'`ccan/str/hex/hex.c
gcc -DHAVE_CONFIG_H -I. -I..   -I../src/llhttp/  -I./ -I./../ -I./../ -I/usr/include/p11-kit-1  -I./common -I./common       -I/usr/include/liboath  -isystem /usr/include/mit-krb5   -I/usr/include/p11-kit-1    -I./pcl/  -I./ocpasswd -Wdate-time -D_FORTIFY_SOURCE=2  -g -O2 -Werror=implicit-function-declaration -ffile-prefix-map=/build/reproducible-path/ocserv-1.3.0=. -fstack-protector-strong -fstack-clash-protection -Wformat -Werror=format-security -fcf-protection -Wall -Wno-strict-aliasing -Wextra -Wno-unused-parameter -Wno-sign-compare -Wno-missing-field-initializers -Wno-implicit-fallthrough -Wno-stringop-truncation -c -o ocpasswd/ocpasswd-ocpasswd.o `test -f 'ocpasswd/ocpasswd.c' || echo './'`ocpasswd/ocpasswd.c
gcc -DHAVE_CONFIG_H -I. -I..   -I../src/llhttp/  -I./ -I./../ -I./../ -I/usr/include/p11-kit-1  -I./common -I./common       -I/usr/include/liboath  -isystem /usr/include/mit-krb5   -I/usr/include/p11-kit-1    -I./pcl/  -Wdate-time -D_FORTIFY_SOURCE=2  -g -O2 -Werror=implicit-function-declaration -ffile-prefix-map=/build/reproducible-path/ocserv-1.3.0=. -fstack-protector-strong -fstack-clash-protection -Wformat -Werror=format-security -fcf-protection -Wall -Wno-strict-aliasing -Wextra -Wno-unused-parameter -Wno-sign-compare -Wno-missing-field-initializers -Wno-implicit-fallthrough -Wno-stringop-truncation -c -o llhttp/llhttp.o llhttp/llhttp.c
gcc -DHAVE_CONFIG_H -I. -I..   -I../src/llhttp/  -I./ -I./../ -I./../ -I/usr/include/p11-kit-1  -I./common -I./common       -I/usr/include/liboath  -isystem /usr/include/mit-krb5   -I/usr/include/p11-kit-1    -I./pcl/  -Wdate-time -D_FORTIFY_SOURCE=2  -g -O2 -Werror=implicit-function-declaration -ffile-prefix-map=/build/reproducible-path/ocserv-1.3.0=. -fstack-protector-strong -fstack-clash-protection -Wformat -Werror=format-security -fcf-protection -Wall -Wno-strict-aliasing -Wextra -Wno-unused-parameter -Wno-sign-compare -Wno-missing-field-initializers -Wno-implicit-fallthrough -Wno-stringop-truncation -c -o llhttp/api.o llhttp/api.c
gcc -DHAVE_CONFIG_H -I. -I..   -I../src/llhttp/  -I./ -I./../ -I./../ -I/usr/include/p11-kit-1  -I./common -I./common       -I/usr/include/liboath  -isystem /usr/include/mit-krb5   -I/usr/include/p11-kit-1    -I./pcl/  -Wdate-time -D_FORTIFY_SOURCE=2  -g -O2 -Werror=implicit-function-declaration -ffile-prefix-map=/build/reproducible-path/ocserv-1.3.0=. -fstack-protector-strong -fstack-clash-protection -Wformat -Werror=format-security -fcf-protection -Wall -Wno-strict-aliasing -Wextra -Wno-unused-parameter -Wno-sign-compare -Wno-missing-field-initializers -Wno-implicit-fallthrough -Wno-stringop-truncation -c -o llhttp/http.o llhttp/http.c
gcc -DHAVE_CONFIG_H -I. -I..   -I../src/llhttp/  -I./ -I./../ -I./../ -I/usr/include/p11-kit-1  -I./common -I./common       -I/usr/include/liboath  -isystem /usr/include/mit-krb5   -I/usr/include/p11-kit-1    -I./pcl/  -Wdate-time -D_FORTIFY_SOURCE=2  -g -O2 -Werror=implicit-function-declaration -ffile-prefix-map=/build/reproducible-path/ocserv-1.3.0=. -fstack-protector-strong -fstack-clash-protection -Wformat -Werror=format-security -fcf-protection -Wall -Wno-strict-aliasing -Wextra -Wno-unused-parameter -Wno-sign-compare -Wno-missing-field-initializers -Wno-implicit-fallthrough -Wno-stringop-truncation -c -o inih/ini.o inih/ini.c
gcc -DHAVE_CONFIG_H -I. -I..   -I../src/llhttp/  -I./ -I./../ -I./../ -I/usr/include/p11-kit-1  -I./common -I./common       -I/usr/include/liboath  -isystem /usr/include/mit-krb5   -I/usr/include/p11-kit-1    -I./pcl/  -Wdate-time -D_FORTIFY_SOURCE=2  -g -O2 -Werror=implicit-function-declaration -ffile-prefix-map=/build/reproducible-path/ocserv-1.3.0=. -fstack-protector-strong -fstack-clash-protection -Wformat -Werror=format-security -fcf-protection -Wall -Wno-strict-aliasing -Wextra -Wno-unused-parameter -Wno-sign-compare -Wno-missing-field-initializers -Wno-implicit-fallthrough -Wno-stringop-truncation -c -o sup-config/file.o sup-config/file.c
gcc -DHAVE_CONFIG_H -I. -I..   -I../src/llhttp/  -I./ -I./../ -I./../ -I/usr/include/p11-kit-1  -I./common -I./common       -I/usr/include/liboath  -isystem /usr/include/mit-krb5   -I/usr/include/p11-kit-1    -I./pcl/  -Wdate-time -D_FORTIFY_SOURCE=2  -g -O2 -Werror=implicit-function-declaration -ffile-prefix-map=/build/reproducible-path/ocserv-1.3.0=. -fstack-protector-strong -fstack-clash-protection -Wformat -Werror=format-security -fcf-protection -Wall -Wno-strict-aliasing -Wextra -Wno-unused-parameter -Wno-sign-compare -Wno-missing-field-initializers -Wno-implicit-fallthrough -Wno-stringop-truncation -c -o sup-config/radius.o sup-config/radius.c
gcc -DHAVE_CONFIG_H -I. -I..   -I../src/llhttp/  -I./ -I./../ -I./../ -I/usr/include/p11-kit-1  -I./common -I./common       -I/usr/include/liboath  -isystem /usr/include/mit-krb5   -I/usr/include/p11-kit-1    -I./pcl/  -Wdate-time -D_FORTIFY_SOURCE=2  -g -O2 -Werror=implicit-function-declaration -ffile-prefix-map=/build/reproducible-path/ocserv-1.3.0=. -fstack-protector-strong -fstack-clash-protection -Wformat -Werror=format-security -fcf-protection -Wall -Wno-strict-aliasing -Wextra -Wno-unused-parameter -Wno-sign-compare -Wno-missing-field-initializers -Wno-implicit-fallthrough -Wno-stringop-truncation -c -o auth/common.o auth/common.c
gcc -DHAVE_CONFIG_H -I. -I..   -I../src/llhttp/  -I./ -I./../ -I./../ -I/usr/include/p11-kit-1  -I./common -I./common       -I/usr/include/liboath  -isystem /usr/include/mit-krb5   -I/usr/include/p11-kit-1    -I./pcl/  -Wdate-time -D_FORTIFY_SOURCE=2  -g -O2 -Werror=implicit-function-declaration -ffile-prefix-map=/build/reproducible-path/ocserv-1.3.0=. -fstack-protector-strong -fstack-clash-protection -Wformat -Werror=format-security -fcf-protection -Wall -Wno-strict-aliasing -Wextra -Wno-unused-parameter -Wno-sign-compare -Wno-missing-field-initializers -Wno-implicit-fallthrough -Wno-stringop-truncation -c -o auth/gssapi.o auth/gssapi.c
gcc -DHAVE_CONFIG_H -I. -I..   -I../src/llhttp/  -I./ -I./../ -I./../ -I/usr/include/p11-kit-1  -I./common -I./common       -I/usr/include/liboath  -isystem /usr/include/mit-krb5   -I/usr/include/p11-kit-1    -I./pcl/  -Wdate-time -D_FORTIFY_SOURCE=2  -g -O2 -Werror=implicit-function-declaration -ffile-prefix-map=/build/reproducible-path/ocserv-1.3.0=. -fstack-protector-strong -fstack-clash-protection -Wformat -Werror=format-security -fcf-protection -Wall -Wno-strict-aliasing -Wextra -Wno-unused-parameter -Wno-sign-compare -Wno-missing-field-initializers -Wno-implicit-fallthrough -Wno-stringop-truncation -c -o auth/pam.o auth/pam.c
gcc -DHAVE_CONFIG_H -I. -I..   -I../src/llhttp/  -I./ -I./../ -I./../ -I/usr/include/p11-kit-1  -I./common -I./common       -I/usr/include/liboath  -isystem /usr/include/mit-krb5   -I/usr/include/p11-kit-1    -I./pcl/  -Wdate-time -D_FORTIFY_SOURCE=2  -g -O2 -Werror=implicit-function-declaration -ffile-prefix-map=/build/reproducible-path/ocserv-1.3.0=. -fstack-protector-strong -fstack-clash-protection -Wformat -Werror=format-security -fcf-protection -Wall -Wno-strict-aliasing -Wextra -Wno-unused-parameter -Wno-sign-compare -Wno-missing-field-initializers -Wno-implicit-fallthrough -Wno-stringop-truncation -c -o auth/plain.o auth/plain.c
gcc -DHAVE_CONFIG_H -I. -I..   -I../src/llhttp/  -I./ -I./../ -I./../ -I/usr/include/p11-kit-1  -I./common -I./common       -I/usr/include/liboath  -isystem /usr/include/mit-krb5   -I/usr/include/p11-kit-1    -I./pcl/  -Wdate-time -D_FORTIFY_SOURCE=2  -g -O2 -Werror=implicit-function-declaration -ffile-prefix-map=/build/reproducible-path/ocserv-1.3.0=. -fstack-protector-strong -fstack-clash-protection -Wformat -Werror=format-security -fcf-protection -Wall -Wno-strict-aliasing -Wextra -Wno-unused-parameter -Wno-sign-compare -Wno-missing-field-initializers -Wno-implicit-fallthrough -Wno-stringop-truncation -c -o auth/radius.o auth/radius.c
gcc -DHAVE_CONFIG_H -I. -I..   -I../src/llhttp/  -I./ -I./../ -I./../ -I/usr/include/p11-kit-1  -I./common -I./common       -I/usr/include/liboath  -isystem /usr/include/mit-krb5   -I/usr/include/p11-kit-1    -I./pcl/  -Wdate-time -D_FORTIFY_SOURCE=2  -g -O2 -Werror=implicit-function-declaration -ffile-prefix-map=/build/reproducible-path/ocserv-1.3.0=. -fstack-protector-strong -fstack-clash-protection -Wformat -Werror=format-security -fcf-protection -Wall -Wno-strict-aliasing -Wextra -Wno-unused-parameter -Wno-sign-compare -Wno-missing-field-initializers -Wno-implicit-fallthrough -Wno-stringop-truncation -c -o acct/radius.o acct/radius.c
gcc -DHAVE_CONFIG_H -I. -I..   -I../src/llhttp/  -I./ -I./../ -I./../ -I/usr/include/p11-kit-1  -I./common -I./common       -I/usr/include/liboath  -isystem /usr/include/mit-krb5   -I/usr/include/p11-kit-1    -I./pcl/  -Wdate-time -D_FORTIFY_SOURCE=2  -g -O2 -Werror=implicit-function-declaration -ffile-prefix-map=/build/reproducible-path/ocserv-1.3.0=. -fstack-protector-strong -fstack-clash-protection -Wformat -Werror=format-security -fcf-protection -Wall -Wno-strict-aliasing -Wextra -Wno-unused-parameter -Wno-sign-compare -Wno-missing-field-initializers -Wno-implicit-fallthrough -Wno-stringop-truncation -c -o acct/pam.o acct/pam.c
gcc -DHAVE_CONFIG_H -I. -I..  -I./pcl -I./../ -Wdate-time -D_FORTIFY_SOURCE=2  -g -O2 -Werror=implicit-function-declaration -ffile-prefix-map=/build/reproducible-path/ocserv-1.3.0=. -fstack-protector-strong -fstack-clash-protection -Wformat -Werror=format-security -fcf-protection -Wall -Wno-strict-aliasing -Wextra -Wno-unused-parameter -Wno-sign-compare -Wno-missing-field-initializers -Wno-implicit-fallthrough -Wno-stringop-truncation -c -o pcl/libpcl_a-pcl.o `test -f 'pcl/pcl.c' || echo './'`pcl/pcl.c
gcc -DHAVE_CONFIG_H -I. -I..  -I./pcl -I./../ -Wdate-time -D_FORTIFY_SOURCE=2  -g -O2 -Werror=implicit-function-declaration -ffile-prefix-map=/build/reproducible-path/ocserv-1.3.0=. -fstack-protector-strong -fstack-clash-protection -Wformat -Werror=format-security -fcf-protection -Wall -Wno-strict-aliasing -Wextra -Wno-unused-parameter -Wno-sign-compare -Wno-missing-field-initializers -Wno-implicit-fallthrough -Wno-stringop-truncation -c -o pcl/libpcl_a-pcl_version.o `test -f 'pcl/pcl_version.c' || echo './'`pcl/pcl_version.c
gcc -DHAVE_CONFIG_H -I. -I..  -I./pcl -I./../ -Wdate-time -D_FORTIFY_SOURCE=2  -g -O2 -Werror=implicit-function-declaration -ffile-prefix-map=/build/reproducible-path/ocserv-1.3.0=. -fstack-protector-strong -fstack-clash-protection -Wformat -Werror=format-security -fcf-protection -Wall -Wno-strict-aliasing -Wextra -Wno-unused-parameter -Wno-sign-compare -Wno-missing-field-initializers -Wno-implicit-fallthrough -Wno-stringop-truncation -c -o pcl/libpcl_a-pcl_private.o `test -f 'pcl/pcl_private.c' || echo './'`pcl/pcl_private.c
rm -f libipc.a
ar cr libipc.a ctl.pb-c.o ipc.pb-c.o 
ranlib libipc.a
rm -f libpcl.a
ar cr libpcl.a pcl/libpcl_a-pcl.o pcl/libpcl_a-pcl_version.o pcl/libpcl_a-pcl_private.o 
ranlib libpcl.a
rm -f libccan.a
ar cr libccan.a ccan/hash/libccan_a-hash.o ccan/htable/libccan_a-htable.o ccan/list/libccan_a-list.o ccan/str/hex/libccan_a-hex.o  
ranlib libccan.a
rm -f libcommon.a
ar cr libcommon.a common/libcommon_a-common.o common/libcommon_a-system.o common/libcommon_a-cloexec.o common/libcommon_a-base64-helper.o libcommon_a-log.o 
ranlib libcommon.a
gcc  -g -O2 -Werror=implicit-function-declaration -ffile-prefix-map=/build/reproducible-path/ocserv-1.3.0=. -fstack-protector-strong -fstack-clash-protection -Wformat -Werror=format-security -fcf-protection -Wall -Wno-strict-aliasing -Wextra -Wno-unused-parameter -Wno-sign-compare -Wno-missing-field-initializers -Wno-implicit-fallthrough -Wno-stringop-truncation  -Wl,-z,relro -Wl,-z,now -o ocpasswd/ocpasswd ocpasswd/ocpasswd-ocpasswd.o -lgnutls  /usr/lib/x86_64-linux-gnu/libcrypt.so  -lnettle  
gcc  -g -O2 -Werror=implicit-function-declaration -ffile-prefix-map=/build/reproducible-path/ocserv-1.3.0=. -fstack-protector-strong -fstack-clash-protection -Wformat -Werror=format-security -fcf-protection -Wall -Wno-strict-aliasing -Wextra -Wno-unused-parameter -Wno-sign-compare -Wno-missing-field-initializers -Wno-implicit-fallthrough -Wno-stringop-truncation  -Wl,-z,relro -Wl,-z,now -o occtl/occtl occtl/occtl-occtl.o occtl/occtl-pager.o occtl/occtl-time.o occtl/occtl-cache.o occtl/occtl-ip-cache.o occtl/occtl-nl.o occtl/occtl-print.o occtl/occtl-json.o occtl/occtl-unix.o occtl/occtl-session-cache.o occtl/occtl-maxmind.o  libcommon.a /usr/lib/x86_64-linux-gnu/libreadline.so -lnl-route-3 -lnl-3  -lprotobuf-c  -ltalloc  libccan.a libipc.a -lprotobuf-c   -lnettle  -lmaxminddb   
gcc  -g -O2 -Werror=implicit-function-declaration -ffile-prefix-map=/build/reproducible-path/ocserv-1.3.0=. -fstack-protector-strong -fstack-clash-protection -Wformat -Werror=format-security -fcf-protection -Wall -Wno-strict-aliasing -Wextra -Wno-unused-parameter -Wno-sign-compare -Wno-missing-field-initializers -Wno-implicit-fallthrough -Wno-stringop-truncation  -Wl,-z,relro -Wl,-z,now -o ocserv-worker llhttp/ocserv_worker-llhttp.o llhttp/ocserv_worker-api.o llhttp/ocserv_worker-http.o common/ocserv_worker-hmac.o common/ocserv_worker-snapshot.o ocserv_worker-config.o ocserv_worker-config-kkdcp.o ocserv_worker-config-ports.o inih/ocserv_worker-ini.o ocserv_worker-ip-util.o ocserv_worker-setproctitle.o ocserv_worker-str.o ocserv_worker-subconfig.o sup-config/ocserv_worker-file.o sup-config/ocserv_worker-radius.o ocserv_worker-tlslib.o ocserv_worker-valid-hostname.o ocserv_worker-vasprintf.o ocserv_worker-worker-log.o ocserv_worker-lzs.o ocserv_worker-kkdcp_asn1_tab.o ocserv_worker-html.o ocserv_worker-worker.o ocserv_worker-worker-auth.o ocserv_worker-worker-bandwidth.o ocserv_worker-worker-http.o ocserv_worker-worker-http-handlers.o ocserv_worker-worker-kkdcp.o ocserv_worker-worker-misc.o ocserv_worker-worker-privs.o ocserv_worker-worker-proxyproto.o ocserv_worker-worker-resume.o ocserv_worker-worker-vpn.o ocserv_worker-worker-svc.o ocserv_worker-worker-tun.o ocserv_worker-isolate.o ocserv_worker-worker-latency.o libccan.a libcommon.a -lgnutls  -lpam -lutil /usr/lib/x86_64-linux-gnu/libseccomp.so  /usr/lib/x86_64-linux-gnu/libcrypt.so  -lprotobuf-c  /usr/lib/x86_64-linux-gnu/libsystemd.so -ltalloc  -lradcli  -llz4 -lxxhash  -L/usr/lib/x86_64-linux-gnu/mit-krb5 -lgssapi_krb5  -ltasn1  -loath  -lnettle  /usr/lib/x86_64-linux-gnu/libev.so libipc.a -lprotobuf-c     libpcl.a -lm 
gcc  -g -O2 -Werror=implicit-function-declaration -ffile-prefix-map=/build/reproducible-path/ocserv-1.3.0=. -fstack-protector-strong -fstack-clash-protection -Wformat -Werror=format-security -fcf-protection -Wall -Wno-strict-aliasing -Wextra -Wno-unused-parameter -Wno-sign-compare -Wno-missing-field-initializers -Wno-implicit-fallthrough -Wno-stringop-truncation  -Wl,-z,relro -Wl,-z,now -o ocserv llhttp/llhttp.o llhttp/api.o llhttp/http.o common/hmac.o common/snapshot.o config.o config-kkdcp.o config-ports.o inih/ini.o ip-util.o setproctitle.o str.o subconfig.o sup-config/file.o sup-config/radius.o tlslib.o valid-hostname.o vasprintf.o worker-log.o lzs.o kkdcp_asn1_tab.o auth/common.o auth/gssapi.o auth/pam.o auth/plain.o auth/radius.o auth-unix.o  acct/radius.o acct/pam.o main.o main-auth.o main-ban.o main-ctl-unix.o main-proc.o main-sec-mod-cmd.o main-user.o main-worker-cmd.o proc-search.o route-add.o sec-mod.o sec-mod-auth.o sec-mod-cookies.o sec-mod-db.o sec-mod-resume.o sec-mod-sup-config.o common/sockdiag.o namespace.o main-log.o icmp-ping.o ip-lease.o tun.o main-limits.o libccan.a libcommon.a -lgnutls  -lpam -lutil /usr/lib/x86_64-linux-gnu/libseccomp.so  /usr/lib/x86_64-linux-gnu/libcrypt.so  -lprotobuf-c  /usr/lib/x86_64-linux-gnu/libsystemd.so -ltalloc  -lradcli  -llz4 -lxxhash  -L/usr/lib/x86_64-linux-gnu/mit-krb5 -lgssapi_krb5  -ltasn1  -loath  -lnettle  /usr/lib/x86_64-linux-gnu/libev.so libipc.a -lprotobuf-c     libpcl.a 
make[4]: Leaving directory '/build/reproducible-path/ocserv-1.3.0/src'
make[3]: Leaving directory '/build/reproducible-path/ocserv-1.3.0/src'
Making all in doc
make[3]: Entering directory '/build/reproducible-path/ocserv-1.3.0/doc'
make[3]: Nothing to be done for 'all'.
make[3]: Leaving directory '/build/reproducible-path/ocserv-1.3.0/doc'
Making all in tests
make[3]: Entering directory '/build/reproducible-path/ocserv-1.3.0/tests'
make[3]: Nothing to be done for 'all'.
make[3]: Leaving directory '/build/reproducible-path/ocserv-1.3.0/tests'
make[3]: Entering directory '/build/reproducible-path/ocserv-1.3.0'
make[3]: Leaving directory '/build/reproducible-path/ocserv-1.3.0'
make[2]: Leaving directory '/build/reproducible-path/ocserv-1.3.0'
make[1]: Leaving directory '/build/reproducible-path/ocserv-1.3.0'
   debian/rules override_dh_auto_test
make[1]: Entering directory '/build/reproducible-path/ocserv-1.3.0'
# Most of them need root, actually test them in debci instead
dh_auto_test
	make -j42 check "TESTSUITEFLAGS=-j42 --verbose" VERBOSE=1
make[2]: Entering directory '/build/reproducible-path/ocserv-1.3.0'
Making check in src
make[3]: Entering directory '/build/reproducible-path/ocserv-1.3.0/src'
make  check-am
make[4]: Entering directory '/build/reproducible-path/ocserv-1.3.0/src'
make[4]: Nothing to be done for 'check-am'.
make[4]: Leaving directory '/build/reproducible-path/ocserv-1.3.0/src'
make[3]: Leaving directory '/build/reproducible-path/ocserv-1.3.0/src'
Making check in doc
make[3]: Entering directory '/build/reproducible-path/ocserv-1.3.0/doc'
make[3]: Nothing to be done for 'check'.
make[3]: Leaving directory '/build/reproducible-path/ocserv-1.3.0/doc'
Making check in tests
make[3]: Entering directory '/build/reproducible-path/ocserv-1.3.0/tests'
make  str-test str-test2 ipv4-prefix ipv6-prefix kkdcp-parsing json-escape ban-ips port-parsing human_addr valid-hostname url-escape html-escape cstp-recv proxyproto-v1  \
  ocpasswd-test server-cert-ed25519 server-cert-rsa-pss haproxy-connect test-iroute test-multi-cookie test-pass-script idle-timeout test-cookie-timeout test-cookie-timeout-2 test-explicit-ip test-cookie-invalidation test-user-config test-append-routes test-ban multiple-routes json test-udp-listen-host test-max-same-1 test-script-multi-user apple-ios ipv6-iface test-namespace-listen disconnect-user disconnect-user2 ping-leases test-ban-local test-client-bypass-protocol ipv6-small-net test-camouflage test-camouflage-norealm vhost-traffic defvhost-traffic session-timeout test-occtl no-ipv6-ocv3 radius-group radius-multi-group radius-otp traffic lz4-compression lzs-compression aes256-cipher aes128-cipher oc-aes256-gcm-cipher oc-aes128-gcm-cipher test-config-per-group ac-aes128-gcm-cipher ac-aes256-gcm-cipher no-dtls-cipher psk-negotiate psk-negotiate-match test-multiple-client-ip test-config-per-group-url-pass test-config-per-group-url-cert radius radius-config test-vhost test-pass test-pass-cert test-cert test-group-pass test-pass-group-cert test-pass-group-cert-no-pass test-sighup test-enc-key test-sighup-key-change test-get-cert test-san-cert test-gssapi test-pass-opt-cert test-cert-opt-pass test-gssapi-opt-pass test-gssapi-opt-cert haproxy-auth test-maintenance resumption test-group-name flowcontrol banner invalid-configs haproxy-proxyproto haproxy-proxyproto-v1 drain-server drain-server-fail test-ignore-querystring-of-post test-group-cert test-fork test-pass-svc test-cert-svc test-pam test-pam-noauth  test-otp-cert test-otp no-route-default no-route-group  test-owasp-headers test-replay
make[4]: Entering directory '/build/reproducible-path/ocserv-1.3.0/tests'
gcc -DHAVE_CONFIG_H -I. -I..   -I../src/llhttp/     -I../src/ -I../src/ -I../src/common/ -I../src/common/ -I../ -I../ -Wdate-time -D_FORTIFY_SOURCE=2  -g -O2 -Werror=implicit-function-declaration -ffile-prefix-map=/build/reproducible-path/ocserv-1.3.0=. -fstack-protector-strong -fstack-clash-protection -Wformat -Werror=format-security -fcf-protection -Wall -Wno-strict-aliasing -Wextra -Wno-unused-parameter -Wno-sign-compare -Wno-missing-field-initializers -Wno-implicit-fallthrough -Wno-stringop-truncation -c -o str-test.o str-test.c
gcc -DHAVE_CONFIG_H -I. -I..   -I../src/llhttp/     -I../src/ -I../src/ -I../src/common/ -I../src/common/ -I../ -I../ -Wdate-time -D_FORTIFY_SOURCE=2  -g -O2 -Werror=implicit-function-declaration -ffile-prefix-map=/build/reproducible-path/ocserv-1.3.0=. -fstack-protector-strong -fstack-clash-protection -Wformat -Werror=format-security -fcf-protection -Wall -Wno-strict-aliasing -Wextra -Wno-unused-parameter -Wno-sign-compare -Wno-missing-field-initializers -Wno-implicit-fallthrough -Wno-stringop-truncation -c -o str-test2.o str-test2.c
gcc -DHAVE_CONFIG_H -I. -I..   -I../src/llhttp/     -I../src/ -I../src/ -I../src/common/ -I../src/common/ -I../ -I../ -DUNDER_TEST -Wdate-time -D_FORTIFY_SOURCE=2  -g -O2 -Werror=implicit-function-declaration -ffile-prefix-map=/build/reproducible-path/ocserv-1.3.0=. -fstack-protector-strong -fstack-clash-protection -Wformat -Werror=format-security -fcf-protection -Wall -Wno-strict-aliasing -Wextra -Wno-unused-parameter -Wno-sign-compare -Wno-missing-field-initializers -Wno-implicit-fallthrough -Wno-stringop-truncation -c -o ipv4_prefix-ipv4-prefix.o `test -f 'ipv4-prefix.c' || echo './'`ipv4-prefix.c
gcc -DHAVE_CONFIG_H -I. -I..   -I../src/llhttp/     -I../src/ -I../src/ -I../src/common/ -I../src/common/ -I../ -I../ -DUNDER_TEST -Wdate-time -D_FORTIFY_SOURCE=2  -g -O2 -Werror=implicit-function-declaration -ffile-prefix-map=/build/reproducible-path/ocserv-1.3.0=. -fstack-protector-strong -fstack-clash-protection -Wformat -Werror=format-security -fcf-protection -Wall -Wno-strict-aliasing -Wextra -Wno-unused-parameter -Wno-sign-compare -Wno-missing-field-initializers -Wno-implicit-fallthrough -Wno-stringop-truncation -c -o ipv6_prefix-ipv6-prefix.o `test -f 'ipv6-prefix.c' || echo './'`ipv6-prefix.c
gcc -DHAVE_CONFIG_H -I. -I..   -I../src/llhttp/     -I../src/ -I../src/ -I../src/common/ -I../src/common/ -I../ -I../ -Wdate-time -D_FORTIFY_SOURCE=2  -g -O2 -Werror=implicit-function-declaration -ffile-prefix-map=/build/reproducible-path/ocserv-1.3.0=. -fstack-protector-strong -fstack-clash-protection -Wformat -Werror=format-security -fcf-protection -Wall -Wno-strict-aliasing -Wextra -Wno-unused-parameter -Wno-sign-compare -Wno-missing-field-initializers -Wno-implicit-fallthrough -Wno-stringop-truncation -c -o kkdcp-parsing.o kkdcp-parsing.c
gcc -DHAVE_CONFIG_H -I. -I..   -I../src/llhttp/     -I../src/ -I../src/ -I../src/common/ -I../src/common/ -I../ -I../ -Wdate-time -D_FORTIFY_SOURCE=2  -g -O2 -Werror=implicit-function-declaration -ffile-prefix-map=/build/reproducible-path/ocserv-1.3.0=. -fstack-protector-strong -fstack-clash-protection -Wformat -Werror=format-security -fcf-protection -Wall -Wno-strict-aliasing -Wextra -Wno-unused-parameter -Wno-sign-compare -Wno-missing-field-initializers -Wno-implicit-fallthrough -Wno-stringop-truncation -c -o json-escape.o json-escape.c
gcc -DHAVE_CONFIG_H -I. -I..   -I../src/llhttp/     -I../src/ -I../src/ -I../src/common/ -I../src/common/ -I../ -I../ -DUNDER_TEST -Wdate-time -D_FORTIFY_SOURCE=2  -g -O2 -Werror=implicit-function-declaration -ffile-prefix-map=/build/reproducible-path/ocserv-1.3.0=. -fstack-protector-strong -fstack-clash-protection -Wformat -Werror=format-security -fcf-protection -Wall -Wno-strict-aliasing -Wextra -Wno-unused-parameter -Wno-sign-compare -Wno-missing-field-initializers -Wno-implicit-fallthrough -Wno-stringop-truncation -c -o ban_ips-ban-ips.o `test -f 'ban-ips.c' || echo './'`ban-ips.c
gcc -DHAVE_CONFIG_H -I. -I..   -I../src/llhttp/     -I../src/ -I../src/ -I../src/common/ -I../src/common/ -I../ -I../ -DUNDER_TEST -Wdate-time -D_FORTIFY_SOURCE=2  -g -O2 -Werror=implicit-function-declaration -ffile-prefix-map=/build/reproducible-path/ocserv-1.3.0=. -fstack-protector-strong -fstack-clash-protection -Wformat -Werror=format-security -fcf-protection -Wall -Wno-strict-aliasing -Wextra -Wno-unused-parameter -Wno-sign-compare -Wno-missing-field-initializers -Wno-implicit-fallthrough -Wno-stringop-truncation -c -o port_parsing-port-parsing.o `test -f 'port-parsing.c' || echo './'`port-parsing.c
gcc -DHAVE_CONFIG_H -I. -I..   -I../src/llhttp/     -I../src/ -I../src/ -I../src/common/ -I../src/common/ -I../ -I../ -DUNDER_TEST -Wdate-time -D_FORTIFY_SOURCE=2  -g -O2 -Werror=implicit-function-declaration -ffile-prefix-map=/build/reproducible-path/ocserv-1.3.0=. -fstack-protector-strong -fstack-clash-protection -Wformat -Werror=format-security -fcf-protection -Wall -Wno-strict-aliasing -Wextra -Wno-unused-parameter -Wno-sign-compare -Wno-missing-field-initializers -Wno-implicit-fallthrough -Wno-stringop-truncation -c -o human_addr-human_addr.o `test -f 'human_addr.c' || echo './'`human_addr.c
gcc -DHAVE_CONFIG_H -I. -I..   -I../src/llhttp/     -I../src/ -I../src/ -I../src/common/ -I../src/common/ -I../ -I../ -Wdate-time -D_FORTIFY_SOURCE=2  -g -O2 -Werror=implicit-function-declaration -ffile-prefix-map=/build/reproducible-path/ocserv-1.3.0=. -fstack-protector-strong -fstack-clash-protection -Wformat -Werror=format-security -fcf-protection -Wall -Wno-strict-aliasing -Wextra -Wno-unused-parameter -Wno-sign-compare -Wno-missing-field-initializers -Wno-implicit-fallthrough -Wno-stringop-truncation -c -o valid-hostname.o valid-hostname.c
gcc -DHAVE_CONFIG_H -I. -I..   -I../src/llhttp/     -I../src/ -I../src/ -I../src/common/ -I../src/common/ -I../ -I../ -DUNDER_TEST -Wdate-time -D_FORTIFY_SOURCE=2  -g -O2 -Werror=implicit-function-declaration -ffile-prefix-map=/build/reproducible-path/ocserv-1.3.0=. -fstack-protector-strong -fstack-clash-protection -Wformat -Werror=format-security -fcf-protection -Wall -Wno-strict-aliasing -Wextra -Wno-unused-parameter -Wno-sign-compare -Wno-missing-field-initializers -Wno-implicit-fallthrough -Wno-stringop-truncation -c -o url_escape-url-escape.o `test -f 'url-escape.c' || echo './'`url-escape.c
gcc -DHAVE_CONFIG_H -I. -I..   -I../src/llhttp/     -I../src/ -I../src/ -I../src/common/ -I../src/common/ -I../ -I../ -DUNDER_TEST -Wdate-time -D_FORTIFY_SOURCE=2  -g -O2 -Werror=implicit-function-declaration -ffile-prefix-map=/build/reproducible-path/ocserv-1.3.0=. -fstack-protector-strong -fstack-clash-protection -Wformat -Werror=format-security -fcf-protection -Wall -Wno-strict-aliasing -Wextra -Wno-unused-parameter -Wno-sign-compare -Wno-missing-field-initializers -Wno-implicit-fallthrough -Wno-stringop-truncation -c -o html_escape-html-escape.o `test -f 'html-escape.c' || echo './'`html-escape.c
gcc -DHAVE_CONFIG_H -I. -I..   -I../src/llhttp/     -I../src/ -I../src/ -I../src/common/ -I../src/common/ -I../ -I../ -Wdate-time -D_FORTIFY_SOURCE=2 -g -O2 -Werror=implicit-function-declaration -ffile-prefix-map=/build/reproducible-path/ocserv-1.3.0=. -fstack-protector-strong -fstack-clash-protection -Wformat -Werror=format-security -fcf-protection -Wall -Wno-strict-aliasing -Wextra -Wno-unused-parameter -Wno-sign-compare -Wno-missing-field-initializers -Wno-implicit-fallthrough -Wno-stringop-truncation -I/usr/include/p11-kit-1   -g -O2 -Werror=implicit-function-declaration -ffile-prefix-map=/build/reproducible-path/ocserv-1.3.0=. -fstack-protector-strong -fstack-clash-protection -Wformat -Werror=format-security -fcf-protection -Wall -Wno-strict-aliasing -Wextra -Wno-unused-parameter -Wno-sign-compare -Wno-missing-field-initializers -Wno-implicit-fallthrough -Wno-stringop-truncation -c -o cstp_recv-cstp-recv.o `test -f 'cstp-recv.c' || echo './'`cstp-recv.c
gcc -DHAVE_CONFIG_H -I. -I..   -I../src/llhttp/     -I../src/ -I../src/ -I../src/common/ -I../src/common/ -I../ -I../ -Wdate-time -D_FORTIFY_SOURCE=2  -g -O2 -Werror=implicit-function-declaration -ffile-prefix-map=/build/reproducible-path/ocserv-1.3.0=. -fstack-protector-strong -fstack-clash-protection -Wformat -Werror=format-security -fcf-protection -Wall -Wno-strict-aliasing -Wextra -Wno-unused-parameter -Wno-sign-compare -Wno-missing-field-initializers -Wno-implicit-fallthrough -Wno-stringop-truncation -c -o proxyproto-v1.o proxyproto-v1.c
make[4]: Nothing to be done for 'ocpasswd-test'.
make[4]: Nothing to be done for 'server-cert-ed25519'.
make[4]: Nothing to be done for 'server-cert-rsa-pss'.
make[4]: Nothing to be done for 'haproxy-connect'.
make[4]: Nothing to be done for 'test-iroute'.
make[4]: Nothing to be done for 'test-multi-cookie'.
make[4]: Nothing to be done for 'test-pass-script'.
make[4]: Nothing to be done for 'idle-timeout'.
make[4]: Nothing to be done for 'test-cookie-timeout'.
make[4]: Nothing to be done for 'test-cookie-timeout-2'.
make[4]: Nothing to be done for 'test-explicit-ip'.
make[4]: Nothing to be done for 'test-cookie-invalidation'.
make[4]: Nothing to be done for 'test-user-config'.
make[4]: Nothing to be done for 'test-append-routes'.
make[4]: Nothing to be done for 'test-ban'.
make[4]: Nothing to be done for 'multiple-routes'.
make[4]: Nothing to be done for 'json'.
make[4]: Nothing to be done for 'test-udp-listen-host'.
make[4]: Nothing to be done for 'test-max-same-1'.
make[4]: Nothing to be done for 'test-script-multi-user'.
make[4]: Nothing to be done for 'apple-ios'.
make[4]: Nothing to be done for 'ipv6-iface'.
make[4]: Nothing to be done for 'test-namespace-listen'.
make[4]: Nothing to be done for 'disconnect-user'.
make[4]: Nothing to be done for 'disconnect-user2'.
make[4]: Nothing to be done for 'ping-leases'.
make[4]: Nothing to be done for 'test-ban-local'.
make[4]: Nothing to be done for 'test-client-bypass-protocol'.
make[4]: Nothing to be done for 'ipv6-small-net'.
make[4]: Nothing to be done for 'test-camouflage'.
make[4]: Nothing to be done for 'test-camouflage-norealm'.
make[4]: Nothing to be done for 'vhost-traffic'.
make[4]: Nothing to be done for 'defvhost-traffic'.
make[4]: Nothing to be done for 'session-timeout'.
make[4]: Nothing to be done for 'test-occtl'.
make[4]: Nothing to be done for 'no-ipv6-ocv3'.
make[4]: Nothing to be done for 'radius-group'.
make[4]: Nothing to be done for 'radius-multi-group'.
make[4]: Nothing to be done for 'radius-otp'.
make[4]: Nothing to be done for 'traffic'.
make[4]: Nothing to be done for 'lz4-compression'.
make[4]: Nothing to be done for 'lzs-compression'.
make[4]: Nothing to be done for 'aes256-cipher'.
make[4]: Nothing to be done for 'aes128-cipher'.
make[4]: Nothing to be done for 'oc-aes256-gcm-cipher'.
make[4]: Nothing to be done for 'oc-aes128-gcm-cipher'.
make[4]: Nothing to be done for 'test-config-per-group'.
make[4]: Nothing to be done for 'ac-aes128-gcm-cipher'.
make[4]: Nothing to be done for 'ac-aes256-gcm-cipher'.
make[4]: Nothing to be done for 'no-dtls-cipher'.
make[4]: Nothing to be done for 'psk-negotiate'.
make[4]: Nothing to be done for 'psk-negotiate-match'.
make[4]: Nothing to be done for 'test-multiple-client-ip'.
make[4]: Nothing to be done for 'test-config-per-group-url-pass'.
make[4]: Nothing to be done for 'test-config-per-group-url-cert'.
make[4]: Nothing to be done for 'radius'.
make[4]: Nothing to be done for 'radius-config'.
make[4]: Nothing to be done for 'test-vhost'.
make[4]: Nothing to be done for 'test-pass'.
make[4]: Nothing to be done for 'test-pass-cert'.
make[4]: Nothing to be done for 'test-cert'.
make[4]: Nothing to be done for 'test-group-pass'.
make[4]: Nothing to be done for 'test-pass-group-cert'.
make[4]: Nothing to be done for 'test-pass-group-cert-no-pass'.
make[4]: Nothing to be done for 'test-sighup'.
make[4]: Nothing to be done for 'test-enc-key'.
make[4]: Nothing to be done for 'test-sighup-key-change'.
make[4]: Nothing to be done for 'test-get-cert'.
make[4]: Nothing to be done for 'test-san-cert'.
make[4]: Nothing to be done for 'test-gssapi'.
make[4]: Nothing to be done for 'test-pass-opt-cert'.
make[4]: Nothing to be done for 'test-cert-opt-pass'.
make[4]: Nothing to be done for 'test-gssapi-opt-pass'.
make[4]: Nothing to be done for 'test-gssapi-opt-cert'.
make[4]: Nothing to be done for 'haproxy-auth'.
make[4]: Nothing to be done for 'test-maintenance'.
make[4]: Nothing to be done for 'resumption'.
make[4]: Nothing to be done for 'test-group-name'.
make[4]: Nothing to be done for 'flowcontrol'.
make[4]: Nothing to be done for 'banner'.
make[4]: Nothing to be done for 'invalid-configs'.
make[4]: Nothing to be done for 'haproxy-proxyproto'.
make[4]: Nothing to be done for 'haproxy-proxyproto-v1'.
make[4]: Nothing to be done for 'drain-server'.
make[4]: Nothing to be done for 'drain-server-fail'.
make[4]: Nothing to be done for 'test-ignore-querystring-of-post'.
make[4]: Nothing to be done for 'test-group-cert'.
make[4]: Nothing to be done for 'test-fork'.
make[4]: Nothing to be done for 'test-pass-svc'.
make[4]: Nothing to be done for 'test-cert-svc'.
make[4]: Nothing to be done for 'test-pam'.
make[4]: Nothing to be done for 'test-pam-noauth'.
make[4]: Nothing to be done for 'test-otp-cert'.
make[4]: Nothing to be done for 'test-otp'.
make[4]: Nothing to be done for 'no-route-default'.
make[4]: Nothing to be done for 'no-route-group'.
make[4]: Nothing to be done for 'test-owasp-headers'.
make[4]: Nothing to be done for 'test-replay'.
gcc  -g -O2 -Werror=implicit-function-declaration -ffile-prefix-map=/build/reproducible-path/ocserv-1.3.0=. -fstack-protector-strong -fstack-clash-protection -Wformat -Werror=format-security -fcf-protection -Wall -Wno-strict-aliasing -Wextra -Wno-unused-parameter -Wno-sign-compare -Wno-missing-field-initializers -Wno-implicit-fallthrough -Wno-stringop-truncation  -Wl,-z,relro -Wl,-z,now -o valid-hostname valid-hostname.o -ltalloc  ../src/libccan.a  
gcc  -g -O2 -Werror=implicit-function-declaration -ffile-prefix-map=/build/reproducible-path/ocserv-1.3.0=. -fstack-protector-strong -fstack-clash-protection -Wformat -Werror=format-security -fcf-protection -Wall -Wno-strict-aliasing -Wextra -Wno-unused-parameter -Wno-sign-compare -Wno-missing-field-initializers -Wno-implicit-fallthrough -Wno-stringop-truncation  -Wl,-z,relro -Wl,-z,now -o json-escape json-escape.o -ltalloc  ../src/libccan.a  
gcc  -g -O2 -Werror=implicit-function-declaration -ffile-prefix-map=/build/reproducible-path/ocserv-1.3.0=. -fstack-protector-strong -fstack-clash-protection -Wformat -Werror=format-security -fcf-protection -Wall -Wno-strict-aliasing -Wextra -Wno-unused-parameter -Wno-sign-compare -Wno-missing-field-initializers -Wno-implicit-fallthrough -Wno-stringop-truncation  -Wl,-z,relro -Wl,-z,now -o kkdcp-parsing kkdcp-parsing.o -ltalloc  ../src/libccan.a  
gcc  -g -O2 -Werror=implicit-function-declaration -ffile-prefix-map=/build/reproducible-path/ocserv-1.3.0=. -fstack-protector-strong -fstack-clash-protection -Wformat -Werror=format-security -fcf-protection -Wall -Wno-strict-aliasing -Wextra -Wno-unused-parameter -Wno-sign-compare -Wno-missing-field-initializers -Wno-implicit-fallthrough -Wno-stringop-truncation  -Wl,-z,relro -Wl,-z,now -o port-parsing port_parsing-port-parsing.o -ltalloc  ../src/libccan.a  
gcc  -g -O2 -Werror=implicit-function-declaration -ffile-prefix-map=/build/reproducible-path/ocserv-1.3.0=. -fstack-protector-strong -fstack-clash-protection -Wformat -Werror=format-security -fcf-protection -Wall -Wno-strict-aliasing -Wextra -Wno-unused-parameter -Wno-sign-compare -Wno-missing-field-initializers -Wno-implicit-fallthrough -Wno-stringop-truncation  -Wl,-z,relro -Wl,-z,now -o ipv4-prefix ipv4_prefix-ipv4-prefix.o -ltalloc  ../src/libccan.a  
gcc  -g -O2 -Werror=implicit-function-declaration -ffile-prefix-map=/build/reproducible-path/ocserv-1.3.0=. -fstack-protector-strong -fstack-clash-protection -Wformat -Werror=format-security -fcf-protection -Wall -Wno-strict-aliasing -Wextra -Wno-unused-parameter -Wno-sign-compare -Wno-missing-field-initializers -Wno-implicit-fallthrough -Wno-stringop-truncation  -Wl,-z,relro -Wl,-z,now -o human_addr human_addr-human_addr.o -ltalloc  ../src/libccan.a  
gcc  -g -O2 -Werror=implicit-function-declaration -ffile-prefix-map=/build/reproducible-path/ocserv-1.3.0=. -fstack-protector-strong -fstack-clash-protection -Wformat -Werror=format-security -fcf-protection -Wall -Wno-strict-aliasing -Wextra -Wno-unused-parameter -Wno-sign-compare -Wno-missing-field-initializers -Wno-implicit-fallthrough -Wno-stringop-truncation  -Wl,-z,relro -Wl,-z,now -o html-escape html_escape-html-escape.o -ltalloc  ../src/libccan.a  
gcc  -g -O2 -Werror=implicit-function-declaration -ffile-prefix-map=/build/reproducible-path/ocserv-1.3.0=. -fstack-protector-strong -fstack-clash-protection -Wformat -Werror=format-security -fcf-protection -Wall -Wno-strict-aliasing -Wextra -Wno-unused-parameter -Wno-sign-compare -Wno-missing-field-initializers -Wno-implicit-fallthrough -Wno-stringop-truncation  -Wl,-z,relro -Wl,-z,now -o ipv6-prefix ipv6_prefix-ipv6-prefix.o -ltalloc  ../src/libccan.a  
gcc  -g -O2 -Werror=implicit-function-declaration -ffile-prefix-map=/build/reproducible-path/ocserv-1.3.0=. -fstack-protector-strong -fstack-clash-protection -Wformat -Werror=format-security -fcf-protection -Wall -Wno-strict-aliasing -Wextra -Wno-unused-parameter -Wno-sign-compare -Wno-missing-field-initializers -Wno-implicit-fallthrough -Wno-stringop-truncation  -Wl,-z,relro -Wl,-z,now -o url-escape url_escape-url-escape.o -ltalloc  ../src/libccan.a  
gcc  -g -O2 -Werror=implicit-function-declaration -ffile-prefix-map=/build/reproducible-path/ocserv-1.3.0=. -fstack-protector-strong -fstack-clash-protection -Wformat -Werror=format-security -fcf-protection -Wall -Wno-strict-aliasing -Wextra -Wno-unused-parameter -Wno-sign-compare -Wno-missing-field-initializers -Wno-implicit-fallthrough -Wno-stringop-truncation  -Wl,-z,relro -Wl,-z,now -o str-test2 str-test2.o -ltalloc  ../src/libccan.a  
gcc  -g -O2 -Werror=implicit-function-declaration -ffile-prefix-map=/build/reproducible-path/ocserv-1.3.0=. -fstack-protector-strong -fstack-clash-protection -Wformat -Werror=format-security -fcf-protection -Wall -Wno-strict-aliasing -Wextra -Wno-unused-parameter -Wno-sign-compare -Wno-missing-field-initializers -Wno-implicit-fallthrough -Wno-stringop-truncation  -Wl,-z,relro -Wl,-z,now -o str-test str-test.o -ltalloc  ../src/libccan.a  
gcc  -g -O2 -Werror=implicit-function-declaration -ffile-prefix-map=/build/reproducible-path/ocserv-1.3.0=. -fstack-protector-strong -fstack-clash-protection -Wformat -Werror=format-security -fcf-protection -Wall -Wno-strict-aliasing -Wextra -Wno-unused-parameter -Wno-sign-compare -Wno-missing-field-initializers -Wno-implicit-fallthrough -Wno-stringop-truncation  -Wl,-z,relro -Wl,-z,now -o proxyproto-v1 proxyproto-v1.o -ltalloc  ../src/libccan.a  
gcc  -g -O2 -Werror=implicit-function-declaration -ffile-prefix-map=/build/reproducible-path/ocserv-1.3.0=. -fstack-protector-strong -fstack-clash-protection -Wformat -Werror=format-security -fcf-protection -Wall -Wno-strict-aliasing -Wextra -Wno-unused-parameter -Wno-sign-compare -Wno-missing-field-initializers -Wno-implicit-fallthrough -Wno-stringop-truncation  -Wl,-z,relro -Wl,-z,now -o ban-ips ban_ips-ban-ips.o -ltalloc  ../src/libccan.a  
gcc -g -O2 -Werror=implicit-function-declaration -ffile-prefix-map=/build/reproducible-path/ocserv-1.3.0=. -fstack-protector-strong -fstack-clash-protection -Wformat -Werror=format-security -fcf-protection -Wall -Wno-strict-aliasing -Wextra -Wno-unused-parameter -Wno-sign-compare -Wno-missing-field-initializers -Wno-implicit-fallthrough -Wno-stringop-truncation -I/usr/include/p11-kit-1   -g -O2 -Werror=implicit-function-declaration -ffile-prefix-map=/build/reproducible-path/ocserv-1.3.0=. -fstack-protector-strong -fstack-clash-protection -Wformat -Werror=format-security -fcf-protection -Wall -Wno-strict-aliasing -Wextra -Wno-unused-parameter -Wno-sign-compare -Wno-missing-field-initializers -Wno-implicit-fallthrough -Wno-stringop-truncation  -Wl,-z,relro -Wl,-z,now -o cstp-recv cstp_recv-cstp-recv.o -ltalloc  ../src/libccan.a  -lgnutls  
make[4]: Leaving directory '/build/reproducible-path/ocserv-1.3.0/tests'
make  check-TESTS
make[4]: Entering directory '/build/reproducible-path/ocserv-1.3.0/tests'
make[5]: Entering directory '/build/reproducible-path/ocserv-1.3.0/tests'
PASS: str-test
PASS: str-test2
PASS: ipv4-prefix
PASS: ipv6-prefix
PASS: kkdcp-parsing
PASS: json-escape
PASS: port-parsing
PASS: human_addr
PASS: valid-hostname
PASS: html-escape
PASS: url-escape
PASS: proxyproto-v1
FAIL: server-cert-ed25519
FAIL: server-cert-rsa-pss
FAIL: test-multi-cookie
FAIL: test-cookie-timeout
FAIL: test-iroute
FAIL: test-pass-script
FAIL: test-cookie-invalidation
FAIL: test-explicit-ip
FAIL: test-cookie-timeout-2
FAIL: test-user-config
FAIL: haproxy-connect
FAIL: test-append-routes
FAIL: test-ban
FAIL: multiple-routes
FAIL: test-script-multi-user
FAIL: test-max-same-1
FAIL: test-udp-listen-host
FAIL: apple-ios
FAIL: json
FAIL: ipv6-iface
FAIL: disconnect-user
FAIL: disconnect-user2
FAIL: ping-leases
FAIL: test-camouflage
FAIL: test-camouflage-norealm
FAIL: ipv6-small-net
FAIL: test-client-bypass-protocol
FAIL: defvhost-traffic
FAIL: vhost-traffic
PASS: ocpasswd-test
FAIL: no-ipv6-ocv3
FAIL: idle-timeout
FAIL: lz4-compression
FAIL: traffic
FAIL: radius-group
FAIL: radius-multi-group
SKIP: ac-aes256-gcm-cipher
SKIP: ac-aes128-gcm-cipher
FAIL: lzs-compression
FAIL: radius-otp
FAIL: aes128-cipher
FAIL: aes256-cipher
FAIL: oc-aes256-gcm-cipher
FAIL: oc-aes128-gcm-cipher
FAIL: test-config-per-group
FAIL: test-ban-local
FAIL: no-dtls-cipher
FAIL: psk-negotiate
FAIL: test-vhost
FAIL: test-config-per-group-url-pass
FAIL: session-timeout
FAIL: test-pass-cert
FAIL: test-pass
FAIL: test-config-per-group-url-cert
FAIL: psk-negotiate-match
FAIL: test-group-pass
FAIL: test-occtl
FAIL: test-multiple-client-ip
FAIL: test-cert
FAIL: test-pass-group-cert
FAIL: radius
FAIL: radius-config
FAIL: test-pass-group-cert-no-pass
FAIL: test-sighup
FAIL: test-enc-key
FAIL: test-sighup-key-change
FAIL: test-get-cert
FAIL: test-san-cert
FAIL: test-pass-opt-cert
FAIL: test-namespace-listen
FAIL: test-cert-opt-pass
FAIL: test-maintenance
FAIL: test-gssapi
FAIL: resumption
FAIL: haproxy-auth
FAIL: test-gssapi-opt-pass
FAIL: flowcontrol
FAIL: banner
FAIL: invalid-configs
FAIL: test-gssapi-opt-cert
FAIL: drain-server
FAIL: drain-server-fail
FAIL: test-group-cert
FAIL: test-ignore-querystring-of-post
FAIL: test-fork
FAIL: test-pass-svc
FAIL: test-group-name
FAIL: haproxy-proxyproto
FAIL: test-cert-svc
FAIL: haproxy-proxyproto-v1
FAIL: test-pam
FAIL: test-pam-noauth
FAIL: test-otp
FAIL: test-otp-cert
FAIL: no-route-default
FAIL: no-route-group
FAIL: test-owasp-headers
FAIL: test-replay
PASS: cstp-recv
PASS: ban-ips
========================================================
   OpenConnect VPN Server 1.3.0: tests/test-suite.log
========================================================

# TOTAL: 112
# PASS:  15
# SKIP:  2
# XFAIL: 0
# FAIL:  95
# XPASS: 0
# ERROR: 0

System information (uname -a): Linux 6.12.12+bpo-amd64 #1 SMP PREEMPT_DYNAMIC Debian 6.12.12-1~bpo12+1 (2025-02-23) x86_64
Distribution information (/etc/os-release):
PRETTY_NAME="Debian GNU/Linux trixie/sid"
NAME="Debian GNU/Linux"
VERSION_CODENAME=trixie
ID=debian
HOME_URL="https://www.debian.org/"
SUPPORT_URL="https://www.debian.org/support"
BUG_REPORT_URL="https://bugs.debian.org/"

.. contents:: :depth: 2

FAIL: server-cert-ed25519
=========================

You need openconnect to run this test
FAIL server-cert-ed25519 (exit status: 1)

FAIL: server-cert-rsa-pss
=========================

You need openconnect to run this test
FAIL server-cert-rsa-pss (exit status: 1)

FAIL: haproxy-connect
=====================

You need openconnect to run this test
FAIL haproxy-connect (exit status: 1)

FAIL: test-iroute
=================

You need openconnect to run this test
FAIL test-iroute (exit status: 1)

FAIL: test-multi-cookie
=======================

You need openconnect to run this test
FAIL test-multi-cookie (exit status: 1)

FAIL: test-pass-script
======================

You need openconnect to run this test
FAIL test-pass-script (exit status: 1)

FAIL: idle-timeout
==================

**************************
VPN IPv4 network: 192.168.213.0/24
VPN IPv4 server address: 192.168.213.1
VPN IPv6 network: fda9:6b69:5e24:b03:9625:cdda:5972:0/112
VPN IPv6 server address: fda9:6b69:5e24:b03:9625:cdda:5972:01
Client address: 192.168.25.51
Server address: 192.168.138.105
**************************
You need openconnect to run this test
FAIL idle-timeout (exit status: 1)

FAIL: test-cookie-timeout
=========================

You need openconnect to run this test
FAIL test-cookie-timeout (exit status: 1)

FAIL: test-cookie-timeout-2
===========================

You need openconnect to run this test
FAIL test-cookie-timeout-2 (exit status: 1)

FAIL: test-explicit-ip
======================

You need openconnect to run this test
FAIL test-explicit-ip (exit status: 1)

FAIL: test-cookie-invalidation
==============================

You need openconnect to run this test
FAIL test-cookie-invalidation (exit status: 1)

FAIL: test-user-config
======================

You need openconnect to run this test
FAIL test-user-config (exit status: 1)

FAIL: test-append-routes
========================

You need openconnect to run this test
FAIL test-append-routes (exit status: 1)

FAIL: test-ban
==============

You need openconnect to run this test
FAIL test-ban (exit status: 1)

FAIL: multiple-routes
=====================

You need openconnect to run this test
FAIL multiple-routes (exit status: 1)

FAIL: json
==========

You need openconnect to run this test
FAIL json (exit status: 1)

FAIL: test-udp-listen-host
==========================

You need openconnect to run this test
FAIL test-udp-listen-host (exit status: 1)

FAIL: test-max-same-1
=====================

You need openconnect to run this test
FAIL test-max-same-1 (exit status: 1)

FAIL: test-script-multi-user
============================

You need openconnect to run this test
FAIL test-script-multi-user (exit status: 1)

FAIL: apple-ios
===============

You need openconnect to run this test
FAIL apple-ios (exit status: 1)

FAIL: ipv6-iface
================

You need openconnect to run this test
FAIL ipv6-iface (exit status: 1)

FAIL: test-namespace-listen
===========================

**************************
VPN IPv4 network: 10.202.2.0/24
VPN IPv4 server address: 10.202.2.1
VPN IPv6 network: fd10:1060:c598:3399:579e:72c5:6ddf:0/112
VPN IPv6 server address: fd10:1060:c598:3399:579e:72c5:6ddf:01
Client address: 10.110.221.25
Server address: 10.127.168.132
**************************
**************************
Client address2: 172.26.96.185
Server address2: 192.168.1.87
**************************
You need openconnect to run this test
 * Cleaning up...
FAIL test-namespace-listen (exit status: 1)

FAIL: disconnect-user
=====================

You need openconnect to run this test
FAIL disconnect-user (exit status: 1)

FAIL: disconnect-user2
======================

You need openconnect to run this test
FAIL disconnect-user2 (exit status: 1)

FAIL: ping-leases
=================

You need openconnect to run this test
FAIL ping-leases (exit status: 1)

FAIL: test-ban-local
====================

**************************
VPN IPv4 network: 192.168.86.0/24
VPN IPv4 server address: 192.168.86.1
VPN IPv6 network: fdd8:ff44:a94d:a2d6:f490:2c60:e79e:0/112
VPN IPv6 server address: fdd8:ff44:a94d:a2d6:f490:2c60:e79e:01
Client address: 10.76.16.78
Server address: 10.50.133.215
**************************
You need openconnect to run this test
FAIL test-ban-local (exit status: 1)

FAIL: test-client-bypass-protocol
=================================

You need openconnect to run this test
FAIL test-client-bypass-protocol (exit status: 1)

FAIL: ipv6-small-net
====================

You need openconnect to run this test
FAIL ipv6-small-net (exit status: 1)

FAIL: test-camouflage
=====================

You need openconnect to run this test
FAIL test-camouflage (exit status: 1)

FAIL: test-camouflage-norealm
=============================

You need openconnect to run this test
FAIL test-camouflage-norealm (exit status: 1)

FAIL: vhost-traffic
===================

You need openconnect to run this test
FAIL vhost-traffic (exit status: 1)

FAIL: defvhost-traffic
======================

You need openconnect to run this test
FAIL defvhost-traffic (exit status: 1)

FAIL: session-timeout
=====================

**************************
VPN IPv4 network: 172.17.231.0/24
VPN IPv4 server address: 172.17.231.1
VPN IPv6 network: fd22:eb9:4031:6f68:6d5c:8c50:e16f:0/112
VPN IPv6 server address: fd22:eb9:4031:6f68:6d5c:8c50:e16f:01
Client address: 10.71.16.253
Server address: 172.17.176.91
**************************
You need openconnect to run this test
FAIL session-timeout (exit status: 1)

FAIL: test-occtl
================

**************************
VPN IPv4 network: 10.2.132.0/24
VPN IPv4 server address: 10.2.132.1
VPN IPv6 network: fd20:9775:be8c:f7ab:3dc5:1276:ecde:0/112
VPN IPv6 server address: fd20:9775:be8c:f7ab:3dc5:1276:ecde:01
Client address: 192.168.143.142
Server address: 10.243.22.169
**************************
You need openconnect to run this test
FAIL test-occtl (exit status: 1)

FAIL: no-ipv6-ocv3
==================

You need openconnect to run this test
FAIL no-ipv6-ocv3 (exit status: 1)

FAIL: radius-group
==================

You need openconnect to run this test
FAIL radius-group (exit status: 1)

FAIL: radius-multi-group
========================

You need openconnect to run this test
FAIL radius-multi-group (exit status: 1)

FAIL: radius-otp
================

You need openconnect to run this test
FAIL radius-otp (exit status: 1)

FAIL: traffic
=============

You need openconnect to run this test
FAIL traffic (exit status: 1)

FAIL: lz4-compression
=====================

You need openconnect to run this test
FAIL lz4-compression (exit status: 1)

FAIL: lzs-compression
=====================

You need openconnect to run this test
FAIL lzs-compression (exit status: 1)

FAIL: aes256-cipher
===================

You need openconnect to run this test
FAIL aes256-cipher (exit status: 1)

FAIL: aes128-cipher
===================

You need openconnect to run this test
FAIL aes128-cipher (exit status: 1)

FAIL: oc-aes256-gcm-cipher
==========================

You need openconnect to run this test
FAIL oc-aes256-gcm-cipher (exit status: 1)

FAIL: oc-aes128-gcm-cipher
==========================

You need openconnect to run this test
FAIL oc-aes128-gcm-cipher (exit status: 1)

FAIL: test-config-per-group
===========================

You need openconnect to run this test
FAIL test-config-per-group (exit status: 1)

SKIP: ac-aes128-gcm-cipher
==========================

SKIP ac-aes128-gcm-cipher (exit status: 77)

SKIP: ac-aes256-gcm-cipher
==========================

SKIP ac-aes256-gcm-cipher (exit status: 77)

FAIL: no-dtls-cipher
====================

You need openconnect to run this test
FAIL no-dtls-cipher (exit status: 1)

FAIL: psk-negotiate
===================

You need openconnect to run this test
FAIL psk-negotiate (exit status: 1)

FAIL: psk-negotiate-match
=========================

You need openconnect to run this test
FAIL psk-negotiate-match (exit status: 1)

FAIL: test-multiple-client-ip
=============================

You need openconnect to run this test
FAIL test-multiple-client-ip (exit status: 1)

FAIL: test-config-per-group-url-pass
====================================

You need openconnect to run this test
FAIL test-config-per-group-url-pass (exit status: 1)

FAIL: test-config-per-group-url-cert
====================================

You need openconnect to run this test
FAIL test-config-per-group-url-cert (exit status: 1)

FAIL: radius
============

You need openconnect to run this test
FAIL radius (exit status: 1)

FAIL: radius-config
===================

You need openconnect to run this test
FAIL radius-config (exit status: 1)

FAIL: test-vhost
================

You need openconnect to run this test
FAIL test-vhost (exit status: 1)

FAIL: test-pass
===============

You need openconnect to run this test
FAIL test-pass (exit status: 1)

FAIL: test-pass-cert
====================

You need openconnect to run this test
FAIL test-pass-cert (exit status: 1)

FAIL: test-cert
===============

You need openconnect to run this test
FAIL test-cert (exit status: 1)

FAIL: test-group-pass
=====================

You need openconnect to run this test
FAIL test-group-pass (exit status: 1)

FAIL: test-pass-group-cert
==========================

You need openconnect to run this test
FAIL test-pass-group-cert (exit status: 1)

FAIL: test-pass-group-cert-no-pass
==================================

You need openconnect to run this test
FAIL test-pass-group-cert-no-pass (exit status: 1)

FAIL: test-sighup
=================

You need openconnect to run this test
FAIL test-sighup (exit status: 1)

FAIL: test-enc-key
==================

You need openconnect to run this test
FAIL test-enc-key (exit status: 1)

FAIL: test-sighup-key-change
============================

You need openconnect to run this test
FAIL test-sighup-key-change (exit status: 1)

FAIL: test-get-cert
===================

You need openconnect to run this test
FAIL test-get-cert (exit status: 1)

FAIL: test-san-cert
===================

You need openconnect to run this test
FAIL test-san-cert (exit status: 1)

FAIL: test-gssapi
=================

/etc/gss/mech.d/mech.ntlmssp.conf
You need openconnect to run this test
FAIL test-gssapi (exit status: 1)

FAIL: test-pass-opt-cert
========================

You need openconnect to run this test
FAIL test-pass-opt-cert (exit status: 1)

FAIL: test-cert-opt-pass
========================

You need openconnect to run this test
FAIL test-cert-opt-pass (exit status: 1)

FAIL: test-gssapi-opt-pass
==========================

/etc/gss/mech.d/mech.ntlmssp.conf
You need openconnect to run this test
FAIL test-gssapi-opt-pass (exit status: 1)

FAIL: test-gssapi-opt-cert
==========================

/etc/gss/mech.d/mech.ntlmssp.conf
You need openconnect to run this test
FAIL test-gssapi-opt-cert (exit status: 1)

FAIL: haproxy-auth
==================

You need openconnect to run this test
FAIL haproxy-auth (exit status: 1)

FAIL: test-maintenance
======================

You need openconnect to run this test
FAIL test-maintenance (exit status: 1)

FAIL: resumption
================

You need openconnect to run this test
FAIL resumption (exit status: 1)

FAIL: test-group-name
=====================

You need openconnect to run this test
FAIL test-group-name (exit status: 1)

FAIL: flowcontrol
=================

You need openconnect to run this test
FAIL flowcontrol (exit status: 1)

FAIL: banner
============

You need openconnect to run this test
FAIL banner (exit status: 1)

FAIL: invalid-configs
=====================

You need openconnect to run this test
FAIL invalid-configs (exit status: 1)

FAIL: haproxy-proxyproto
========================

You need openconnect to run this test
FAIL haproxy-proxyproto (exit status: 1)

FAIL: haproxy-proxyproto-v1
===========================

You need openconnect to run this test
FAIL haproxy-proxyproto-v1 (exit status: 1)

FAIL: drain-server
==================

You need openconnect to run this test
FAIL drain-server (exit status: 1)

FAIL: drain-server-fail
=======================

You need openconnect to run this test
FAIL drain-server-fail (exit status: 1)

FAIL: test-ignore-querystring-of-post
=====================================

You need openconnect to run this test
FAIL test-ignore-querystring-of-post (exit status: 1)

FAIL: test-group-cert
=====================

You need openconnect to run this test
FAIL test-group-cert (exit status: 1)

FAIL: test-fork
===============

You need openconnect to run this test
FAIL test-fork (exit status: 1)

FAIL: test-pass-svc
===================

You need openconnect to run this test
FAIL test-pass-svc (exit status: 1)

FAIL: test-cert-svc
===================

You need openconnect to run this test
FAIL test-cert-svc (exit status: 1)

FAIL: test-pam
==============

You need openconnect to run this test
FAIL test-pam (exit status: 1)

FAIL: test-pam-noauth
=====================

You need openconnect to run this test
FAIL test-pam-noauth (exit status: 1)

FAIL: test-otp-cert
===================

You need openconnect to run this test
FAIL test-otp-cert (exit status: 1)

FAIL: test-otp
==============

You need openconnect to run this test
FAIL test-otp (exit status: 1)

FAIL: no-route-default
======================

You need openconnect to run this test
FAIL no-route-default (exit status: 1)

FAIL: no-route-group
====================

You need openconnect to run this test
FAIL no-route-group (exit status: 1)

FAIL: test-owasp-headers
========================

You need openconnect to run this test
FAIL test-owasp-headers (exit status: 1)

FAIL: test-replay
=================

You need openconnect to run this test
FAIL test-replay (exit status: 1)

============================================================================
Testsuite summary for OpenConnect VPN Server 1.3.0
============================================================================
# TOTAL: 112
# PASS:  15
# SKIP:  2
# XFAIL: 0
# FAIL:  95
# XPASS: 0
# ERROR: 0
============================================================================
See tests/test-suite.log for debugging.
Some test(s) failed.  Please report this to https://gitlab.com/openconnect/ocserv/-/issues,
together with the test-suite.log file (gzipped) and your system
information.  Thanks.
============================================================================
make[5]: *** [Makefile:1193: test-suite.log] Error 1
make[5]: Leaving directory '/build/reproducible-path/ocserv-1.3.0/tests'
make[4]: *** [Makefile:1328: check-TESTS] Error 2
make[4]: Leaving directory '/build/reproducible-path/ocserv-1.3.0/tests'
make[3]: *** [Makefile:2198: check-am] Error 2
make[3]: Leaving directory '/build/reproducible-path/ocserv-1.3.0/tests'
make[2]: *** [Makefile:516: check-recursive] Error 1
make[2]: Leaving directory '/build/reproducible-path/ocserv-1.3.0'
dh_auto_test: error: make -j42 check "TESTSUITEFLAGS=-j42 --verbose" VERBOSE=1 returned exit code 2
make[1]: [debian/rules:27: override_dh_auto_test] Error 25 (ignored)
make[1]: Leaving directory '/build/reproducible-path/ocserv-1.3.0'
   create-stamp debian/debhelper-build-stamp
   dh_prep
   dh_auto_install --destdir=debian/ocserv/
	make -j42 install DESTDIR=/build/reproducible-path/ocserv-1.3.0/debian/ocserv AM_UPDATE_INFO_DIR=no
make[1]: Entering directory '/build/reproducible-path/ocserv-1.3.0'
Making install in src
make[2]: Entering directory '/build/reproducible-path/ocserv-1.3.0/src'
make  install-am
make[3]: Entering directory '/build/reproducible-path/ocserv-1.3.0/src'
make[4]: Entering directory '/build/reproducible-path/ocserv-1.3.0/src'
 /usr/bin/mkdir -p '/build/reproducible-path/ocserv-1.3.0/debian/ocserv/usr/bin'
 /usr/bin/mkdir -p '/build/reproducible-path/ocserv-1.3.0/debian/ocserv/usr/libexec'
make[4]: Nothing to be done for 'install-data-am'.
 /usr/bin/mkdir -p '/build/reproducible-path/ocserv-1.3.0/debian/ocserv/usr/sbin'
 /usr/bin/install -c ocserv-fw '/build/reproducible-path/ocserv-1.3.0/debian/ocserv/usr/libexec'
  /usr/bin/install -c occtl/occtl ocpasswd/ocpasswd '/build/reproducible-path/ocserv-1.3.0/debian/ocserv/usr/bin'
  /usr/bin/install -c ocserv ocserv-worker '/build/reproducible-path/ocserv-1.3.0/debian/ocserv/usr/sbin'
make[4]: Leaving directory '/build/reproducible-path/ocserv-1.3.0/src'
make[3]: Leaving directory '/build/reproducible-path/ocserv-1.3.0/src'
make[2]: Leaving directory '/build/reproducible-path/ocserv-1.3.0/src'
Making install in doc
make[2]: Entering directory '/build/reproducible-path/ocserv-1.3.0/doc'
make[3]: Entering directory '/build/reproducible-path/ocserv-1.3.0/doc'
make[3]: Nothing to be done for 'install-exec-am'.
 /usr/bin/mkdir -p '/build/reproducible-path/ocserv-1.3.0/debian/ocserv/usr/share/man/man8'
 /usr/bin/install -c -m 644 ocserv.8 ocpasswd.8 occtl.8 '/build/reproducible-path/ocserv-1.3.0/debian/ocserv/usr/share/man/man8'
make[3]: Leaving directory '/build/reproducible-path/ocserv-1.3.0/doc'
make[2]: Leaving directory '/build/reproducible-path/ocserv-1.3.0/doc'
Making install in tests
make[2]: Entering directory '/build/reproducible-path/ocserv-1.3.0/tests'
make[3]: Entering directory '/build/reproducible-path/ocserv-1.3.0/tests'
make[3]: Nothing to be done for 'install-exec-am'.
make[3]: Nothing to be done for 'install-data-am'.
make[3]: Leaving directory '/build/reproducible-path/ocserv-1.3.0/tests'
make[2]: Leaving directory '/build/reproducible-path/ocserv-1.3.0/tests'
make[2]: Entering directory '/build/reproducible-path/ocserv-1.3.0'
make[3]: Entering directory '/build/reproducible-path/ocserv-1.3.0'
make[3]: Nothing to be done for 'install-exec-am'.
make[3]: Nothing to be done for 'install-data-am'.
make[3]: Leaving directory '/build/reproducible-path/ocserv-1.3.0'
make[2]: Leaving directory '/build/reproducible-path/ocserv-1.3.0'
make[1]: Leaving directory '/build/reproducible-path/ocserv-1.3.0'
   dh_install
   dh_installdocs
   dh_installchangelogs
   dh_installman
   dh_installinit
   debian/rules override_dh_installsystemd
make[1]: Entering directory '/build/reproducible-path/ocserv-1.3.0'
dh_installsystemd --no-stop-on-upgrade --no-enable --no-start ocserv.service
make[1]: Leaving directory '/build/reproducible-path/ocserv-1.3.0'
   dh_installpam
   dh_lintian
   dh_perl
   dh_link
   dh_strip_nondeterminism
   dh_compress
   dh_fixperms
   dh_missing
   dh_dwz -a
   dh_strip -a
   dh_makeshlibs -a
   dh_shlibdeps -a
dpkg-shlibdeps: warning: diversions involved - output may be incorrect
 diversion by libreadline8t64 from: /lib/x86_64-linux-gnu/libreadline.so.8
dpkg-shlibdeps: warning: diversions involved - output may be incorrect
 diversion by libreadline8t64 to: /lib/x86_64-linux-gnu/libreadline.so.8.usr-is-merged
   dh_movetousr
   dh_installdeb
   dh_gencontrol
   dh_md5sums
   dh_builddeb
dpkg-deb: building package 'ocserv-dbgsym' in '../ocserv-dbgsym_1.3.0-1_amd64.deb'.
dpkg-deb: building package 'ocserv' in '../ocserv_1.3.0-1_amd64.deb'.
 dpkg-genbuildinfo --build=binary -O../ocserv_1.3.0-1_amd64.buildinfo
 dpkg-genchanges --build=binary -O../ocserv_1.3.0-1_amd64.changes
dpkg-genchanges: info: binary-only upload (no source code included)
 dpkg-source --after-build .
dpkg-buildpackage: info: binary-only upload (no source included)
dpkg-genchanges: info: including full source code in upload
I: copying local configuration
I: unmounting dev/ptmx filesystem
I: unmounting dev/pts filesystem
I: unmounting dev/shm filesystem
I: unmounting proc filesystem
I: unmounting sys filesystem
I: cleaning the build env 
I: removing directory /srv/workspace/pbuilder/822881 and its subdirectories
I: Current time: Thu Apr  9 23:49:49 -12 2026
I: pbuilder-time-stamp: 1775821789
Sat Mar  8 05:26:51 UTC 2025  I: 1st build successful. Starting 2nd build on remote node ionos11-amd64.debian.net.
Sat Mar  8 05:26:51 UTC 2025  I: Preparing to do remote build '2' on ionos11-amd64.debian.net.
Sat Mar  8 05:34:42 UTC 2025  I: Deleting $TMPDIR on ionos11-amd64.debian.net.
Sat Mar  8 05:34:42 UTC 2025  I: ocserv_1.3.0-1_amd64.changes:
Format: 1.8
Date: Sun, 18 Aug 2024 14:03:40 +0800
Source: ocserv
Binary: ocserv ocserv-dbgsym
Architecture: amd64
Version: 1.3.0-1
Distribution: unstable
Urgency: medium
Maintainer: Aron Xu <aron@debian.org>
Changed-By: Shengqi Chen <harry-chen@outlook.com>
Description:
 ocserv     - OpenConnect VPN server compatible with Cisco AnyConnect VPN
Closes: 1073738 1076268
Changes:
 ocserv (1.3.0-1) unstable; urgency=medium
 .
   * New upstream version 1.3.0
   * Packaging updates:
     - d/control:
       + remove autogen from B-D (closes: #1076268)
       + fix restriction lists in B-D
       + add dh-sequence-movetousr in B-D (closes: #1073738)
       + add libsystemd-dev in B-D
       + bump std-ver from 4.6.2 to 4.7.0 (no changes required)
     - d/copyright: remove non-existent files & paragraph
     - d/: add ocserv.lintian-overrides
     - d/ocserv.docs: install socket-activated systemd units as docs
     - d/rules: use dh_installsystemd to specify options
     - d/ocserv.conf: sync from upstream
   * Add Shengqi Chen to uploaders
Checksums-Sha1:
 4f526f8fa04feb0b6c3bc6834800aeb66bc981fc 918428 ocserv-dbgsym_1.3.0-1_amd64.deb
 f602a994fc48d5fc4c319957042821da6ad5970f 10447 ocserv_1.3.0-1_amd64.buildinfo
 7f033c4726abc824716fc865525002801ed822b4 522344 ocserv_1.3.0-1_amd64.deb
Checksums-Sha256:
 c33ab3e7b37d0c34c581feba95bbb7dc64b1d9a4f01041eef50b2eb87d2c7b95 918428 ocserv-dbgsym_1.3.0-1_amd64.deb
 5241e7eb1631377095839a1facb259e7b742d5f55dbbef8d7680fdf12d1f111e 10447 ocserv_1.3.0-1_amd64.buildinfo
 4276386c29134d345c3612e5b4e0f4225935c771ab4b16a24391d94164ee01a3 522344 ocserv_1.3.0-1_amd64.deb
Files:
 964e0d01ce5b6bed5bae8fdd933d5831 918428 debug optional ocserv-dbgsym_1.3.0-1_amd64.deb
 89d9d826a0594207cb0cd2d19347dbc9 10447 net optional ocserv_1.3.0-1_amd64.buildinfo
 264b4651bf39f98dee2a8cf1e35ac6d4 522344 net optional ocserv_1.3.0-1_amd64.deb
Sat Mar  8 05:34:43 UTC 2025  I: diffoscope 289 will be used to compare the two builds:
Running as unit: rb-diffoscope-amd64_8-49929.service
# Profiling output for: /usr/bin/diffoscope --timeout 7200 --html /srv/reproducible-results/rbuild-debian/r-b-build.wERMwNNu/ocserv_1.3.0-1.diffoscope.html --text /srv/reproducible-results/rbuild-debian/r-b-build.wERMwNNu/ocserv_1.3.0-1.diffoscope.txt --json /srv/reproducible-results/rbuild-debian/r-b-build.wERMwNNu/ocserv_1.3.0-1.diffoscope.json --profile=- /srv/reproducible-results/rbuild-debian/r-b-build.wERMwNNu/b1/ocserv_1.3.0-1_amd64.changes /srv/reproducible-results/rbuild-debian/r-b-build.wERMwNNu/b2/ocserv_1.3.0-1_amd64.changes

## command (total time: 0.000s)
       0.000s      1 call     cmp (internal)

## has_same_content_as (total time: 0.000s)
       0.000s      1 call     diffoscope.comparators.binary.FilesystemFile

## main (total time: 0.003s)
       0.003s      2 calls    outputs
       0.000s      1 call     cleanup
Finished with result: success
Main processes terminated with: code=exited/status=0
Service runtime: 225ms
CPU time consumed: 226ms
Sat Mar  8 05:34:44 UTC 2025  I: diffoscope 289 found no differences in the changes files, and a .buildinfo file also exists.
Sat Mar  8 05:34:44 UTC 2025  I: ocserv from trixie built successfully and reproducibly on amd64.
Sat Mar  8 05:34:45 UTC 2025  I: Submitting .buildinfo files to external archives:
Sat Mar  8 05:34:45 UTC 2025  I: Submitting 12K	b1/ocserv_1.3.0-1_amd64.buildinfo.asc
Sat Mar  8 05:34:50 UTC 2025  I: Submitting 12K	b2/ocserv_1.3.0-1_amd64.buildinfo.asc
Sat Mar  8 05:34:55 UTC 2025  I: Done submitting .buildinfo files to http://buildinfo.debian.net/api/submit.
Sat Mar  8 05:34:55 UTC 2025  I: Done submitting .buildinfo files.
Sat Mar  8 05:34:55 UTC 2025  I: Removing signed ocserv_1.3.0-1_amd64.buildinfo.asc files:
removed './b1/ocserv_1.3.0-1_amd64.buildinfo.asc'
removed './b2/ocserv_1.3.0-1_amd64.buildinfo.asc'