I: pbuilder: network access will be disabled during build
I: Current time: Sat Feb  8 03:39:06 +14 2025
I: pbuilder-time-stamp: 1738935546
I: Building the build Environment
I: extracting base tarball [/var/cache/pbuilder/unstable-reproducible-base.tgz]
I: copying local configuration
W: --override-config is not set; not updating apt.conf Read the manpage for details.
I: mounting /proc filesystem
I: mounting /sys filesystem
I: creating /{dev,run}/shm
I: mounting /dev/pts filesystem
I: redirecting /dev/ptmx to /dev/pts/ptmx
I: policy-rc.d already exists
I: using eatmydata during job
I: Copying source file
I: copying [pyfftw_0.15.0-1.dsc]
I: copying [./pyfftw_0.15.0.orig.tar.gz]
I: copying [./pyfftw_0.15.0-1.debian.tar.xz]
I: Extracting source
dpkg-source: warning: cannot verify inline signature for ./pyfftw_0.15.0-1.dsc: unsupported subcommand
dpkg-source: info: extracting pyfftw in pyfftw-0.15.0
dpkg-source: info: unpacking pyfftw_0.15.0.orig.tar.gz
dpkg-source: info: unpacking pyfftw_0.15.0-1.debian.tar.xz
dpkg-source: info: using patch list from debian/patches/series
dpkg-source: info: applying intersphinx
dpkg-source: info: applying hardening
I: Not using root during the build.
I: Installing the build-deps
I: user script /srv/workspace/pbuilder/17652/tmp/hooks/D01_modify_environment starting
debug: Running on ionos2-i386.
I: Changing host+domainname to test build reproducibility
I: Adding a custom variable just for the fun of it...
I: Changing /bin/sh to bash
'/bin/sh' -> '/bin/bash'
lrwxrwxrwx 1 root root 9 Feb  7 13:39 /bin/sh -> /bin/bash
I: Setting pbuilder2's login shell to /bin/bash
I: Setting pbuilder2's GECOS to second user,second room,second work-phone,second home-phone,second other
I: user script /srv/workspace/pbuilder/17652/tmp/hooks/D01_modify_environment finished
I: user script /srv/workspace/pbuilder/17652/tmp/hooks/D02_print_environment starting
I: set
  BASH=/bin/sh
  BASHOPTS=checkwinsize:cmdhist:complete_fullquote:extquote:force_fignore:globasciiranges:globskipdots:hostcomplete:interactive_comments:patsub_replacement:progcomp:promptvars:sourcepath
  BASH_ALIASES=()
  BASH_ARGC=()
  BASH_ARGV=()
  BASH_CMDS=()
  BASH_LINENO=([0]="12" [1]="0")
  BASH_LOADABLES_PATH=/usr/local/lib/bash:/usr/lib/bash:/opt/local/lib/bash:/usr/pkg/lib/bash:/opt/pkg/lib/bash:.
  BASH_SOURCE=([0]="/tmp/hooks/D02_print_environment" [1]="/tmp/hooks/D02_print_environment")
  BASH_VERSINFO=([0]="5" [1]="2" [2]="37" [3]="1" [4]="release" [5]="i686-pc-linux-gnu")
  BASH_VERSION='5.2.37(1)-release'
  BUILDDIR=/build/reproducible-path
  BUILDUSERGECOS='second user,second room,second work-phone,second home-phone,second other'
  BUILDUSERNAME=pbuilder2
  BUILD_ARCH=i386
  DEBIAN_FRONTEND=noninteractive
  DEB_BUILD_OPTIONS='buildinfo=+all reproducible=+all parallel=10 '
  DIRSTACK=()
  DISTRIBUTION=unstable
  EUID=0
  FUNCNAME=([0]="Echo" [1]="main")
  GROUPS=()
  HOME=/root
  HOSTNAME=i-capture-the-hostname
  HOSTTYPE=i686
  HOST_ARCH=i386
  IFS=' 	
  '
  INVOCATION_ID=6d211989f7ee4549a9beaaa098f433c7
  LANG=C
  LANGUAGE=de_CH:de
  LC_ALL=C
  LD_LIBRARY_PATH=/usr/lib/libeatmydata
  LD_PRELOAD=libeatmydata.so
  MACHTYPE=i686-pc-linux-gnu
  MAIL=/var/mail/root
  OPTERR=1
  OPTIND=1
  OSTYPE=linux-gnu
  PATH=/usr/sbin:/usr/bin:/sbin:/bin:/usr/games:/i/capture/the/path
  PBCURRENTCOMMANDLINEOPERATION=build
  PBUILDER_OPERATION=build
  PBUILDER_PKGDATADIR=/usr/share/pbuilder
  PBUILDER_PKGLIBDIR=/usr/lib/pbuilder
  PBUILDER_SYSCONFDIR=/etc
  PIPESTATUS=([0]="0")
  POSIXLY_CORRECT=y
  PPID=17652
  PS4='+ '
  PWD=/
  SHELL=/bin/bash
  SHELLOPTS=braceexpand:errexit:hashall:interactive-comments:posix
  SHLVL=3
  SUDO_COMMAND='/usr/bin/timeout -k 24.1h 24h /usr/bin/ionice -c 3 /usr/bin/nice -n 11 /usr/bin/unshare --uts -- /usr/sbin/pbuilder --build --configfile /srv/reproducible-results/rbuild-debian/r-b-build.I7pBr9RA/pbuilderrc_YP1p --distribution unstable --hookdir /etc/pbuilder/rebuild-hooks --debbuildopts -b --basetgz /var/cache/pbuilder/unstable-reproducible-base.tgz --buildresult /srv/reproducible-results/rbuild-debian/r-b-build.I7pBr9RA/b2 --logfile b2/build.log pyfftw_0.15.0-1.dsc'
  SUDO_GID=112
  SUDO_UID=107
  SUDO_USER=jenkins
  TERM=unknown
  TZ=/usr/share/zoneinfo/Etc/GMT-14
  UID=0
  USER=root
  _='I: set'
  http_proxy=http://46.16.76.132:3128
I: uname -a
  Linux i-capture-the-hostname 6.1.0-30-amd64 #1 SMP PREEMPT_DYNAMIC Debian 6.1.124-1 (2025-01-12) x86_64 GNU/Linux
I: ls -l /bin
  lrwxrwxrwx 1 root root 7 Nov 22 14:40 /bin -> usr/bin
I: user script /srv/workspace/pbuilder/17652/tmp/hooks/D02_print_environment finished
 -> Attempting to satisfy build-dependencies
 -> Creating pbuilder-satisfydepends-dummy package
Package: pbuilder-satisfydepends-dummy
Version: 0.invalid.0
Architecture: i386
Maintainer: Debian Pbuilder Team <pbuilder-maint@lists.alioth.debian.org>
Description: Dummy package to satisfy dependencies with aptitude - created by pbuilder
 This package was created automatically by pbuilder to satisfy the
 build-dependencies of the package being currently built.
Depends: debhelper-compat (= 13), dh-sequence-python3, pybuild-plugin-pyproject, cython3, libfftw3-dev, python3-all-dev, python3-numpy (>= 1:2), python3-pkgconfig, python3-scipy, python3-dask, python3-setuptools, dh-sequence-sphinxdoc, python3-sphinx, python3-pytest, sphinx-common, python3-doc, python-numpy-doc, python-scipy-doc
dpkg-deb: building package 'pbuilder-satisfydepends-dummy' in '/tmp/satisfydepends-aptitude/pbuilder-satisfydepends-dummy.deb'.
Selecting previously unselected package pbuilder-satisfydepends-dummy.
(Reading database ... 19792 files and directories currently installed.)
Preparing to unpack .../pbuilder-satisfydepends-dummy.deb ...
Unpacking pbuilder-satisfydepends-dummy (0.invalid.0) ...
dpkg: pbuilder-satisfydepends-dummy: dependency problems, but configuring anyway as you requested:
 pbuilder-satisfydepends-dummy depends on debhelper-compat (= 13); however:
  Package debhelper-compat is not installed.
 pbuilder-satisfydepends-dummy depends on dh-sequence-python3; however:
  Package dh-sequence-python3 is not installed.
 pbuilder-satisfydepends-dummy depends on pybuild-plugin-pyproject; however:
  Package pybuild-plugin-pyproject is not installed.
 pbuilder-satisfydepends-dummy depends on cython3; however:
  Package cython3 is not installed.
 pbuilder-satisfydepends-dummy depends on libfftw3-dev; however:
  Package libfftw3-dev is not installed.
 pbuilder-satisfydepends-dummy depends on python3-all-dev; however:
  Package python3-all-dev is not installed.
 pbuilder-satisfydepends-dummy depends on python3-numpy (>= 1:2); however:
  Package python3-numpy is not installed.
 pbuilder-satisfydepends-dummy depends on python3-pkgconfig; however:
  Package python3-pkgconfig is not installed.
 pbuilder-satisfydepends-dummy depends on python3-scipy; however:
  Package python3-scipy is not installed.
 pbuilder-satisfydepends-dummy depends on python3-dask; however:
  Package python3-dask is not installed.
 pbuilder-satisfydepends-dummy depends on python3-setuptools; however:
  Package python3-setuptools is not installed.
 pbuilder-satisfydepends-dummy depends on dh-sequence-sphinxdoc; however:
  Package dh-sequence-sphinxdoc is not installed.
 pbuilder-satisfydepends-dummy depends on python3-sphinx; however:
  Package python3-sphinx is not installed.
 pbuilder-satisfydepends-dummy depends on python3-pytest; however:
  Package python3-pytest is not installed.
 pbuilder-satisfydepends-dummy depends on sphinx-common; however:
  Package sphinx-common is not installed.
 pbuilder-satisfydepends-dummy depends on python3-doc; however:
  Package python3-doc is not installed.
 pbuilder-satisfydepends-dummy depends on python-numpy-doc; however:
  Package python-numpy-doc is not installed.
 pbuilder-satisfydepends-dummy depends on python-scipy-doc; however:
  Package python-scipy-doc is not installed.

Setting up pbuilder-satisfydepends-dummy (0.invalid.0) ...
Reading package lists...
Building dependency tree...
Reading state information...
Initializing package states...
Writing extended state information...
Building tag database...
pbuilder-satisfydepends-dummy is already installed at the requested version (0.invalid.0)
pbuilder-satisfydepends-dummy is already installed at the requested version (0.invalid.0)
The following NEW packages will be installed:
  autoconf{a} automake{a} autopoint{a} autotools-dev{a} bsdextrautils{a} ca-certificates{a} cython3{a} debhelper{a} dh-autoreconf{a} dh-python{a} dh-strip-nondeterminism{a} docutils-common{a} dwz{a} file{a} fonts-mathjax{a} fonts-open-sans{a} gettext{a} gettext-base{a} groff-base{a} intltool-debian{a} libarchive-zip-perl{a} libblas3{a} libcom-err2{a} libdebhelper-perl{a} libelf1t64{a} libexpat1{a} libexpat1-dev{a} libffi8{a} libfftw3-bin{a} libfftw3-dev{a} libfftw3-double3{a} libfftw3-long3{a} libfftw3-quad3{a} libfftw3-single3{a} libfile-stripnondeterminism-perl{a} libgfortran5{a} libgssapi-krb5-2{a} libicu72{a} libjs-jquery{a} libjs-mathjax{a} libjs-sphinxdoc{a} libjs-underscore{a} libjson-perl{a} libk5crypto3{a} libkeyutils1{a} libkrb5-3{a} libkrb5support0{a} liblapack3{a} liblbfgsb0{a} libmagic-mgc{a} libmagic1t64{a} libnsl2{a} libpipeline1{a} libpkgconf3{a} libpython3-all-dev{a} libpython3-dev{a} libpython3-stdlib{a} libpython3.12-dev{a} libpython3.12-minimal{a} libpython3.12-stdlib{a} libpython3.12t64{a} libpython3.13{a} libpython3.13-dev{a} libpython3.13-minimal{a} libpython3.13-stdlib{a} libreadline8t64{a} libtirpc-common{a} libtirpc3t64{a} libtool{a} libuchardet0{a} libunistring5{a} libxml2{a} libyaml-0-2{a} m4{a} man-db{a} media-types{a} netbase{a} openssl{a} pkg-config{a} pkgconf{a} pkgconf-bin{a} po-debconf{a} pybuild-plugin-pyproject{a} python-babel-localedata{a} python-numpy-doc{a} python-scipy-doc{a} python3{a} python3-alabaster{a} python3-all{a} python3-all-dev{a} python3-autocommand{a} python3-babel{a} python3-build{a} python3-certifi{a} python3-chardet{a} python3-charset-normalizer{a} python3-click{a} python3-cloudpickle{a} python3-dask{a} python3-decorator{a} python3-defusedxml{a} python3-dev{a} python3-doc{a} python3-docutils{a} python3-fsspec{a} python3-idna{a} python3-imagesize{a} python3-inflect{a} python3-iniconfig{a} python3-installer{a} python3-jaraco.context{a} python3-jaraco.functools{a} python3-jaraco.text{a} python3-jinja2{a} python3-locket{a} python3-markupsafe{a} python3-minimal{a} python3-more-itertools{a} python3-numpy{a} python3-numpy-dev{a} python3-packaging{a} python3-partd{a} python3-pkg-resources{a} python3-pkgconfig{a} python3-pluggy{a} python3-pygments{a} python3-pyproject-hooks{a} python3-pytest{a} python3-requests{a} python3-roman{a} python3-scipy{a} python3-setuptools{a} python3-snowballstemmer{a} python3-sphinx{a} python3-toml{a} python3-toolz{a} python3-typeguard{a} python3-typing-extensions{a} python3-urllib3{a} python3-wheel{a} python3-yaml{a} python3-zipp{a} python3.12{a} python3.12-dev{a} python3.12-minimal{a} python3.13{a} python3.13-dev{a} python3.13-doc{a} python3.13-minimal{a} readline-common{a} sensible-utils{a} sgml-base{a} sphinx-common{a} tzdata{a} xml-core{a} zlib1g-dev{a} 
The following packages are RECOMMENDED but will NOT be installed:
  curl git javascript-common krb5-locales libarchive-cpio-perl libjson-xs-perl libltdl-dev libmail-sendmail-perl libpaper-utils lynx python3-blosc python3-distributed python3-dropbox python3-libarchive-c python3-pandas python3-paramiko python3-pil python3-pooch python3-pygit2 python3-zmq wget 
0 packages upgraded, 156 newly installed, 0 to remove and 0 not upgraded.
Need to get 135 MB of archives. After unpacking 715 MB will be used.
Writing extended state information...
Get: 1 http://deb.debian.org/debian unstable/main i386 libpython3.13-minimal i386 3.13.2-1 [859 kB]
Get: 2 http://deb.debian.org/debian unstable/main i386 libexpat1 i386 2.6.4-1 [107 kB]
Get: 3 http://deb.debian.org/debian unstable/main i386 python3.13-minimal i386 3.13.2-1 [2266 kB]
Get: 4 http://deb.debian.org/debian unstable/main i386 python3-minimal i386 3.13.1-2 [27.0 kB]
Get: 5 http://deb.debian.org/debian unstable/main i386 media-types all 11.0.0 [27.6 kB]
Get: 6 http://deb.debian.org/debian unstable/main i386 netbase all 6.4 [12.8 kB]
Get: 7 http://deb.debian.org/debian unstable/main i386 tzdata all 2025a-2 [259 kB]
Get: 8 http://deb.debian.org/debian unstable/main i386 libffi8 i386 3.4.6-1 [21.2 kB]
Get: 9 http://deb.debian.org/debian unstable/main i386 readline-common all 8.2-6 [69.4 kB]
Get: 10 http://deb.debian.org/debian unstable/main i386 libreadline8t64 i386 8.2-6 [173 kB]
Get: 11 http://deb.debian.org/debian unstable/main i386 libpython3.13-stdlib i386 3.13.2-1 [1985 kB]
Get: 12 http://deb.debian.org/debian unstable/main i386 python3.13 i386 3.13.2-1 [745 kB]
Get: 13 http://deb.debian.org/debian unstable/main i386 libpython3-stdlib i386 3.13.1-2 [9952 B]
Get: 14 http://deb.debian.org/debian unstable/main i386 python3 i386 3.13.1-2 [28.0 kB]
Get: 15 http://deb.debian.org/debian unstable/main i386 libpython3.12-minimal i386 3.12.9-1 [816 kB]
Get: 16 http://deb.debian.org/debian unstable/main i386 python3.12-minimal i386 3.12.9-1 [2238 kB]
Get: 17 http://deb.debian.org/debian unstable/main i386 sgml-base all 1.31 [15.4 kB]
Get: 18 http://deb.debian.org/debian unstable/main i386 sensible-utils all 0.0.24 [24.8 kB]
Get: 19 http://deb.debian.org/debian unstable/main i386 openssl i386 3.4.0-2 [1427 kB]
Get: 20 http://deb.debian.org/debian unstable/main i386 ca-certificates all 20241223 [164 kB]
Get: 21 http://deb.debian.org/debian unstable/main i386 libmagic-mgc i386 1:5.45-3+b1 [314 kB]
Get: 22 http://deb.debian.org/debian unstable/main i386 libmagic1t64 i386 1:5.45-3+b1 [115 kB]
Get: 23 http://deb.debian.org/debian unstable/main i386 file i386 1:5.45-3+b1 [43.2 kB]
Get: 24 http://deb.debian.org/debian unstable/main i386 gettext-base i386 0.23.1-1 [245 kB]
Get: 25 http://deb.debian.org/debian unstable/main i386 libuchardet0 i386 0.0.8-1+b2 [69.2 kB]
Get: 26 http://deb.debian.org/debian unstable/main i386 groff-base i386 1.23.0-7 [1199 kB]
Get: 27 http://deb.debian.org/debian unstable/main i386 bsdextrautils i386 2.40.4-3 [96.2 kB]
Get: 28 http://deb.debian.org/debian unstable/main i386 libpipeline1 i386 1.5.8-1 [41.2 kB]
Get: 29 http://deb.debian.org/debian unstable/main i386 man-db i386 2.13.0-1 [1428 kB]
Get: 30 http://deb.debian.org/debian unstable/main i386 m4 i386 1.4.19-5 [301 kB]
Get: 31 http://deb.debian.org/debian unstable/main i386 autoconf all 2.72-3 [493 kB]
Get: 32 http://deb.debian.org/debian unstable/main i386 autotools-dev all 20220109.1 [51.6 kB]
Get: 33 http://deb.debian.org/debian unstable/main i386 automake all 1:1.17-3 [862 kB]
Get: 34 http://deb.debian.org/debian unstable/main i386 autopoint all 0.23.1-1 [770 kB]
Get: 35 http://deb.debian.org/debian unstable/main i386 cython3 i386 3.0.11+dfsg-1+b2 [3020 kB]
Get: 36 http://deb.debian.org/debian unstable/main i386 libdebhelper-perl all 13.24.1 [90.9 kB]
Get: 37 http://deb.debian.org/debian unstable/main i386 libtool all 2.5.4-3 [539 kB]
Get: 38 http://deb.debian.org/debian unstable/main i386 dh-autoreconf all 20 [17.1 kB]
Get: 39 http://deb.debian.org/debian unstable/main i386 libarchive-zip-perl all 1.68-1 [104 kB]
Get: 40 http://deb.debian.org/debian unstable/main i386 libfile-stripnondeterminism-perl all 1.14.1-1 [19.6 kB]
Get: 41 http://deb.debian.org/debian unstable/main i386 dh-strip-nondeterminism all 1.14.1-1 [8584 B]
Get: 42 http://deb.debian.org/debian unstable/main i386 libelf1t64 i386 0.192-4 [195 kB]
Get: 43 http://deb.debian.org/debian unstable/main i386 dwz i386 0.15-1+b1 [116 kB]
Get: 44 http://deb.debian.org/debian unstable/main i386 libunistring5 i386 1.3-1 [458 kB]
Get: 45 http://deb.debian.org/debian unstable/main i386 libicu72 i386 72.1-6 [9582 kB]
Get: 46 http://deb.debian.org/debian unstable/main i386 libxml2 i386 2.12.7+dfsg+really2.9.14-0.2+b1 [734 kB]
Get: 47 http://deb.debian.org/debian unstable/main i386 gettext i386 0.23.1-1 [1714 kB]
Get: 48 http://deb.debian.org/debian unstable/main i386 intltool-debian all 0.35.0+20060710.6 [22.9 kB]
Get: 49 http://deb.debian.org/debian unstable/main i386 po-debconf all 1.0.21+nmu1 [248 kB]
Get: 50 http://deb.debian.org/debian unstable/main i386 debhelper all 13.24.1 [920 kB]
Get: 51 http://deb.debian.org/debian unstable/main i386 python3-autocommand all 2.2.2-3 [13.6 kB]
Get: 52 http://deb.debian.org/debian unstable/main i386 python3-more-itertools all 10.6.0-1 [65.3 kB]
Get: 53 http://deb.debian.org/debian unstable/main i386 python3-typing-extensions all 4.12.2-2 [73.0 kB]
Get: 54 http://deb.debian.org/debian unstable/main i386 python3-typeguard all 4.4.1-1 [37.0 kB]
Get: 55 http://deb.debian.org/debian unstable/main i386 python3-inflect all 7.3.1-2 [32.4 kB]
Get: 56 http://deb.debian.org/debian unstable/main i386 python3-jaraco.context all 6.0.0-1 [7984 B]
Get: 57 http://deb.debian.org/debian unstable/main i386 python3-jaraco.functools all 4.1.0-1 [12.0 kB]
Get: 58 http://deb.debian.org/debian unstable/main i386 python3-pkg-resources all 75.6.0-1 [222 kB]
Get: 59 http://deb.debian.org/debian unstable/main i386 python3-jaraco.text all 4.0.0-1 [11.4 kB]
Get: 60 http://deb.debian.org/debian unstable/main i386 python3-zipp all 3.21.0-1 [10.6 kB]
Get: 61 http://deb.debian.org/debian unstable/main i386 python3-setuptools all 75.6.0-1 [720 kB]
Get: 62 http://deb.debian.org/debian unstable/main i386 dh-python all 6.20250108 [113 kB]
Get: 63 http://deb.debian.org/debian unstable/main i386 xml-core all 0.19 [20.1 kB]
Get: 64 http://deb.debian.org/debian unstable/main i386 docutils-common all 0.21.2+dfsg-2 [128 kB]
Get: 65 http://deb.debian.org/debian unstable/main i386 fonts-mathjax all 2.7.9+dfsg-1 [2210 kB]
Get: 66 http://deb.debian.org/debian unstable/main i386 fonts-open-sans all 1.11-2 [574 kB]
Get: 67 http://deb.debian.org/debian unstable/main i386 libblas3 i386 3.12.1-2 [150 kB]
Get: 68 http://deb.debian.org/debian unstable/main i386 libcom-err2 i386 1.47.2-1 [24.3 kB]
Get: 69 http://deb.debian.org/debian unstable/main i386 libexpat1-dev i386 2.6.4-1 [165 kB]
Get: 70 http://deb.debian.org/debian unstable/main i386 libfftw3-double3 i386 3.3.10-2+b1 [629 kB]
Get: 71 http://deb.debian.org/debian unstable/main i386 libfftw3-long3 i386 3.3.10-2+b1 [349 kB]
Get: 72 http://deb.debian.org/debian unstable/main i386 libfftw3-quad3 i386 3.3.10-2+b1 [1860 kB]
Get: 73 http://deb.debian.org/debian unstable/main i386 libfftw3-single3 i386 3.3.10-2+b1 [646 kB]
Get: 74 http://deb.debian.org/debian unstable/main i386 libfftw3-bin i386 3.3.10-2+b1 [50.0 kB]
Get: 75 http://deb.debian.org/debian unstable/main i386 libfftw3-dev i386 3.3.10-2+b1 [3254 kB]
Get: 76 http://deb.debian.org/debian unstable/main i386 libgfortran5 i386 14.2.0-16 [735 kB]
Get: 77 http://deb.debian.org/debian unstable/main i386 libkrb5support0 i386 1.21.3-4 [35.0 kB]
Get: 78 http://deb.debian.org/debian unstable/main i386 libk5crypto3 i386 1.21.3-4 [83.7 kB]
Get: 79 http://deb.debian.org/debian unstable/main i386 libkeyutils1 i386 1.6.3-4 [9600 B]
Get: 80 http://deb.debian.org/debian unstable/main i386 libkrb5-3 i386 1.21.3-4 [354 kB]
Get: 81 http://deb.debian.org/debian unstable/main i386 libgssapi-krb5-2 i386 1.21.3-4 [149 kB]
Get: 82 http://deb.debian.org/debian unstable/main i386 libjs-jquery all 3.6.1+dfsg+~3.5.14-1 [326 kB]
Get: 83 http://deb.debian.org/debian unstable/main i386 libjs-mathjax all 2.7.9+dfsg-1 [5667 kB]
Get: 84 http://deb.debian.org/debian unstable/main i386 libjs-underscore all 1.13.4~dfsg+~1.11.4-3 [116 kB]
Get: 85 http://deb.debian.org/debian unstable/main i386 libjs-sphinxdoc all 8.1.3-4 [30.4 kB]
Get: 86 http://deb.debian.org/debian unstable/main i386 libjson-perl all 4.10000-1 [87.5 kB]
Get: 87 http://deb.debian.org/debian unstable/main i386 liblapack3 i386 3.12.1-2 [2198 kB]
Get: 88 http://deb.debian.org/debian unstable/main i386 liblbfgsb0 i386 3.0+dfsg.4-1+b2 [29.5 kB]
Get: 89 http://deb.debian.org/debian unstable/main i386 libtirpc-common all 1.3.4+ds-1.3 [10.9 kB]
Get: 90 http://deb.debian.org/debian unstable/main i386 libtirpc3t64 i386 1.3.4+ds-1.3+b1 [90.5 kB]
Get: 91 http://deb.debian.org/debian unstable/main i386 libnsl2 i386 1.3.0-3+b3 [42.7 kB]
Get: 92 http://deb.debian.org/debian unstable/main i386 libpkgconf3 i386 1.8.1-4 [38.4 kB]
Get: 93 http://deb.debian.org/debian unstable/main i386 libpython3.13 i386 3.13.2-1 [2199 kB]
Get: 94 http://deb.debian.org/debian unstable/main i386 zlib1g-dev i386 1:1.3.dfsg+really1.3.1-1+b1 [916 kB]
Get: 95 http://deb.debian.org/debian unstable/main i386 libpython3.13-dev i386 3.13.2-1 [5181 kB]
Get: 96 http://deb.debian.org/debian unstable/main i386 libpython3-dev i386 3.13.1-2 [10.2 kB]
Get: 97 http://deb.debian.org/debian unstable/main i386 libpython3.12-stdlib i386 3.12.9-1 [1972 kB]
Get: 98 http://deb.debian.org/debian unstable/main i386 libpython3.12t64 i386 3.12.9-1 [2172 kB]
Get: 99 http://deb.debian.org/debian unstable/main i386 libpython3.12-dev i386 3.12.9-1 [5283 kB]
Get: 100 http://deb.debian.org/debian unstable/main i386 libpython3-all-dev i386 3.13.1-2 [1072 B]
Get: 101 http://deb.debian.org/debian unstable/main i386 libyaml-0-2 i386 0.2.5-2 [55.8 kB]
Get: 102 http://deb.debian.org/debian unstable/main i386 pkgconf-bin i386 1.8.1-4 [30.6 kB]
Get: 103 http://deb.debian.org/debian unstable/main i386 pkgconf i386 1.8.1-4 [26.2 kB]
Get: 104 http://deb.debian.org/debian unstable/main i386 pkg-config i386 1.8.1-4 [14.0 kB]
Get: 105 http://deb.debian.org/debian unstable/main i386 python3-packaging all 24.2-1 [55.3 kB]
Get: 106 http://deb.debian.org/debian unstable/main i386 python3-pyproject-hooks all 1.2.0-1 [11.7 kB]
Get: 107 http://deb.debian.org/debian unstable/main i386 python3-toml all 0.10.2-1 [16.2 kB]
Get: 108 http://deb.debian.org/debian unstable/main i386 python3-wheel all 0.45.1-1 [56.7 kB]
Get: 109 http://deb.debian.org/debian unstable/main i386 python3-build all 1.2.2-1 [36.0 kB]
Get: 110 http://deb.debian.org/debian unstable/main i386 python3-installer all 0.7.0+dfsg1-3 [18.6 kB]
Get: 111 http://deb.debian.org/debian unstable/main i386 pybuild-plugin-pyproject all 6.20250108 [11.6 kB]
Get: 112 http://deb.debian.org/debian unstable/main i386 python-babel-localedata all 2.17.0-1 [6050 kB]
Get: 113 http://deb.debian.org/debian unstable/main i386 python-numpy-doc all 1:2.2.2+ds-2 [4281 kB]
Get: 114 http://deb.debian.org/debian unstable/main i386 python-scipy-doc all 1.14.1-4 [31.6 kB]
Get: 115 http://deb.debian.org/debian unstable/main i386 python3-alabaster all 0.7.16-0.1 [27.9 kB]
Get: 116 http://deb.debian.org/debian unstable/main i386 python3.12 i386 3.12.9-1 [681 kB]
Get: 117 http://deb.debian.org/debian unstable/main i386 python3-all i386 3.13.1-2 [1052 B]
Get: 118 http://deb.debian.org/debian unstable/main i386 python3.13-dev i386 3.13.2-1 [505 kB]
Get: 119 http://deb.debian.org/debian unstable/main i386 python3-dev i386 3.13.1-2 [26.1 kB]
Get: 120 http://deb.debian.org/debian unstable/main i386 python3.12-dev i386 3.12.9-1 [505 kB]
Get: 121 http://deb.debian.org/debian unstable/main i386 python3-all-dev i386 3.13.1-2 [1076 B]
Get: 122 http://deb.debian.org/debian unstable/main i386 python3-babel all 2.17.0-1 [117 kB]
Get: 123 http://deb.debian.org/debian unstable/main i386 python3-certifi all 2024.12.14+ds-1 [9624 B]
Get: 124 http://deb.debian.org/debian unstable/main i386 python3-chardet all 5.2.0+dfsg-2 [108 kB]
Get: 125 http://deb.debian.org/debian unstable/main i386 python3-charset-normalizer i386 3.4.0-1+b1 [139 kB]
Get: 126 http://deb.debian.org/debian unstable/main i386 python3-click all 8.1.8-1 [95.2 kB]
Get: 127 http://deb.debian.org/debian unstable/main i386 python3-cloudpickle all 3.1.1-1 [26.6 kB]
Get: 128 http://deb.debian.org/debian unstable/main i386 python3-fsspec all 2024.12.0-2 [210 kB]
Get: 129 http://deb.debian.org/debian unstable/main i386 python3-toolz all 1.0.0-2 [44.2 kB]
Get: 130 http://deb.debian.org/debian unstable/main i386 python3-locket all 1.0.0-2 [5820 B]
Get: 131 http://deb.debian.org/debian unstable/main i386 python3-partd all 1.4.2-1 [15.4 kB]
Get: 132 http://deb.debian.org/debian unstable/main i386 python3-yaml i386 6.0.2-1+b1 [173 kB]
Get: 133 http://deb.debian.org/debian unstable/main i386 python3-dask all 2024.12.1+dfsg-2 [984 kB]
Get: 134 http://deb.debian.org/debian unstable/main i386 python3-decorator all 5.1.1-5 [15.1 kB]
Get: 135 http://deb.debian.org/debian unstable/main i386 python3-defusedxml all 0.7.1-3 [43.4 kB]
Get: 136 http://deb.debian.org/debian unstable/main i386 python3.13-doc all 3.13.2-1 [15.3 MB]
Get: 137 http://deb.debian.org/debian unstable/main i386 python3-doc all 3.13.1-2 [10.1 kB]
Get: 138 http://deb.debian.org/debian unstable/main i386 python3-roman all 5.0-1 [10.6 kB]
Get: 139 http://deb.debian.org/debian unstable/main i386 python3-docutils all 0.21.2+dfsg-2 [403 kB]
Get: 140 http://deb.debian.org/debian unstable/main i386 python3-idna all 3.10-1 [42.0 kB]
Get: 141 http://deb.debian.org/debian unstable/main i386 python3-imagesize all 1.4.1-1 [6688 B]
Get: 142 http://deb.debian.org/debian unstable/main i386 python3-iniconfig all 1.1.1-2 [6396 B]
Get: 143 http://deb.debian.org/debian unstable/main i386 python3-markupsafe i386 2.1.5-1+b2 [13.9 kB]
Get: 144 http://deb.debian.org/debian unstable/main i386 python3-jinja2 all 3.1.5-2 [107 kB]
Get: 145 http://deb.debian.org/debian unstable/main i386 python3-numpy-dev i386 1:2.2.2+ds-2 [145 kB]
Get: 146 http://deb.debian.org/debian unstable/main i386 python3-numpy i386 1:2.2.2+ds-2 [7536 kB]
Get: 147 http://deb.debian.org/debian unstable/main i386 python3-pkgconfig all 1.5.5-2 [7856 B]
Get: 148 http://deb.debian.org/debian unstable/main i386 python3-pluggy all 1.5.0-1 [26.9 kB]
Get: 149 http://deb.debian.org/debian unstable/main i386 python3-pygments all 2.18.0+dfsg-2 [836 kB]
Get: 150 http://deb.debian.org/debian unstable/main i386 python3-pytest all 8.3.4-1 [250 kB]
Get: 151 http://deb.debian.org/debian unstable/main i386 python3-urllib3 all 2.3.0-1 [114 kB]
Get: 152 http://deb.debian.org/debian unstable/main i386 python3-requests all 2.32.3+dfsg-1 [71.9 kB]
Get: 153 http://deb.debian.org/debian unstable/main i386 python3-scipy i386 1.14.1-4 [20.1 MB]
Get: 154 http://deb.debian.org/debian unstable/main i386 python3-snowballstemmer all 2.2.0-4 [58.0 kB]
Get: 155 http://deb.debian.org/debian unstable/main i386 sphinx-common all 8.1.3-4 [616 kB]
Get: 156 http://deb.debian.org/debian unstable/main i386 python3-sphinx all 8.1.3-4 [468 kB]
Fetched 135 MB in 2s (55.0 MB/s)
Preconfiguring packages ...
Selecting previously unselected package libpython3.13-minimal:i386.
(Reading database ... 
(Reading database ... 5%
(Reading database ... 10%
(Reading database ... 15%
(Reading database ... 20%
(Reading database ... 25%
(Reading database ... 30%
(Reading database ... 35%
(Reading database ... 40%
(Reading database ... 45%
(Reading database ... 50%
(Reading database ... 55%
(Reading database ... 60%
(Reading database ... 65%
(Reading database ... 70%
(Reading database ... 75%
(Reading database ... 80%
(Reading database ... 85%
(Reading database ... 90%
(Reading database ... 95%
(Reading database ... 100%
(Reading database ... 19792 files and directories currently installed.)
Preparing to unpack .../libpython3.13-minimal_3.13.2-1_i386.deb ...
Unpacking libpython3.13-minimal:i386 (3.13.2-1) ...
Selecting previously unselected package libexpat1:i386.
Preparing to unpack .../libexpat1_2.6.4-1_i386.deb ...
Unpacking libexpat1:i386 (2.6.4-1) ...
Selecting previously unselected package python3.13-minimal.
Preparing to unpack .../python3.13-minimal_3.13.2-1_i386.deb ...
Unpacking python3.13-minimal (3.13.2-1) ...
Setting up libpython3.13-minimal:i386 (3.13.2-1) ...
Setting up libexpat1:i386 (2.6.4-1) ...
Setting up python3.13-minimal (3.13.2-1) ...
Selecting previously unselected package python3-minimal.
(Reading database ... 
(Reading database ... 5%
(Reading database ... 10%
(Reading database ... 15%
(Reading database ... 20%
(Reading database ... 25%
(Reading database ... 30%
(Reading database ... 35%
(Reading database ... 40%
(Reading database ... 45%
(Reading database ... 50%
(Reading database ... 55%
(Reading database ... 60%
(Reading database ... 65%
(Reading database ... 70%
(Reading database ... 75%
(Reading database ... 80%
(Reading database ... 85%
(Reading database ... 90%
(Reading database ... 95%
(Reading database ... 100%
(Reading database ... 20126 files and directories currently installed.)
Preparing to unpack .../0-python3-minimal_3.13.1-2_i386.deb ...
Unpacking python3-minimal (3.13.1-2) ...
Selecting previously unselected package media-types.
Preparing to unpack .../1-media-types_11.0.0_all.deb ...
Unpacking media-types (11.0.0) ...
Selecting previously unselected package netbase.
Preparing to unpack .../2-netbase_6.4_all.deb ...
Unpacking netbase (6.4) ...
Selecting previously unselected package tzdata.
Preparing to unpack .../3-tzdata_2025a-2_all.deb ...
Unpacking tzdata (2025a-2) ...
Selecting previously unselected package libffi8:i386.
Preparing to unpack .../4-libffi8_3.4.6-1_i386.deb ...
Unpacking libffi8:i386 (3.4.6-1) ...
Selecting previously unselected package readline-common.
Preparing to unpack .../5-readline-common_8.2-6_all.deb ...
Unpacking readline-common (8.2-6) ...
Selecting previously unselected package libreadline8t64:i386.
Preparing to unpack .../6-libreadline8t64_8.2-6_i386.deb ...
Adding 'diversion of /lib/i386-linux-gnu/libhistory.so.8 to /lib/i386-linux-gnu/libhistory.so.8.usr-is-merged by libreadline8t64'
Adding 'diversion of /lib/i386-linux-gnu/libhistory.so.8.2 to /lib/i386-linux-gnu/libhistory.so.8.2.usr-is-merged by libreadline8t64'
Adding 'diversion of /lib/i386-linux-gnu/libreadline.so.8 to /lib/i386-linux-gnu/libreadline.so.8.usr-is-merged by libreadline8t64'
Adding 'diversion of /lib/i386-linux-gnu/libreadline.so.8.2 to /lib/i386-linux-gnu/libreadline.so.8.2.usr-is-merged by libreadline8t64'
Unpacking libreadline8t64:i386 (8.2-6) ...
Selecting previously unselected package libpython3.13-stdlib:i386.
Preparing to unpack .../7-libpython3.13-stdlib_3.13.2-1_i386.deb ...
Unpacking libpython3.13-stdlib:i386 (3.13.2-1) ...
Selecting previously unselected package python3.13.
Preparing to unpack .../8-python3.13_3.13.2-1_i386.deb ...
Unpacking python3.13 (3.13.2-1) ...
Selecting previously unselected package libpython3-stdlib:i386.
Preparing to unpack .../9-libpython3-stdlib_3.13.1-2_i386.deb ...
Unpacking libpython3-stdlib:i386 (3.13.1-2) ...
Setting up python3-minimal (3.13.1-2) ...
Selecting previously unselected package python3.
(Reading database ... 
(Reading database ... 5%
(Reading database ... 10%
(Reading database ... 15%
(Reading database ... 20%
(Reading database ... 25%
(Reading database ... 30%
(Reading database ... 35%
(Reading database ... 40%
(Reading database ... 45%
(Reading database ... 50%
(Reading database ... 55%
(Reading database ... 60%
(Reading database ... 65%
(Reading database ... 70%
(Reading database ... 75%
(Reading database ... 80%
(Reading database ... 85%
(Reading database ... 90%
(Reading database ... 95%
(Reading database ... 100%
(Reading database ... 21136 files and directories currently installed.)
Preparing to unpack .../000-python3_3.13.1-2_i386.deb ...
Unpacking python3 (3.13.1-2) ...
Selecting previously unselected package libpython3.12-minimal:i386.
Preparing to unpack .../001-libpython3.12-minimal_3.12.9-1_i386.deb ...
Unpacking libpython3.12-minimal:i386 (3.12.9-1) ...
Selecting previously unselected package python3.12-minimal.
Preparing to unpack .../002-python3.12-minimal_3.12.9-1_i386.deb ...
Unpacking python3.12-minimal (3.12.9-1) ...
Selecting previously unselected package sgml-base.
Preparing to unpack .../003-sgml-base_1.31_all.deb ...
Unpacking sgml-base (1.31) ...
Selecting previously unselected package sensible-utils.
Preparing to unpack .../004-sensible-utils_0.0.24_all.deb ...
Unpacking sensible-utils (0.0.24) ...
Selecting previously unselected package openssl.
Preparing to unpack .../005-openssl_3.4.0-2_i386.deb ...
Unpacking openssl (3.4.0-2) ...
Selecting previously unselected package ca-certificates.
Preparing to unpack .../006-ca-certificates_20241223_all.deb ...
Unpacking ca-certificates (20241223) ...
Selecting previously unselected package libmagic-mgc.
Preparing to unpack .../007-libmagic-mgc_1%3a5.45-3+b1_i386.deb ...
Unpacking libmagic-mgc (1:5.45-3+b1) ...
Selecting previously unselected package libmagic1t64:i386.
Preparing to unpack .../008-libmagic1t64_1%3a5.45-3+b1_i386.deb ...
Unpacking libmagic1t64:i386 (1:5.45-3+b1) ...
Selecting previously unselected package file.
Preparing to unpack .../009-file_1%3a5.45-3+b1_i386.deb ...
Unpacking file (1:5.45-3+b1) ...
Selecting previously unselected package gettext-base.
Preparing to unpack .../010-gettext-base_0.23.1-1_i386.deb ...
Unpacking gettext-base (0.23.1-1) ...
Selecting previously unselected package libuchardet0:i386.
Preparing to unpack .../011-libuchardet0_0.0.8-1+b2_i386.deb ...
Unpacking libuchardet0:i386 (0.0.8-1+b2) ...
Selecting previously unselected package groff-base.
Preparing to unpack .../012-groff-base_1.23.0-7_i386.deb ...
Unpacking groff-base (1.23.0-7) ...
Selecting previously unselected package bsdextrautils.
Preparing to unpack .../013-bsdextrautils_2.40.4-3_i386.deb ...
Unpacking bsdextrautils (2.40.4-3) ...
Selecting previously unselected package libpipeline1:i386.
Preparing to unpack .../014-libpipeline1_1.5.8-1_i386.deb ...
Unpacking libpipeline1:i386 (1.5.8-1) ...
Selecting previously unselected package man-db.
Preparing to unpack .../015-man-db_2.13.0-1_i386.deb ...
Unpacking man-db (2.13.0-1) ...
Selecting previously unselected package m4.
Preparing to unpack .../016-m4_1.4.19-5_i386.deb ...
Unpacking m4 (1.4.19-5) ...
Selecting previously unselected package autoconf.
Preparing to unpack .../017-autoconf_2.72-3_all.deb ...
Unpacking autoconf (2.72-3) ...
Selecting previously unselected package autotools-dev.
Preparing to unpack .../018-autotools-dev_20220109.1_all.deb ...
Unpacking autotools-dev (20220109.1) ...
Selecting previously unselected package automake.
Preparing to unpack .../019-automake_1%3a1.17-3_all.deb ...
Unpacking automake (1:1.17-3) ...
Selecting previously unselected package autopoint.
Preparing to unpack .../020-autopoint_0.23.1-1_all.deb ...
Unpacking autopoint (0.23.1-1) ...
Selecting previously unselected package cython3.
Preparing to unpack .../021-cython3_3.0.11+dfsg-1+b2_i386.deb ...
Unpacking cython3 (3.0.11+dfsg-1+b2) ...
Selecting previously unselected package libdebhelper-perl.
Preparing to unpack .../022-libdebhelper-perl_13.24.1_all.deb ...
Unpacking libdebhelper-perl (13.24.1) ...
Selecting previously unselected package libtool.
Preparing to unpack .../023-libtool_2.5.4-3_all.deb ...
Unpacking libtool (2.5.4-3) ...
Selecting previously unselected package dh-autoreconf.
Preparing to unpack .../024-dh-autoreconf_20_all.deb ...
Unpacking dh-autoreconf (20) ...
Selecting previously unselected package libarchive-zip-perl.
Preparing to unpack .../025-libarchive-zip-perl_1.68-1_all.deb ...
Unpacking libarchive-zip-perl (1.68-1) ...
Selecting previously unselected package libfile-stripnondeterminism-perl.
Preparing to unpack .../026-libfile-stripnondeterminism-perl_1.14.1-1_all.deb ...
Unpacking libfile-stripnondeterminism-perl (1.14.1-1) ...
Selecting previously unselected package dh-strip-nondeterminism.
Preparing to unpack .../027-dh-strip-nondeterminism_1.14.1-1_all.deb ...
Unpacking dh-strip-nondeterminism (1.14.1-1) ...
Selecting previously unselected package libelf1t64:i386.
Preparing to unpack .../028-libelf1t64_0.192-4_i386.deb ...
Unpacking libelf1t64:i386 (0.192-4) ...
Selecting previously unselected package dwz.
Preparing to unpack .../029-dwz_0.15-1+b1_i386.deb ...
Unpacking dwz (0.15-1+b1) ...
Selecting previously unselected package libunistring5:i386.
Preparing to unpack .../030-libunistring5_1.3-1_i386.deb ...
Unpacking libunistring5:i386 (1.3-1) ...
Selecting previously unselected package libicu72:i386.
Preparing to unpack .../031-libicu72_72.1-6_i386.deb ...
Unpacking libicu72:i386 (72.1-6) ...
Selecting previously unselected package libxml2:i386.
Preparing to unpack .../032-libxml2_2.12.7+dfsg+really2.9.14-0.2+b1_i386.deb ...
Unpacking libxml2:i386 (2.12.7+dfsg+really2.9.14-0.2+b1) ...
Selecting previously unselected package gettext.
Preparing to unpack .../033-gettext_0.23.1-1_i386.deb ...
Unpacking gettext (0.23.1-1) ...
Selecting previously unselected package intltool-debian.
Preparing to unpack .../034-intltool-debian_0.35.0+20060710.6_all.deb ...
Unpacking intltool-debian (0.35.0+20060710.6) ...
Selecting previously unselected package po-debconf.
Preparing to unpack .../035-po-debconf_1.0.21+nmu1_all.deb ...
Unpacking po-debconf (1.0.21+nmu1) ...
Selecting previously unselected package debhelper.
Preparing to unpack .../036-debhelper_13.24.1_all.deb ...
Unpacking debhelper (13.24.1) ...
Selecting previously unselected package python3-autocommand.
Preparing to unpack .../037-python3-autocommand_2.2.2-3_all.deb ...
Unpacking python3-autocommand (2.2.2-3) ...
Selecting previously unselected package python3-more-itertools.
Preparing to unpack .../038-python3-more-itertools_10.6.0-1_all.deb ...
Unpacking python3-more-itertools (10.6.0-1) ...
Selecting previously unselected package python3-typing-extensions.
Preparing to unpack .../039-python3-typing-extensions_4.12.2-2_all.deb ...
Unpacking python3-typing-extensions (4.12.2-2) ...
Selecting previously unselected package python3-typeguard.
Preparing to unpack .../040-python3-typeguard_4.4.1-1_all.deb ...
Unpacking python3-typeguard (4.4.1-1) ...
Selecting previously unselected package python3-inflect.
Preparing to unpack .../041-python3-inflect_7.3.1-2_all.deb ...
Unpacking python3-inflect (7.3.1-2) ...
Selecting previously unselected package python3-jaraco.context.
Preparing to unpack .../042-python3-jaraco.context_6.0.0-1_all.deb ...
Unpacking python3-jaraco.context (6.0.0-1) ...
Selecting previously unselected package python3-jaraco.functools.
Preparing to unpack .../043-python3-jaraco.functools_4.1.0-1_all.deb ...
Unpacking python3-jaraco.functools (4.1.0-1) ...
Selecting previously unselected package python3-pkg-resources.
Preparing to unpack .../044-python3-pkg-resources_75.6.0-1_all.deb ...
Unpacking python3-pkg-resources (75.6.0-1) ...
Selecting previously unselected package python3-jaraco.text.
Preparing to unpack .../045-python3-jaraco.text_4.0.0-1_all.deb ...
Unpacking python3-jaraco.text (4.0.0-1) ...
Selecting previously unselected package python3-zipp.
Preparing to unpack .../046-python3-zipp_3.21.0-1_all.deb ...
Unpacking python3-zipp (3.21.0-1) ...
Selecting previously unselected package python3-setuptools.
Preparing to unpack .../047-python3-setuptools_75.6.0-1_all.deb ...
Unpacking python3-setuptools (75.6.0-1) ...
Selecting previously unselected package dh-python.
Preparing to unpack .../048-dh-python_6.20250108_all.deb ...
Unpacking dh-python (6.20250108) ...
Selecting previously unselected package xml-core.
Preparing to unpack .../049-xml-core_0.19_all.deb ...
Unpacking xml-core (0.19) ...
Selecting previously unselected package docutils-common.
Preparing to unpack .../050-docutils-common_0.21.2+dfsg-2_all.deb ...
Unpacking docutils-common (0.21.2+dfsg-2) ...
Selecting previously unselected package fonts-mathjax.
Preparing to unpack .../051-fonts-mathjax_2.7.9+dfsg-1_all.deb ...
Unpacking fonts-mathjax (2.7.9+dfsg-1) ...
Selecting previously unselected package fonts-open-sans.
Preparing to unpack .../052-fonts-open-sans_1.11-2_all.deb ...
Unpacking fonts-open-sans (1.11-2) ...
Selecting previously unselected package libblas3:i386.
Preparing to unpack .../053-libblas3_3.12.1-2_i386.deb ...
Unpacking libblas3:i386 (3.12.1-2) ...
Selecting previously unselected package libcom-err2:i386.
Preparing to unpack .../054-libcom-err2_1.47.2-1_i386.deb ...
Unpacking libcom-err2:i386 (1.47.2-1) ...
Selecting previously unselected package libexpat1-dev:i386.
Preparing to unpack .../055-libexpat1-dev_2.6.4-1_i386.deb ...
Unpacking libexpat1-dev:i386 (2.6.4-1) ...
Selecting previously unselected package libfftw3-double3:i386.
Preparing to unpack .../056-libfftw3-double3_3.3.10-2+b1_i386.deb ...
Unpacking libfftw3-double3:i386 (3.3.10-2+b1) ...
Selecting previously unselected package libfftw3-long3:i386.
Preparing to unpack .../057-libfftw3-long3_3.3.10-2+b1_i386.deb ...
Unpacking libfftw3-long3:i386 (3.3.10-2+b1) ...
Selecting previously unselected package libfftw3-quad3:i386.
Preparing to unpack .../058-libfftw3-quad3_3.3.10-2+b1_i386.deb ...
Unpacking libfftw3-quad3:i386 (3.3.10-2+b1) ...
Selecting previously unselected package libfftw3-single3:i386.
Preparing to unpack .../059-libfftw3-single3_3.3.10-2+b1_i386.deb ...
Unpacking libfftw3-single3:i386 (3.3.10-2+b1) ...
Selecting previously unselected package libfftw3-bin.
Preparing to unpack .../060-libfftw3-bin_3.3.10-2+b1_i386.deb ...
Unpacking libfftw3-bin (3.3.10-2+b1) ...
Selecting previously unselected package libfftw3-dev:i386.
Preparing to unpack .../061-libfftw3-dev_3.3.10-2+b1_i386.deb ...
Unpacking libfftw3-dev:i386 (3.3.10-2+b1) ...
Selecting previously unselected package libgfortran5:i386.
Preparing to unpack .../062-libgfortran5_14.2.0-16_i386.deb ...
Unpacking libgfortran5:i386 (14.2.0-16) ...
Selecting previously unselected package libkrb5support0:i386.
Preparing to unpack .../063-libkrb5support0_1.21.3-4_i386.deb ...
Unpacking libkrb5support0:i386 (1.21.3-4) ...
Selecting previously unselected package libk5crypto3:i386.
Preparing to unpack .../064-libk5crypto3_1.21.3-4_i386.deb ...
Unpacking libk5crypto3:i386 (1.21.3-4) ...
Selecting previously unselected package libkeyutils1:i386.
Preparing to unpack .../065-libkeyutils1_1.6.3-4_i386.deb ...
Unpacking libkeyutils1:i386 (1.6.3-4) ...
Selecting previously unselected package libkrb5-3:i386.
Preparing to unpack .../066-libkrb5-3_1.21.3-4_i386.deb ...
Unpacking libkrb5-3:i386 (1.21.3-4) ...
Selecting previously unselected package libgssapi-krb5-2:i386.
Preparing to unpack .../067-libgssapi-krb5-2_1.21.3-4_i386.deb ...
Unpacking libgssapi-krb5-2:i386 (1.21.3-4) ...
Selecting previously unselected package libjs-jquery.
Preparing to unpack .../068-libjs-jquery_3.6.1+dfsg+~3.5.14-1_all.deb ...
Unpacking libjs-jquery (3.6.1+dfsg+~3.5.14-1) ...
Selecting previously unselected package libjs-mathjax.
Preparing to unpack .../069-libjs-mathjax_2.7.9+dfsg-1_all.deb ...
Unpacking libjs-mathjax (2.7.9+dfsg-1) ...
Selecting previously unselected package libjs-underscore.
Preparing to unpack .../070-libjs-underscore_1.13.4~dfsg+~1.11.4-3_all.deb ...
Unpacking libjs-underscore (1.13.4~dfsg+~1.11.4-3) ...
Selecting previously unselected package libjs-sphinxdoc.
Preparing to unpack .../071-libjs-sphinxdoc_8.1.3-4_all.deb ...
Unpacking libjs-sphinxdoc (8.1.3-4) ...
Selecting previously unselected package libjson-perl.
Preparing to unpack .../072-libjson-perl_4.10000-1_all.deb ...
Unpacking libjson-perl (4.10000-1) ...
Selecting previously unselected package liblapack3:i386.
Preparing to unpack .../073-liblapack3_3.12.1-2_i386.deb ...
Unpacking liblapack3:i386 (3.12.1-2) ...
Selecting previously unselected package liblbfgsb0:i386.
Preparing to unpack .../074-liblbfgsb0_3.0+dfsg.4-1+b2_i386.deb ...
Unpacking liblbfgsb0:i386 (3.0+dfsg.4-1+b2) ...
Selecting previously unselected package libtirpc-common.
Preparing to unpack .../075-libtirpc-common_1.3.4+ds-1.3_all.deb ...
Unpacking libtirpc-common (1.3.4+ds-1.3) ...
Selecting previously unselected package libtirpc3t64:i386.
Preparing to unpack .../076-libtirpc3t64_1.3.4+ds-1.3+b1_i386.deb ...
Adding 'diversion of /lib/i386-linux-gnu/libtirpc.so.3 to /lib/i386-linux-gnu/libtirpc.so.3.usr-is-merged by libtirpc3t64'
Adding 'diversion of /lib/i386-linux-gnu/libtirpc.so.3.0.0 to /lib/i386-linux-gnu/libtirpc.so.3.0.0.usr-is-merged by libtirpc3t64'
Unpacking libtirpc3t64:i386 (1.3.4+ds-1.3+b1) ...
Selecting previously unselected package libnsl2:i386.
Preparing to unpack .../077-libnsl2_1.3.0-3+b3_i386.deb ...
Unpacking libnsl2:i386 (1.3.0-3+b3) ...
Selecting previously unselected package libpkgconf3:i386.
Preparing to unpack .../078-libpkgconf3_1.8.1-4_i386.deb ...
Unpacking libpkgconf3:i386 (1.8.1-4) ...
Selecting previously unselected package libpython3.13:i386.
Preparing to unpack .../079-libpython3.13_3.13.2-1_i386.deb ...
Unpacking libpython3.13:i386 (3.13.2-1) ...
Selecting previously unselected package zlib1g-dev:i386.
Preparing to unpack .../080-zlib1g-dev_1%3a1.3.dfsg+really1.3.1-1+b1_i386.deb ...
Unpacking zlib1g-dev:i386 (1:1.3.dfsg+really1.3.1-1+b1) ...
Selecting previously unselected package libpython3.13-dev:i386.
Preparing to unpack .../081-libpython3.13-dev_3.13.2-1_i386.deb ...
Unpacking libpython3.13-dev:i386 (3.13.2-1) ...
Selecting previously unselected package libpython3-dev:i386.
Preparing to unpack .../082-libpython3-dev_3.13.1-2_i386.deb ...
Unpacking libpython3-dev:i386 (3.13.1-2) ...
Selecting previously unselected package libpython3.12-stdlib:i386.
Preparing to unpack .../083-libpython3.12-stdlib_3.12.9-1_i386.deb ...
Unpacking libpython3.12-stdlib:i386 (3.12.9-1) ...
Selecting previously unselected package libpython3.12t64:i386.
Preparing to unpack .../084-libpython3.12t64_3.12.9-1_i386.deb ...
Unpacking libpython3.12t64:i386 (3.12.9-1) ...
Selecting previously unselected package libpython3.12-dev:i386.
Preparing to unpack .../085-libpython3.12-dev_3.12.9-1_i386.deb ...
Unpacking libpython3.12-dev:i386 (3.12.9-1) ...
Selecting previously unselected package libpython3-all-dev:i386.
Preparing to unpack .../086-libpython3-all-dev_3.13.1-2_i386.deb ...
Unpacking libpython3-all-dev:i386 (3.13.1-2) ...
Selecting previously unselected package libyaml-0-2:i386.
Preparing to unpack .../087-libyaml-0-2_0.2.5-2_i386.deb ...
Unpacking libyaml-0-2:i386 (0.2.5-2) ...
Selecting previously unselected package pkgconf-bin.
Preparing to unpack .../088-pkgconf-bin_1.8.1-4_i386.deb ...
Unpacking pkgconf-bin (1.8.1-4) ...
Selecting previously unselected package pkgconf:i386.
Preparing to unpack .../089-pkgconf_1.8.1-4_i386.deb ...
Unpacking pkgconf:i386 (1.8.1-4) ...
Selecting previously unselected package pkg-config:i386.
Preparing to unpack .../090-pkg-config_1.8.1-4_i386.deb ...
Unpacking pkg-config:i386 (1.8.1-4) ...
Selecting previously unselected package python3-packaging.
Preparing to unpack .../091-python3-packaging_24.2-1_all.deb ...
Unpacking python3-packaging (24.2-1) ...
Selecting previously unselected package python3-pyproject-hooks.
Preparing to unpack .../092-python3-pyproject-hooks_1.2.0-1_all.deb ...
Unpacking python3-pyproject-hooks (1.2.0-1) ...
Selecting previously unselected package python3-toml.
Preparing to unpack .../093-python3-toml_0.10.2-1_all.deb ...
Unpacking python3-toml (0.10.2-1) ...
Selecting previously unselected package python3-wheel.
Preparing to unpack .../094-python3-wheel_0.45.1-1_all.deb ...
Unpacking python3-wheel (0.45.1-1) ...
Selecting previously unselected package python3-build.
Preparing to unpack .../095-python3-build_1.2.2-1_all.deb ...
Unpacking python3-build (1.2.2-1) ...
Selecting previously unselected package python3-installer.
Preparing to unpack .../096-python3-installer_0.7.0+dfsg1-3_all.deb ...
Unpacking python3-installer (0.7.0+dfsg1-3) ...
Selecting previously unselected package pybuild-plugin-pyproject.
Preparing to unpack .../097-pybuild-plugin-pyproject_6.20250108_all.deb ...
Unpacking pybuild-plugin-pyproject (6.20250108) ...
Selecting previously unselected package python-babel-localedata.
Preparing to unpack .../098-python-babel-localedata_2.17.0-1_all.deb ...
Unpacking python-babel-localedata (2.17.0-1) ...
Selecting previously unselected package python-numpy-doc.
Preparing to unpack .../099-python-numpy-doc_1%3a2.2.2+ds-2_all.deb ...
Unpacking python-numpy-doc (1:2.2.2+ds-2) ...
Selecting previously unselected package python-scipy-doc.
Preparing to unpack .../100-python-scipy-doc_1.14.1-4_all.deb ...
Unpacking python-scipy-doc (1.14.1-4) ...
Selecting previously unselected package python3-alabaster.
Preparing to unpack .../101-python3-alabaster_0.7.16-0.1_all.deb ...
Unpacking python3-alabaster (0.7.16-0.1) ...
Selecting previously unselected package python3.12.
Preparing to unpack .../102-python3.12_3.12.9-1_i386.deb ...
Unpacking python3.12 (3.12.9-1) ...
Selecting previously unselected package python3-all.
Preparing to unpack .../103-python3-all_3.13.1-2_i386.deb ...
Unpacking python3-all (3.13.1-2) ...
Selecting previously unselected package python3.13-dev.
Preparing to unpack .../104-python3.13-dev_3.13.2-1_i386.deb ...
Unpacking python3.13-dev (3.13.2-1) ...
Selecting previously unselected package python3-dev.
Preparing to unpack .../105-python3-dev_3.13.1-2_i386.deb ...
Unpacking python3-dev (3.13.1-2) ...
Selecting previously unselected package python3.12-dev.
Preparing to unpack .../106-python3.12-dev_3.12.9-1_i386.deb ...
Unpacking python3.12-dev (3.12.9-1) ...
Selecting previously unselected package python3-all-dev.
Preparing to unpack .../107-python3-all-dev_3.13.1-2_i386.deb ...
Unpacking python3-all-dev (3.13.1-2) ...
Selecting previously unselected package python3-babel.
Preparing to unpack .../108-python3-babel_2.17.0-1_all.deb ...
Unpacking python3-babel (2.17.0-1) ...
Selecting previously unselected package python3-certifi.
Preparing to unpack .../109-python3-certifi_2024.12.14+ds-1_all.deb ...
Unpacking python3-certifi (2024.12.14+ds-1) ...
Selecting previously unselected package python3-chardet.
Preparing to unpack .../110-python3-chardet_5.2.0+dfsg-2_all.deb ...
Unpacking python3-chardet (5.2.0+dfsg-2) ...
Selecting previously unselected package python3-charset-normalizer.
Preparing to unpack .../111-python3-charset-normalizer_3.4.0-1+b1_i386.deb ...
Unpacking python3-charset-normalizer (3.4.0-1+b1) ...
Selecting previously unselected package python3-click.
Preparing to unpack .../112-python3-click_8.1.8-1_all.deb ...
Unpacking python3-click (8.1.8-1) ...
Selecting previously unselected package python3-cloudpickle.
Preparing to unpack .../113-python3-cloudpickle_3.1.1-1_all.deb ...
Unpacking python3-cloudpickle (3.1.1-1) ...
Selecting previously unselected package python3-fsspec.
Preparing to unpack .../114-python3-fsspec_2024.12.0-2_all.deb ...
Unpacking python3-fsspec (2024.12.0-2) ...
Selecting previously unselected package python3-toolz.
Preparing to unpack .../115-python3-toolz_1.0.0-2_all.deb ...
Unpacking python3-toolz (1.0.0-2) ...
Selecting previously unselected package python3-locket.
Preparing to unpack .../116-python3-locket_1.0.0-2_all.deb ...
Unpacking python3-locket (1.0.0-2) ...
Selecting previously unselected package python3-partd.
Preparing to unpack .../117-python3-partd_1.4.2-1_all.deb ...
Unpacking python3-partd (1.4.2-1) ...
Selecting previously unselected package python3-yaml.
Preparing to unpack .../118-python3-yaml_6.0.2-1+b1_i386.deb ...
Unpacking python3-yaml (6.0.2-1+b1) ...
Selecting previously unselected package python3-dask.
Preparing to unpack .../119-python3-dask_2024.12.1+dfsg-2_all.deb ...
Unpacking python3-dask (2024.12.1+dfsg-2) ...
Selecting previously unselected package python3-decorator.
Preparing to unpack .../120-python3-decorator_5.1.1-5_all.deb ...
Unpacking python3-decorator (5.1.1-5) ...
Selecting previously unselected package python3-defusedxml.
Preparing to unpack .../121-python3-defusedxml_0.7.1-3_all.deb ...
Unpacking python3-defusedxml (0.7.1-3) ...
Selecting previously unselected package python3.13-doc.
Preparing to unpack .../122-python3.13-doc_3.13.2-1_all.deb ...
Unpacking python3.13-doc (3.13.2-1) ...
Selecting previously unselected package python3-doc.
Preparing to unpack .../123-python3-doc_3.13.1-2_all.deb ...
Unpacking python3-doc (3.13.1-2) ...
Selecting previously unselected package python3-roman.
Preparing to unpack .../124-python3-roman_5.0-1_all.deb ...
Unpacking python3-roman (5.0-1) ...
Selecting previously unselected package python3-docutils.
Preparing to unpack .../125-python3-docutils_0.21.2+dfsg-2_all.deb ...
Unpacking python3-docutils (0.21.2+dfsg-2) ...
Selecting previously unselected package python3-idna.
Preparing to unpack .../126-python3-idna_3.10-1_all.deb ...
Unpacking python3-idna (3.10-1) ...
Selecting previously unselected package python3-imagesize.
Preparing to unpack .../127-python3-imagesize_1.4.1-1_all.deb ...
Unpacking python3-imagesize (1.4.1-1) ...
Selecting previously unselected package python3-iniconfig.
Preparing to unpack .../128-python3-iniconfig_1.1.1-2_all.deb ...
Unpacking python3-iniconfig (1.1.1-2) ...
Selecting previously unselected package python3-markupsafe.
Preparing to unpack .../129-python3-markupsafe_2.1.5-1+b2_i386.deb ...
Unpacking python3-markupsafe (2.1.5-1+b2) ...
Selecting previously unselected package python3-jinja2.
Preparing to unpack .../130-python3-jinja2_3.1.5-2_all.deb ...
Unpacking python3-jinja2 (3.1.5-2) ...
Selecting previously unselected package python3-numpy-dev:i386.
Preparing to unpack .../131-python3-numpy-dev_1%3a2.2.2+ds-2_i386.deb ...
Unpacking python3-numpy-dev:i386 (1:2.2.2+ds-2) ...
Selecting previously unselected package python3-numpy.
Preparing to unpack .../132-python3-numpy_1%3a2.2.2+ds-2_i386.deb ...
Unpacking python3-numpy (1:2.2.2+ds-2) ...
Selecting previously unselected package python3-pkgconfig.
Preparing to unpack .../133-python3-pkgconfig_1.5.5-2_all.deb ...
Unpacking python3-pkgconfig (1.5.5-2) ...
Selecting previously unselected package python3-pluggy.
Preparing to unpack .../134-python3-pluggy_1.5.0-1_all.deb ...
Unpacking python3-pluggy (1.5.0-1) ...
Selecting previously unselected package python3-pygments.
Preparing to unpack .../135-python3-pygments_2.18.0+dfsg-2_all.deb ...
Unpacking python3-pygments (2.18.0+dfsg-2) ...
Selecting previously unselected package python3-pytest.
Preparing to unpack .../136-python3-pytest_8.3.4-1_all.deb ...
Unpacking python3-pytest (8.3.4-1) ...
Selecting previously unselected package python3-urllib3.
Preparing to unpack .../137-python3-urllib3_2.3.0-1_all.deb ...
Unpacking python3-urllib3 (2.3.0-1) ...
Selecting previously unselected package python3-requests.
Preparing to unpack .../138-python3-requests_2.32.3+dfsg-1_all.deb ...
Unpacking python3-requests (2.32.3+dfsg-1) ...
Selecting previously unselected package python3-scipy.
Preparing to unpack .../139-python3-scipy_1.14.1-4_i386.deb ...
Unpacking python3-scipy (1.14.1-4) ...
Selecting previously unselected package python3-snowballstemmer.
Preparing to unpack .../140-python3-snowballstemmer_2.2.0-4_all.deb ...
Unpacking python3-snowballstemmer (2.2.0-4) ...
Selecting previously unselected package sphinx-common.
Preparing to unpack .../141-sphinx-common_8.1.3-4_all.deb ...
Unpacking sphinx-common (8.1.3-4) ...
Selecting previously unselected package python3-sphinx.
Preparing to unpack .../142-python3-sphinx_8.1.3-4_all.deb ...
Unpacking python3-sphinx (8.1.3-4) ...
Setting up media-types (11.0.0) ...
Setting up libpipeline1:i386 (1.5.8-1) ...
Setting up libkeyutils1:i386 (1.6.3-4) ...
Setting up fonts-mathjax (2.7.9+dfsg-1) ...
Setting up libfftw3-single3:i386 (3.3.10-2+b1) ...
Setting up libicu72:i386 (72.1-6) ...
Setting up bsdextrautils (2.40.4-3) ...
Setting up libjs-mathjax (2.7.9+dfsg-1) ...
Setting up libmagic-mgc (1:5.45-3+b1) ...
Setting up libarchive-zip-perl (1.68-1) ...
Setting up libyaml-0-2:i386 (0.2.5-2) ...
Setting up libtirpc-common (1.3.4+ds-1.3) ...
Setting up libdebhelper-perl (13.24.1) ...
Setting up libmagic1t64:i386 (1:5.45-3+b1) ...
Setting up libpython3.12-minimal:i386 (3.12.9-1) ...
Setting up libfftw3-long3:i386 (3.3.10-2+b1) ...
Setting up gettext-base (0.23.1-1) ...
Setting up m4 (1.4.19-5) ...
Setting up libcom-err2:i386 (1.47.2-1) ...
Setting up file (1:5.45-3+b1) ...
Setting up fonts-open-sans (1.11-2) ...
Setting up libelf1t64:i386 (0.192-4) ...
Setting up python-babel-localedata (2.17.0-1) ...
Setting up libkrb5support0:i386 (1.21.3-4) ...
Setting up tzdata (2025a-2) ...

Current default time zone: 'Etc/UTC'
Local time is now:      Fri Feb  7 13:40:01 UTC 2025.
Universal Time is now:  Fri Feb  7 13:40:01 UTC 2025.
Run 'dpkg-reconfigure tzdata' if you wish to change it.

Setting up autotools-dev (20220109.1) ...
Setting up libblas3:i386 (3.12.1-2) ...
update-alternatives: using /usr/lib/i386-linux-gnu/blas/libblas.so.3 to provide /usr/lib/i386-linux-gnu/libblas.so.3 (libblas.so.3-i386-linux-gnu) in auto mode
Setting up libpkgconf3:i386 (1.8.1-4) ...
Setting up libexpat1-dev:i386 (2.6.4-1) ...
Setting up libfftw3-quad3:i386 (3.3.10-2+b1) ...
Setting up libunistring5:i386 (1.3-1) ...
Setting up python3-numpy-dev:i386 (1:2.2.2+ds-2) ...
Setting up autopoint (0.23.1-1) ...
Setting up pkgconf-bin (1.8.1-4) ...
Setting up libk5crypto3:i386 (1.21.3-4) ...
Setting up libfftw3-double3:i386 (3.3.10-2+b1) ...
Setting up libgfortran5:i386 (14.2.0-16) ...
Setting up autoconf (2.72-3) ...
Setting up zlib1g-dev:i386 (1:1.3.dfsg+really1.3.1-1+b1) ...
Setting up libffi8:i386 (3.4.6-1) ...
Setting up dwz (0.15-1+b1) ...
Setting up sensible-utils (0.0.24) ...
Setting up libuchardet0:i386 (0.0.8-1+b2) ...
Setting up libjson-perl (4.10000-1) ...
Setting up netbase (6.4) ...
Setting up sgml-base (1.31) ...
Setting up libkrb5-3:i386 (1.21.3-4) ...
Setting up libjs-jquery (3.6.1+dfsg+~3.5.14-1) ...
Setting up openssl (3.4.0-2) ...
Setting up readline-common (8.2-6) ...
Setting up libxml2:i386 (2.12.7+dfsg+really2.9.14-0.2+b1) ...
Setting up libjs-underscore (1.13.4~dfsg+~1.11.4-3) ...
Setting up automake (1:1.17-3) ...
update-alternatives: using /usr/bin/automake-1.17 to provide /usr/bin/automake (automake) in auto mode
Setting up libfile-stripnondeterminism-perl (1.14.1-1) ...
Setting up python3.12-minimal (3.12.9-1) ...
Setting up liblapack3:i386 (3.12.1-2) ...
update-alternatives: using /usr/lib/i386-linux-gnu/lapack/liblapack.so.3 to provide /usr/lib/i386-linux-gnu/liblapack.so.3 (liblapack.so.3-i386-linux-gnu) in auto mode
Setting up gettext (0.23.1-1) ...
Setting up libtool (2.5.4-3) ...
Setting up libfftw3-bin (3.3.10-2+b1) ...
Setting up pkgconf:i386 (1.8.1-4) ...
Setting up intltool-debian (0.35.0+20060710.6) ...
Setting up dh-autoreconf (20) ...
Setting up python3.13-doc (3.13.2-1) ...
Setting up ca-certificates (20241223) ...
Updating certificates in /etc/ssl/certs...
152 added, 0 removed; done.
Setting up python-scipy-doc (1.14.1-4) ...
Setting up libgssapi-krb5-2:i386 (1.21.3-4) ...
Setting up pkg-config:i386 (1.8.1-4) ...
Setting up libjs-sphinxdoc (8.1.3-4) ...
Setting up libreadline8t64:i386 (8.2-6) ...
Setting up dh-strip-nondeterminism (1.14.1-1) ...
Setting up groff-base (1.23.0-7) ...
Setting up xml-core (0.19) ...
Setting up libpython3.13-stdlib:i386 (3.13.2-1) ...
Setting up libfftw3-dev:i386 (3.3.10-2+b1) ...
Setting up python3-doc (3.13.1-2) ...
Setting up libpython3-stdlib:i386 (3.13.1-2) ...
Setting up liblbfgsb0:i386 (3.0+dfsg.4-1+b2) ...
Setting up libpython3.13:i386 (3.13.2-1) ...
Setting up python-numpy-doc (1:2.2.2+ds-2) ...
Setting up libtirpc3t64:i386 (1.3.4+ds-1.3+b1) ...
Setting up python3.13 (3.13.2-1) ...
Setting up po-debconf (1.0.21+nmu1) ...
Setting up python3 (3.13.1-2) ...
Setting up python3-zipp (3.21.0-1) ...
Setting up python3-click (8.1.8-1) ...
Setting up python3-autocommand (2.2.2-3) ...
Setting up man-db (2.13.0-1) ...
Not building database; man-db/auto-update is not 'true'.
Setting up python3-markupsafe (2.1.5-1+b2) ...
Setting up python3-wheel (0.45.1-1) ...
Setting up python3-cloudpickle (3.1.1-1) ...
Setting up python3-roman (5.0-1) ...
Setting up python3-decorator (5.1.1-5) ...
Setting up python3-jinja2 (3.1.5-2) ...
Setting up python3-pygments (2.18.0+dfsg-2) ...
Setting up python3-packaging (24.2-1) ...
Setting up python3-chardet (5.2.0+dfsg-2) ...
Setting up python3-pyproject-hooks (1.2.0-1) ...
Setting up python3-certifi (2024.12.14+ds-1) ...
Setting up python3-snowballstemmer (2.2.0-4) ...
Setting up libpython3.13-dev:i386 (3.13.2-1) ...
Setting up sphinx-common (8.1.3-4) ...
Setting up python3-idna (3.10-1) ...
Setting up cython3 (3.0.11+dfsg-1+b2) ...
Setting up python3-typing-extensions (4.12.2-2) ...
Setting up python3-numpy (1:2.2.2+ds-2) ...
Setting up python3-toml (0.10.2-1) ...
Setting up python3-installer (0.7.0+dfsg1-3) ...
Setting up python3-urllib3 (2.3.0-1) ...
Setting up python3-pluggy (1.5.0-1) ...
Setting up libnsl2:i386 (1.3.0-3+b3) ...
Setting up python3-toolz (1.0.0-2) ...
Setting up python3-pkgconfig (1.5.5-2) ...
Setting up python3-build (1.2.2-1) ...
Setting up python3-locket (1.0.0-2) ...
Setting up python3-imagesize (1.4.1-1) ...
Setting up python3-partd (1.4.2-1) ...
Setting up python3-more-itertools (10.6.0-1) ...
Setting up python3-iniconfig (1.1.1-2) ...
Setting up python3-scipy (1.14.1-4) ...
Setting up libpython3-dev:i386 (3.13.1-2) ...
Setting up python3-jaraco.functools (4.1.0-1) ...
Setting up libpython3.12-stdlib:i386 (3.12.9-1) ...
Setting up python3-jaraco.context (6.0.0-1) ...
Setting up python3-babel (2.17.0-1) ...
update-alternatives: using /usr/bin/pybabel-python3 to provide /usr/bin/pybabel (pybabel) in auto mode
Setting up python3-defusedxml (0.7.1-3) ...
Setting up python3-charset-normalizer (3.4.0-1+b1) ...
Setting up python3.13-dev (3.13.2-1) ...
Setting up python3-pytest (8.3.4-1) ...
Setting up python3-alabaster (0.7.16-0.1) ...
Setting up python3.12 (3.12.9-1) ...
Setting up python3-fsspec (2024.12.0-2) ...
Setting up python3-typeguard (4.4.1-1) ...
Setting up python3-all (3.13.1-2) ...
Setting up python3-yaml (6.0.2-1+b1) ...
Setting up debhelper (13.24.1) ...
Setting up libpython3.12t64:i386 (3.12.9-1) ...
Setting up python3-inflect (7.3.1-2) ...
Setting up python3-jaraco.text (4.0.0-1) ...
Setting up python3-dev (3.13.1-2) ...
Setting up python3-requests (2.32.3+dfsg-1) ...
Setting up python3-pkg-resources (75.6.0-1) ...
Setting up python3-setuptools (75.6.0-1) ...
Setting up python3-dask (2024.12.1+dfsg-2) ...
Setting up libpython3.12-dev:i386 (3.12.9-1) ...
Setting up libpython3-all-dev:i386 (3.13.1-2) ...
Setting up python3.12-dev (3.12.9-1) ...
Setting up dh-python (6.20250108) ...
Setting up python3-all-dev (3.13.1-2) ...
Setting up pybuild-plugin-pyproject (6.20250108) ...
Processing triggers for libc-bin (2.40-6) ...
Processing triggers for sgml-base (1.31) ...
Setting up docutils-common (0.21.2+dfsg-2) ...
Processing triggers for sgml-base (1.31) ...
Setting up python3-docutils (0.21.2+dfsg-2) ...
Setting up python3-sphinx (8.1.3-4) ...
Processing triggers for ca-certificates (20241223) ...
Updating certificates in /etc/ssl/certs...
0 added, 0 removed; done.
Running hooks in /etc/ca-certificates/update.d...
done.
Reading package lists...
Building dependency tree...
Reading state information...
Reading extended state information...
Initializing package states...
Writing extended state information...
Building tag database...
 -> Finished parsing the build-deps
I: Building the package
I: user script /srv/workspace/pbuilder/17652/tmp/hooks/A99_set_merged_usr starting
Not re-configuring usrmerge for unstable
I: user script /srv/workspace/pbuilder/17652/tmp/hooks/A99_set_merged_usr finished
hostname: Name or service not known
I: Running cd /build/reproducible-path/pyfftw-0.15.0/ && env PATH="/usr/sbin:/usr/bin:/sbin:/bin:/usr/games:/i/capture/the/path" HOME="/nonexistent/second-build" dpkg-buildpackage -us -uc -b && env PATH="/usr/sbin:/usr/bin:/sbin:/bin:/usr/games:/i/capture/the/path" HOME="/nonexistent/second-build" dpkg-genchanges -S  > ../pyfftw_0.15.0-1_source.changes
dpkg-buildpackage: info: source package pyfftw
dpkg-buildpackage: info: source version 0.15.0-1
dpkg-buildpackage: info: source distribution unstable
dpkg-buildpackage: info: source changed by Michael R. Crusoe <crusoe@debian.org>
 dpkg-source --before-build .
dpkg-buildpackage: info: host architecture i386
 debian/rules clean
dh clean --buildsystem=pybuild
   dh_auto_clean -O--buildsystem=pybuild
   dh_autoreconf_clean -O--buildsystem=pybuild
   dh_clean -O--buildsystem=pybuild
 debian/rules binary
dh binary --buildsystem=pybuild
   dh_update_autotools_config -O--buildsystem=pybuild
   dh_autoreconf -O--buildsystem=pybuild
   dh_auto_configure -O--buildsystem=pybuild
   dh_auto_build -O--buildsystem=pybuild
I: pybuild pybuild:308: find -name "*.c" -delete
I: pybuild plugin_pyproject:129: Building wheel for python3.12 with "build" module
I: pybuild base:311: python3.12 -m build --skip-dependency-check --no-isolation --wheel --outdir /build/reproducible-path/pyfftw-0.15.0/.pybuild/cpython3_3.12_pyfftw  
* Building wheel...
INFO:root:running bdist_wheel
INFO:root:running build
INFO:root:running build_py
WARNING:root:file pyfftw.py (for module pyfftw) not found
INFO:root:creating build/lib.linux-i686-cpython-312/pyfftw
INFO:root:copying pyfftw/_version.py -> build/lib.linux-i686-cpython-312/pyfftw
INFO:root:copying pyfftw/config.py -> build/lib.linux-i686-cpython-312/pyfftw
INFO:root:copying pyfftw/__init__.py -> build/lib.linux-i686-cpython-312/pyfftw
INFO:root:creating build/lib.linux-i686-cpython-312/pyfftw/builders
INFO:root:copying pyfftw/builders/builders.py -> build/lib.linux-i686-cpython-312/pyfftw/builders
INFO:root:copying pyfftw/builders/_utils.py -> build/lib.linux-i686-cpython-312/pyfftw/builders
INFO:root:copying pyfftw/builders/__init__.py -> build/lib.linux-i686-cpython-312/pyfftw/builders
INFO:root:creating build/lib.linux-i686-cpython-312/pyfftw/interfaces
INFO:root:copying pyfftw/interfaces/scipy_fft.py -> build/lib.linux-i686-cpython-312/pyfftw/interfaces
INFO:root:copying pyfftw/interfaces/numpy_fft.py -> build/lib.linux-i686-cpython-312/pyfftw/interfaces
INFO:root:copying pyfftw/interfaces/_utils.py -> build/lib.linux-i686-cpython-312/pyfftw/interfaces
INFO:root:copying pyfftw/interfaces/scipy_fftpack.py -> build/lib.linux-i686-cpython-312/pyfftw/interfaces
INFO:root:copying pyfftw/interfaces/dask_fft.py -> build/lib.linux-i686-cpython-312/pyfftw/interfaces
INFO:root:copying pyfftw/interfaces/__init__.py -> build/lib.linux-i686-cpython-312/pyfftw/interfaces
INFO:root:copying pyfftw/interfaces/cache.py -> build/lib.linux-i686-cpython-312/pyfftw/interfaces
INFO:root:running egg_info
INFO:root:creating pyFFTW.egg-info
INFO:root:writing pyFFTW.egg-info/PKG-INFO
INFO:root:writing dependency_links to pyFFTW.egg-info/dependency_links.txt
INFO:root:writing requirements to pyFFTW.egg-info/requires.txt
INFO:root:writing top-level names to pyFFTW.egg-info/top_level.txt
INFO:root:writing manifest file 'pyFFTW.egg-info/SOURCES.txt'
WARNING:root:file pyfftw.py (for module pyfftw) not found
INFO:root:reading manifest file 'pyFFTW.egg-info/SOURCES.txt'
INFO:root:reading manifest template 'MANIFEST.in'
WARNING:root:warning: no files found matching 'CHANGELOG.md'
WARNING:root:warning: no files found matching 'requirements.txt'
WARNING:root:warning: no files found matching 'README.rst'
WARNING:root:warning: no files found matching 'test/*.py'
WARNING:root:no previously-included directories found matching 'docs/_build'
WARNING:root:no previously-included directories found matching 'build'
WARNING:root:no previously-included directories found matching '*/__pycache__'
WARNING:root:warning: no previously-included files matching '*.py[cod]' found anywhere in distribution
WARNING:root:warning: no previously-included files matching '*.so' found anywhere in distribution
WARNING:root:warning: no previously-included files matching '*.dll' found anywhere in distribution
WARNING:root:warning: no previously-included files matching '*.dylib' found anywhere in distribution
WARNING:root:warning: no previously-included files matching '*~' found anywhere in distribution
WARNING:root:warning: no previously-included files matching '*.bak' found anywhere in distribution
WARNING:root:warning: no previously-included files matching '*.swp' found anywhere in distribution
INFO:root:adding license file 'LICENSE.txt'
INFO:root:writing manifest file 'pyFFTW.egg-info/SOURCES.txt'
INFO:root:copying pyfftw/__init__.pxd -> build/lib.linux-i686-cpython-312/pyfftw
INFO:root:copying pyfftw/cpu.pxd -> build/lib.linux-i686-cpython-312/pyfftw
INFO:root:copying pyfftw/pyfftw.pxd -> build/lib.linux-i686-cpython-312/pyfftw
INFO:root:copying pyfftw/pyfftw.pyx -> build/lib.linux-i686-cpython-312/pyfftw
INFO:root:copying pyfftw/utils.pxi -> build/lib.linux-i686-cpython-312/pyfftw
WARNING:root:file pyfftw.py (for module pyfftw) not found
INFO:root:running build_ext
INFO:root:i686-linux-gnu-gcc -fno-strict-overflow -Wsign-compare -DNDEBUG -g -O2 -Wall -g -O2 -Werror=implicit-function-declaration -ffile-prefix-map=/build/reproducible-path/pyfftw-0.15.0=. -fstack-protector-strong -Wformat -Werror=format-security -Wdate-time -D_FORTIFY_SOURCE=2 -fPIC -I/build/reproducible-path/pyfftw-0.15.0/include -I/build/reproducible-path/pyfftw-0.15.0/pyfftw -I/usr/lib/i386-linux-gnu/python3-numpy/numpy/_core/include -I/usr/include -I/usr/include -I/usr/include/python3.12 -c /tmp/pyfftw-3lugjfxa/None.c -o /tmp/pyfftw-3lugjfxa/None.o
INFO:root:i686-linux-gnu-gcc -Wl,-z,relro /tmp/pyfftw-3lugjfxa/None.o -L/usr/lib -L/usr/lib/i386-linux-gnu -lm -o /tmp/pyfftw-3lugjfxa/a.out
INFO:root:i686-linux-gnu-gcc -fno-strict-overflow -Wsign-compare -DNDEBUG -g -O2 -Wall -g -O2 -Werror=implicit-function-declaration -ffile-prefix-map=/build/reproducible-path/pyfftw-0.15.0=. -fstack-protector-strong -Wformat -Werror=format-security -Wdate-time -D_FORTIFY_SOURCE=2 -fPIC -I/build/reproducible-path/pyfftw-0.15.0/include -I/build/reproducible-path/pyfftw-0.15.0/pyfftw -I/usr/lib/i386-linux-gnu/python3-numpy/numpy/_core/include -I/usr/include -I/usr/include -I/usr/include/python3.12 -c /tmp/pyfftw-i85627i2/fftw_plan_dft.c -o /tmp/pyfftw-i85627i2/fftw_plan_dft.o
INFO:root:i686-linux-gnu-gcc -Wl,-z,relro /tmp/pyfftw-i85627i2/fftw_plan_dft.o -L/usr/lib -L/usr/lib/i386-linux-gnu -lfftw3 -lm -o /tmp/pyfftw-i85627i2/a.out
INFO:root:i686-linux-gnu-gcc -fno-strict-overflow -Wsign-compare -DNDEBUG -g -O2 -Wall -g -O2 -Werror=implicit-function-declaration -ffile-prefix-map=/build/reproducible-path/pyfftw-0.15.0=. -fstack-protector-strong -Wformat -Werror=format-security -Wdate-time -D_FORTIFY_SOURCE=2 -fPIC -I/build/reproducible-path/pyfftw-0.15.0/include -I/build/reproducible-path/pyfftw-0.15.0/pyfftw -I/usr/lib/i386-linux-gnu/python3-numpy/numpy/_core/include -I/usr/include -I/usr/include -I/usr/include/python3.12 -c /tmp/pyfftw-o3u2scnj/fftw_init_threads.c -o /tmp/pyfftw-o3u2scnj/fftw_init_threads.o
INFO:root:i686-linux-gnu-gcc -Wl,-z,relro -fopenmp /tmp/pyfftw-o3u2scnj/fftw_init_threads.o -L/usr/lib -L/usr/lib/i386-linux-gnu -lfftw3_omp -lfftw3 -lm -o /tmp/pyfftw-o3u2scnj/a.out
INFO:root:i686-linux-gnu-gcc -fno-strict-overflow -Wsign-compare -DNDEBUG -g -O2 -Wall -g -O2 -Werror=implicit-function-declaration -ffile-prefix-map=/build/reproducible-path/pyfftw-0.15.0=. -fstack-protector-strong -Wformat -Werror=format-security -Wdate-time -D_FORTIFY_SOURCE=2 -fPIC -I/build/reproducible-path/pyfftw-0.15.0/include -I/build/reproducible-path/pyfftw-0.15.0/pyfftw -I/usr/lib/i386-linux-gnu/python3-numpy/numpy/_core/include -I/usr/include -I/usr/include -I/usr/include/python3.12 -c /tmp/pyfftw-kll7ygo7/fftwf_plan_dft.c -o /tmp/pyfftw-kll7ygo7/fftwf_plan_dft.o
INFO:root:i686-linux-gnu-gcc -Wl,-z,relro -fopenmp /tmp/pyfftw-kll7ygo7/fftwf_plan_dft.o -L/usr/lib -L/usr/lib/i386-linux-gnu -lfftw3f -lfftw3_omp -lfftw3 -lm -o /tmp/pyfftw-kll7ygo7/a.out
INFO:root:i686-linux-gnu-gcc -fno-strict-overflow -Wsign-compare -DNDEBUG -g -O2 -Wall -g -O2 -Werror=implicit-function-declaration -ffile-prefix-map=/build/reproducible-path/pyfftw-0.15.0=. -fstack-protector-strong -Wformat -Werror=format-security -Wdate-time -D_FORTIFY_SOURCE=2 -fPIC -I/build/reproducible-path/pyfftw-0.15.0/include -I/build/reproducible-path/pyfftw-0.15.0/pyfftw -I/usr/lib/i386-linux-gnu/python3-numpy/numpy/_core/include -I/usr/include -I/usr/include -I/usr/include/python3.12 -c /tmp/pyfftw-zkgddeeu/fftwf_init_threads.c -o /tmp/pyfftw-zkgddeeu/fftwf_init_threads.o
INFO:root:i686-linux-gnu-gcc -Wl,-z,relro -fopenmp -fopenmp /tmp/pyfftw-zkgddeeu/fftwf_init_threads.o -L/usr/lib -L/usr/lib/i386-linux-gnu -lfftw3f_omp -lfftw3f -lfftw3_omp -lfftw3 -lm -o /tmp/pyfftw-zkgddeeu/a.out
INFO:root:i686-linux-gnu-gcc -fno-strict-overflow -Wsign-compare -DNDEBUG -g -O2 -Wall -g -O2 -Werror=implicit-function-declaration -ffile-prefix-map=/build/reproducible-path/pyfftw-0.15.0=. -fstack-protector-strong -Wformat -Werror=format-security -Wdate-time -D_FORTIFY_SOURCE=2 -fPIC -I/build/reproducible-path/pyfftw-0.15.0/include -I/build/reproducible-path/pyfftw-0.15.0/pyfftw -I/usr/lib/i386-linux-gnu/python3-numpy/numpy/_core/include -I/usr/include -I/usr/include -I/usr/include/python3.12 -c /tmp/pyfftw-qio35ih1/fftwl_plan_dft.c -o /tmp/pyfftw-qio35ih1/fftwl_plan_dft.o
INFO:root:i686-linux-gnu-gcc -Wl,-z,relro -fopenmp -fopenmp /tmp/pyfftw-qio35ih1/fftwl_plan_dft.o -L/usr/lib -L/usr/lib/i386-linux-gnu -lfftw3l -lfftw3f_omp -lfftw3f -lfftw3_omp -lfftw3 -lm -o /tmp/pyfftw-qio35ih1/a.out
INFO:root:i686-linux-gnu-gcc -fno-strict-overflow -Wsign-compare -DNDEBUG -g -O2 -Wall -g -O2 -Werror=implicit-function-declaration -ffile-prefix-map=/build/reproducible-path/pyfftw-0.15.0=. -fstack-protector-strong -Wformat -Werror=format-security -Wdate-time -D_FORTIFY_SOURCE=2 -fPIC -I/build/reproducible-path/pyfftw-0.15.0/include -I/build/reproducible-path/pyfftw-0.15.0/pyfftw -I/usr/lib/i386-linux-gnu/python3-numpy/numpy/_core/include -I/usr/include -I/usr/include -I/usr/include/python3.12 -c /tmp/pyfftw-jsppk_b1/fftwl_init_threads.c -o /tmp/pyfftw-jsppk_b1/fftwl_init_threads.o
INFO:root:i686-linux-gnu-gcc -Wl,-z,relro -fopenmp -fopenmp -fopenmp /tmp/pyfftw-jsppk_b1/fftwl_init_threads.o -L/usr/lib -L/usr/lib/i386-linux-gnu -lfftw3l_omp -lfftw3l -lfftw3f_omp -lfftw3f -lfftw3_omp -lfftw3 -lm -o /tmp/pyfftw-jsppk_b1/a.out
INFO:__main__:Build pyFFTW with support for FFTW with
INFO:__main__:double precision + openMP
INFO:__main__:single precision + openMP
INFO:__main__:long precision + openMP
warning: pyfftw/pyfftw.pxd:431:8: 'FFTW_R2HC' redeclared 
warning: pyfftw/pyfftw.pxd:432:8: 'FFTW_HC2R' redeclared 
warning: pyfftw/pyfftw.pxd:433:8: 'FFTW_DHT' redeclared 
warning: pyfftw/pyfftw.pxd:435:8: 'FFTW_REDFT00' redeclared 
warning: pyfftw/pyfftw.pxd:436:8: 'FFTW_REDFT01' redeclared 
warning: pyfftw/pyfftw.pxd:437:8: 'FFTW_REDFT10' redeclared 
warning: pyfftw/pyfftw.pxd:438:8: 'FFTW_REDFT11' redeclared 
warning: pyfftw/pyfftw.pxd:439:8: 'FFTW_RODFT00' redeclared 
warning: pyfftw/pyfftw.pxd:440:8: 'FFTW_RODFT01' redeclared 
warning: pyfftw/pyfftw.pxd:441:8: 'FFTW_RODFT10' redeclared 
warning: pyfftw/pyfftw.pxd:442:8: 'FFTW_RODFT11' redeclared 
warning: pyfftw/pyfftw.pxd:445:8: 'FFTW_R2HC' redeclared 
warning: pyfftw/pyfftw.pxd:446:8: 'FFTW_HC2R' redeclared 
warning: pyfftw/pyfftw.pxd:447:8: 'FFTW_DHT' redeclared 
warning: pyfftw/pyfftw.pxd:449:8: 'FFTW_REDFT00' redeclared 
warning: pyfftw/pyfftw.pxd:450:8: 'FFTW_REDFT01' redeclared 
warning: pyfftw/pyfftw.pxd:451:8: 'FFTW_REDFT10' redeclared 
warning: pyfftw/pyfftw.pxd:452:8: 'FFTW_REDFT11' redeclared 
warning: pyfftw/pyfftw.pxd:453:8: 'FFTW_RODFT00' redeclared 
warning: pyfftw/pyfftw.pxd:454:8: 'FFTW_RODFT01' redeclared 
warning: pyfftw/pyfftw.pxd:455:8: 'FFTW_RODFT10' redeclared 
warning: pyfftw/pyfftw.pxd:456:8: 'FFTW_RODFT11' redeclared 
performance hint: pyfftw/pyfftw.pyx:334:5: Exception check on '_fftw_execute_null' will always require the GIL to be acquired.
Possible solutions:
	1. Declare '_fftw_execute_null' as 'noexcept' if you control the definition and you're sure you don't want the function to raise exceptions.
	2. Use an 'int' return type on '_fftw_execute_null' to allow an error code to be returned.
performance hint: pyfftw/pyfftw.pyx:1425:31: Exception check after calling 'fftw_planner' will always require the GIL to be acquired. Declare 'fftw_planner' as 'noexcept' if you control the definition and you're sure you don't want the function to raise exceptions.
UPDATING build/lib.linux-i686-cpython-312/pyfftw/_version.py
set build/lib.linux-i686-cpython-312/pyfftw/_version.py to '0.15.0'
Compiling pyfftw/pyfftw.pyx because it changed.
[1/1] Cythonizing pyfftw/pyfftw.pyx
INFO:root:building 'pyfftw.pyfftw' extension
INFO:root:creating build/temp.linux-i686-cpython-312/pyfftw
INFO:root:i686-linux-gnu-gcc -fno-strict-overflow -Wsign-compare -DNDEBUG -g -O2 -Wall -g -O2 -Werror=implicit-function-declaration -ffile-prefix-map=/build/reproducible-path/pyfftw-0.15.0=. -fstack-protector-strong -Wformat -Werror=format-security -Wdate-time -D_FORTIFY_SOURCE=2 -fPIC -DPYFFTW_HAVE_DOUBLE=1 -DPYFFTW_HAVE_DOUBLE_OMP=1 -DPYFFTW_HAVE_DOUBLE_THREADS=0 -DPYFFTW_HAVE_DOUBLE_MULTITHREADING=1 -DPYFFTW_HAVE_DOUBLE_MPI=0 -DPYFFTW_HAVE_SINGLE=1 -DPYFFTW_HAVE_SINGLE_OMP=1 -DPYFFTW_HAVE_SINGLE_THREADS=0 -DPYFFTW_HAVE_SINGLE_MULTITHREADING=1 -DPYFFTW_HAVE_SINGLE_MPI=0 -DPYFFTW_HAVE_LONG=1 -DPYFFTW_HAVE_LONG_OMP=1 -DPYFFTW_HAVE_LONG_THREADS=0 -DPYFFTW_HAVE_LONG_MULTITHREADING=1 -DPYFFTW_HAVE_LONG_MPI=0 -DPYFFTW_HAVE_MPI=0 -DNPY_NO_DEPRECATED_API=NPY_1_7_API_VERSION -DFFTW_NO_Complex=1 -I/build/reproducible-path/pyfftw-0.15.0/include -I/build/reproducible-path/pyfftw-0.15.0/pyfftw -I/usr/lib/i386-linux-gnu/python3-numpy/numpy/_core/include -I/usr/include -I/usr/include -I/usr/include/python3.12 -I/usr/include/python3.12 -c pyfftw/pyfftw.c -o build/temp.linux-i686-cpython-312/pyfftw/pyfftw.o
pyfftw/pyfftw.c: In function '__pyx_pf_6pyfftw_6pyfftw_4FFTW_34__cinit__.isra':
pyfftw/pyfftw.c:22737:6: warning: '__pyx_v_plan' may be used uninitialized [-Wmaybe-uninitialized]
22737 |   if (__pyx_t_11) {
      |      ^
pyfftw/pyfftw.c:19135:9: note: '__pyx_v_plan' was declared here
19135 |   void *__pyx_v_plan;
      |         ^~~~~~~~~~~~
INFO:root:i686-linux-gnu-gcc -shared -Wl,-O1 -Wl,-Bsymbolic-functions -Wl,-z,relro -g -fwrapv -O2 -Wl,-z,relro -g -O2 -Werror=implicit-function-declaration -ffile-prefix-map=/build/reproducible-path/pyfftw-0.15.0=. -fstack-protector-strong -Wformat -Werror=format-security -Wdate-time -D_FORTIFY_SOURCE=2 build/temp.linux-i686-cpython-312/pyfftw/pyfftw.o -L/usr/lib/i386-linux-gnu -L/usr/lib -L/usr/lib/i386-linux-gnu -lfftw3l_omp -lfftw3l -lfftw3f_omp -lfftw3f -lfftw3_omp -lfftw3 -lm -o build/lib.linux-i686-cpython-312/pyfftw/pyfftw.cpython-312-i386-linux-gnu.so
INFO:root:installing to build/bdist.linux-i686/wheel
INFO:root:running install
INFO:root:running install_lib
INFO:root:creating build/bdist.linux-i686/wheel
INFO:root:creating build/bdist.linux-i686/wheel/pyfftw
INFO:root:creating build/bdist.linux-i686/wheel/pyfftw/interfaces
INFO:root:copying build/lib.linux-i686-cpython-312/pyfftw/interfaces/scipy_fft.py -> build/bdist.linux-i686/wheel/./pyfftw/interfaces
INFO:root:copying build/lib.linux-i686-cpython-312/pyfftw/interfaces/numpy_fft.py -> build/bdist.linux-i686/wheel/./pyfftw/interfaces
INFO:root:copying build/lib.linux-i686-cpython-312/pyfftw/interfaces/_utils.py -> build/bdist.linux-i686/wheel/./pyfftw/interfaces
INFO:root:copying build/lib.linux-i686-cpython-312/pyfftw/interfaces/scipy_fftpack.py -> build/bdist.linux-i686/wheel/./pyfftw/interfaces
INFO:root:copying build/lib.linux-i686-cpython-312/pyfftw/interfaces/dask_fft.py -> build/bdist.linux-i686/wheel/./pyfftw/interfaces
INFO:root:copying build/lib.linux-i686-cpython-312/pyfftw/interfaces/__init__.py -> build/bdist.linux-i686/wheel/./pyfftw/interfaces
INFO:root:copying build/lib.linux-i686-cpython-312/pyfftw/interfaces/cache.py -> build/bdist.linux-i686/wheel/./pyfftw/interfaces
INFO:root:copying build/lib.linux-i686-cpython-312/pyfftw/utils.pxi -> build/bdist.linux-i686/wheel/./pyfftw
INFO:root:copying build/lib.linux-i686-cpython-312/pyfftw/pyfftw.pyx -> build/bdist.linux-i686/wheel/./pyfftw
INFO:root:copying build/lib.linux-i686-cpython-312/pyfftw/__init__.pxd -> build/bdist.linux-i686/wheel/./pyfftw
INFO:root:copying build/lib.linux-i686-cpython-312/pyfftw/cpu.pxd -> build/bdist.linux-i686/wheel/./pyfftw
INFO:root:copying build/lib.linux-i686-cpython-312/pyfftw/_version.py -> build/bdist.linux-i686/wheel/./pyfftw
INFO:root:copying build/lib.linux-i686-cpython-312/pyfftw/pyfftw.pxd -> build/bdist.linux-i686/wheel/./pyfftw
INFO:root:copying build/lib.linux-i686-cpython-312/pyfftw/pyfftw.cpython-312-i386-linux-gnu.so -> build/bdist.linux-i686/wheel/./pyfftw
INFO:root:copying build/lib.linux-i686-cpython-312/pyfftw/config.py -> build/bdist.linux-i686/wheel/./pyfftw
INFO:root:creating build/bdist.linux-i686/wheel/pyfftw/builders
INFO:root:copying build/lib.linux-i686-cpython-312/pyfftw/builders/builders.py -> build/bdist.linux-i686/wheel/./pyfftw/builders
INFO:root:copying build/lib.linux-i686-cpython-312/pyfftw/builders/_utils.py -> build/bdist.linux-i686/wheel/./pyfftw/builders
INFO:root:copying build/lib.linux-i686-cpython-312/pyfftw/builders/__init__.py -> build/bdist.linux-i686/wheel/./pyfftw/builders
INFO:root:copying build/lib.linux-i686-cpython-312/pyfftw/__init__.py -> build/bdist.linux-i686/wheel/./pyfftw
INFO:root:running install_egg_info
INFO:root:Copying pyFFTW.egg-info to build/bdist.linux-i686/wheel/./pyFFTW-0.15.0.egg-info
INFO:root:running install_scripts
INFO:root:creating build/bdist.linux-i686/wheel/pyFFTW-0.15.0.dist-info/WHEEL
INFO:wheel:creating '/build/reproducible-path/pyfftw-0.15.0/.pybuild/cpython3_3.12_pyfftw/.tmp-1k_mbent/pyFFTW-0.15.0-cp312-cp312-linux_i686.whl' and adding 'build/bdist.linux-i686/wheel' to it
INFO:wheel:adding 'pyfftw/__init__.pxd'
INFO:wheel:adding 'pyfftw/__init__.py'
INFO:wheel:adding 'pyfftw/_version.py'
INFO:wheel:adding 'pyfftw/config.py'
INFO:wheel:adding 'pyfftw/cpu.pxd'
INFO:wheel:adding 'pyfftw/pyfftw.cpython-312-i386-linux-gnu.so'
INFO:wheel:adding 'pyfftw/pyfftw.pxd'
INFO:wheel:adding 'pyfftw/pyfftw.pyx'
INFO:wheel:adding 'pyfftw/utils.pxi'
INFO:wheel:adding 'pyfftw/builders/__init__.py'
INFO:wheel:adding 'pyfftw/builders/_utils.py'
INFO:wheel:adding 'pyfftw/builders/builders.py'
INFO:wheel:adding 'pyfftw/interfaces/__init__.py'
INFO:wheel:adding 'pyfftw/interfaces/_utils.py'
INFO:wheel:adding 'pyfftw/interfaces/cache.py'
INFO:wheel:adding 'pyfftw/interfaces/dask_fft.py'
INFO:wheel:adding 'pyfftw/interfaces/numpy_fft.py'
INFO:wheel:adding 'pyfftw/interfaces/scipy_fft.py'
INFO:wheel:adding 'pyfftw/interfaces/scipy_fftpack.py'
INFO:wheel:adding 'pyFFTW-0.15.0.dist-info/LICENSE.txt'
INFO:wheel:adding 'pyFFTW-0.15.0.dist-info/METADATA'
INFO:wheel:adding 'pyFFTW-0.15.0.dist-info/WHEEL'
INFO:wheel:adding 'pyFFTW-0.15.0.dist-info/top_level.txt'
INFO:wheel:adding 'pyFFTW-0.15.0.dist-info/RECORD'
INFO:root:removing build/bdist.linux-i686/wheel
Successfully built pyFFTW-0.15.0-cp312-cp312-linux_i686.whl
I: pybuild plugin_pyproject:144: Unpacking wheel built for python3.12 with "installer" module
I: pybuild pybuild:308: find -name "*.c" -delete
I: pybuild plugin_pyproject:129: Building wheel for python3.13 with "build" module
I: pybuild base:311: python3.13 -m build --skip-dependency-check --no-isolation --wheel --outdir /build/reproducible-path/pyfftw-0.15.0/.pybuild/cpython3_3.13_pyfftw  
* Building wheel...
INFO:root:running bdist_wheel
INFO:root:running build
INFO:root:running build_py
WARNING:root:file pyfftw.py (for module pyfftw) not found
INFO:root:creating build/lib.linux-i686-cpython-313/pyfftw
INFO:root:copying pyfftw/_version.py -> build/lib.linux-i686-cpython-313/pyfftw
INFO:root:copying pyfftw/config.py -> build/lib.linux-i686-cpython-313/pyfftw
INFO:root:copying pyfftw/__init__.py -> build/lib.linux-i686-cpython-313/pyfftw
INFO:root:creating build/lib.linux-i686-cpython-313/pyfftw/builders
INFO:root:copying pyfftw/builders/builders.py -> build/lib.linux-i686-cpython-313/pyfftw/builders
INFO:root:copying pyfftw/builders/_utils.py -> build/lib.linux-i686-cpython-313/pyfftw/builders
INFO:root:copying pyfftw/builders/__init__.py -> build/lib.linux-i686-cpython-313/pyfftw/builders
INFO:root:creating build/lib.linux-i686-cpython-313/pyfftw/interfaces
INFO:root:copying pyfftw/interfaces/scipy_fft.py -> build/lib.linux-i686-cpython-313/pyfftw/interfaces
INFO:root:copying pyfftw/interfaces/numpy_fft.py -> build/lib.linux-i686-cpython-313/pyfftw/interfaces
INFO:root:copying pyfftw/interfaces/_utils.py -> build/lib.linux-i686-cpython-313/pyfftw/interfaces
INFO:root:copying pyfftw/interfaces/scipy_fftpack.py -> build/lib.linux-i686-cpython-313/pyfftw/interfaces
INFO:root:copying pyfftw/interfaces/dask_fft.py -> build/lib.linux-i686-cpython-313/pyfftw/interfaces
INFO:root:copying pyfftw/interfaces/__init__.py -> build/lib.linux-i686-cpython-313/pyfftw/interfaces
INFO:root:copying pyfftw/interfaces/cache.py -> build/lib.linux-i686-cpython-313/pyfftw/interfaces
INFO:root:running egg_info
INFO:root:writing pyFFTW.egg-info/PKG-INFO
INFO:root:writing dependency_links to pyFFTW.egg-info/dependency_links.txt
INFO:root:writing requirements to pyFFTW.egg-info/requires.txt
INFO:root:writing top-level names to pyFFTW.egg-info/top_level.txt
WARNING:root:file pyfftw.py (for module pyfftw) not found
INFO:root:reading manifest file 'pyFFTW.egg-info/SOURCES.txt'
INFO:root:reading manifest template 'MANIFEST.in'
WARNING:root:warning: no files found matching 'CHANGELOG.md'
WARNING:root:warning: no files found matching 'requirements.txt'
WARNING:root:warning: no files found matching 'README.rst'
WARNING:root:warning: no files found matching 'test/*.py'
WARNING:root:no previously-included directories found matching 'docs/_build'
WARNING:root:no previously-included directories found matching 'build'
WARNING:root:no previously-included directories found matching '*/__pycache__'
WARNING:root:warning: no previously-included files matching '*.py[cod]' found anywhere in distribution
WARNING:root:warning: no previously-included files matching '*.so' found anywhere in distribution
WARNING:root:warning: no previously-included files matching '*.dll' found anywhere in distribution
WARNING:root:warning: no previously-included files matching '*.dylib' found anywhere in distribution
WARNING:root:warning: no previously-included files matching '*~' found anywhere in distribution
WARNING:root:warning: no previously-included files matching '*.bak' found anywhere in distribution
WARNING:root:warning: no previously-included files matching '*.swp' found anywhere in distribution
INFO:root:adding license file 'LICENSE.txt'
INFO:root:writing manifest file 'pyFFTW.egg-info/SOURCES.txt'
INFO:root:copying pyfftw/__init__.pxd -> build/lib.linux-i686-cpython-313/pyfftw
INFO:root:copying pyfftw/cpu.pxd -> build/lib.linux-i686-cpython-313/pyfftw
INFO:root:copying pyfftw/pyfftw.pxd -> build/lib.linux-i686-cpython-313/pyfftw
INFO:root:copying pyfftw/pyfftw.pyx -> build/lib.linux-i686-cpython-313/pyfftw
INFO:root:copying pyfftw/utils.pxi -> build/lib.linux-i686-cpython-313/pyfftw
WARNING:root:file pyfftw.py (for module pyfftw) not found
INFO:root:running build_ext
INFO:root:i686-linux-gnu-gcc -fno-strict-overflow -Wsign-compare -DNDEBUG -g -O2 -Wall -g -O2 -Werror=implicit-function-declaration -ffile-prefix-map=/build/reproducible-path/pyfftw-0.15.0=. -fstack-protector-strong -Wformat -Werror=format-security -Wdate-time -D_FORTIFY_SOURCE=2 -fPIC -I/build/reproducible-path/pyfftw-0.15.0/include -I/build/reproducible-path/pyfftw-0.15.0/pyfftw -I/usr/lib/i386-linux-gnu/python3-numpy/numpy/_core/include -I/usr/include -I/usr/include -I/usr/include/python3.13 -c /tmp/pyfftw-c0p4enwf/None.c -o /tmp/pyfftw-c0p4enwf/None.o
INFO:root:i686-linux-gnu-gcc -Wl,-z,relro /tmp/pyfftw-c0p4enwf/None.o -L/usr/lib -L/usr/lib/i386-linux-gnu -lm -o /tmp/pyfftw-c0p4enwf/a.out
INFO:root:i686-linux-gnu-gcc -fno-strict-overflow -Wsign-compare -DNDEBUG -g -O2 -Wall -g -O2 -Werror=implicit-function-declaration -ffile-prefix-map=/build/reproducible-path/pyfftw-0.15.0=. -fstack-protector-strong -Wformat -Werror=format-security -Wdate-time -D_FORTIFY_SOURCE=2 -fPIC -I/build/reproducible-path/pyfftw-0.15.0/include -I/build/reproducible-path/pyfftw-0.15.0/pyfftw -I/usr/lib/i386-linux-gnu/python3-numpy/numpy/_core/include -I/usr/include -I/usr/include -I/usr/include/python3.13 -c /tmp/pyfftw-y6q24c2f/fftw_plan_dft.c -o /tmp/pyfftw-y6q24c2f/fftw_plan_dft.o
INFO:root:i686-linux-gnu-gcc -Wl,-z,relro /tmp/pyfftw-y6q24c2f/fftw_plan_dft.o -L/usr/lib -L/usr/lib/i386-linux-gnu -lfftw3 -lm -o /tmp/pyfftw-y6q24c2f/a.out
INFO:root:i686-linux-gnu-gcc -fno-strict-overflow -Wsign-compare -DNDEBUG -g -O2 -Wall -g -O2 -Werror=implicit-function-declaration -ffile-prefix-map=/build/reproducible-path/pyfftw-0.15.0=. -fstack-protector-strong -Wformat -Werror=format-security -Wdate-time -D_FORTIFY_SOURCE=2 -fPIC -I/build/reproducible-path/pyfftw-0.15.0/include -I/build/reproducible-path/pyfftw-0.15.0/pyfftw -I/usr/lib/i386-linux-gnu/python3-numpy/numpy/_core/include -I/usr/include -I/usr/include -I/usr/include/python3.13 -c /tmp/pyfftw-oa9dy98h/fftw_init_threads.c -o /tmp/pyfftw-oa9dy98h/fftw_init_threads.o
INFO:root:i686-linux-gnu-gcc -Wl,-z,relro -fopenmp /tmp/pyfftw-oa9dy98h/fftw_init_threads.o -L/usr/lib -L/usr/lib/i386-linux-gnu -lfftw3_omp -lfftw3 -lm -o /tmp/pyfftw-oa9dy98h/a.out
INFO:root:i686-linux-gnu-gcc -fno-strict-overflow -Wsign-compare -DNDEBUG -g -O2 -Wall -g -O2 -Werror=implicit-function-declaration -ffile-prefix-map=/build/reproducible-path/pyfftw-0.15.0=. -fstack-protector-strong -Wformat -Werror=format-security -Wdate-time -D_FORTIFY_SOURCE=2 -fPIC -I/build/reproducible-path/pyfftw-0.15.0/include -I/build/reproducible-path/pyfftw-0.15.0/pyfftw -I/usr/lib/i386-linux-gnu/python3-numpy/numpy/_core/include -I/usr/include -I/usr/include -I/usr/include/python3.13 -c /tmp/pyfftw-srgjn8wg/fftwf_plan_dft.c -o /tmp/pyfftw-srgjn8wg/fftwf_plan_dft.o
INFO:root:i686-linux-gnu-gcc -Wl,-z,relro -fopenmp /tmp/pyfftw-srgjn8wg/fftwf_plan_dft.o -L/usr/lib -L/usr/lib/i386-linux-gnu -lfftw3f -lfftw3_omp -lfftw3 -lm -o /tmp/pyfftw-srgjn8wg/a.out
INFO:root:i686-linux-gnu-gcc -fno-strict-overflow -Wsign-compare -DNDEBUG -g -O2 -Wall -g -O2 -Werror=implicit-function-declaration -ffile-prefix-map=/build/reproducible-path/pyfftw-0.15.0=. -fstack-protector-strong -Wformat -Werror=format-security -Wdate-time -D_FORTIFY_SOURCE=2 -fPIC -I/build/reproducible-path/pyfftw-0.15.0/include -I/build/reproducible-path/pyfftw-0.15.0/pyfftw -I/usr/lib/i386-linux-gnu/python3-numpy/numpy/_core/include -I/usr/include -I/usr/include -I/usr/include/python3.13 -c /tmp/pyfftw-3h27y71s/fftwf_init_threads.c -o /tmp/pyfftw-3h27y71s/fftwf_init_threads.o
INFO:root:i686-linux-gnu-gcc -Wl,-z,relro -fopenmp -fopenmp /tmp/pyfftw-3h27y71s/fftwf_init_threads.o -L/usr/lib -L/usr/lib/i386-linux-gnu -lfftw3f_omp -lfftw3f -lfftw3_omp -lfftw3 -lm -o /tmp/pyfftw-3h27y71s/a.out
INFO:root:i686-linux-gnu-gcc -fno-strict-overflow -Wsign-compare -DNDEBUG -g -O2 -Wall -g -O2 -Werror=implicit-function-declaration -ffile-prefix-map=/build/reproducible-path/pyfftw-0.15.0=. -fstack-protector-strong -Wformat -Werror=format-security -Wdate-time -D_FORTIFY_SOURCE=2 -fPIC -I/build/reproducible-path/pyfftw-0.15.0/include -I/build/reproducible-path/pyfftw-0.15.0/pyfftw -I/usr/lib/i386-linux-gnu/python3-numpy/numpy/_core/include -I/usr/include -I/usr/include -I/usr/include/python3.13 -c /tmp/pyfftw-mvkmjizo/fftwl_plan_dft.c -o /tmp/pyfftw-mvkmjizo/fftwl_plan_dft.o
INFO:root:i686-linux-gnu-gcc -Wl,-z,relro -fopenmp -fopenmp /tmp/pyfftw-mvkmjizo/fftwl_plan_dft.o -L/usr/lib -L/usr/lib/i386-linux-gnu -lfftw3l -lfftw3f_omp -lfftw3f -lfftw3_omp -lfftw3 -lm -o /tmp/pyfftw-mvkmjizo/a.out
INFO:root:i686-linux-gnu-gcc -fno-strict-overflow -Wsign-compare -DNDEBUG -g -O2 -Wall -g -O2 -Werror=implicit-function-declaration -ffile-prefix-map=/build/reproducible-path/pyfftw-0.15.0=. -fstack-protector-strong -Wformat -Werror=format-security -Wdate-time -D_FORTIFY_SOURCE=2 -fPIC -I/build/reproducible-path/pyfftw-0.15.0/include -I/build/reproducible-path/pyfftw-0.15.0/pyfftw -I/usr/lib/i386-linux-gnu/python3-numpy/numpy/_core/include -I/usr/include -I/usr/include -I/usr/include/python3.13 -c /tmp/pyfftw-cfnng3i2/fftwl_init_threads.c -o /tmp/pyfftw-cfnng3i2/fftwl_init_threads.o
INFO:root:i686-linux-gnu-gcc -Wl,-z,relro -fopenmp -fopenmp -fopenmp /tmp/pyfftw-cfnng3i2/fftwl_init_threads.o -L/usr/lib -L/usr/lib/i386-linux-gnu -lfftw3l_omp -lfftw3l -lfftw3f_omp -lfftw3f -lfftw3_omp -lfftw3 -lm -o /tmp/pyfftw-cfnng3i2/a.out
INFO:__main__:Build pyFFTW with support for FFTW with
INFO:__main__:double precision + openMP
INFO:__main__:single precision + openMP
INFO:__main__:long precision + openMP
warning: pyfftw/pyfftw.pxd:431:8: 'FFTW_R2HC' redeclared 
warning: pyfftw/pyfftw.pxd:432:8: 'FFTW_HC2R' redeclared 
warning: pyfftw/pyfftw.pxd:433:8: 'FFTW_DHT' redeclared 
warning: pyfftw/pyfftw.pxd:435:8: 'FFTW_REDFT00' redeclared 
warning: pyfftw/pyfftw.pxd:436:8: 'FFTW_REDFT01' redeclared 
warning: pyfftw/pyfftw.pxd:437:8: 'FFTW_REDFT10' redeclared 
warning: pyfftw/pyfftw.pxd:438:8: 'FFTW_REDFT11' redeclared 
warning: pyfftw/pyfftw.pxd:439:8: 'FFTW_RODFT00' redeclared 
warning: pyfftw/pyfftw.pxd:440:8: 'FFTW_RODFT01' redeclared 
warning: pyfftw/pyfftw.pxd:441:8: 'FFTW_RODFT10' redeclared 
warning: pyfftw/pyfftw.pxd:442:8: 'FFTW_RODFT11' redeclared 
warning: pyfftw/pyfftw.pxd:445:8: 'FFTW_R2HC' redeclared 
warning: pyfftw/pyfftw.pxd:446:8: 'FFTW_HC2R' redeclared 
warning: pyfftw/pyfftw.pxd:447:8: 'FFTW_DHT' redeclared 
warning: pyfftw/pyfftw.pxd:449:8: 'FFTW_REDFT00' redeclared 
warning: pyfftw/pyfftw.pxd:450:8: 'FFTW_REDFT01' redeclared 
warning: pyfftw/pyfftw.pxd:451:8: 'FFTW_REDFT10' redeclared 
warning: pyfftw/pyfftw.pxd:452:8: 'FFTW_REDFT11' redeclared 
warning: pyfftw/pyfftw.pxd:453:8: 'FFTW_RODFT00' redeclared 
warning: pyfftw/pyfftw.pxd:454:8: 'FFTW_RODFT01' redeclared 
warning: pyfftw/pyfftw.pxd:455:8: 'FFTW_RODFT10' redeclared 
warning: pyfftw/pyfftw.pxd:456:8: 'FFTW_RODFT11' redeclared 
performance hint: pyfftw/pyfftw.pyx:334:5: Exception check on '_fftw_execute_null' will always require the GIL to be acquired.
Possible solutions:
	1. Declare '_fftw_execute_null' as 'noexcept' if you control the definition and you're sure you don't want the function to raise exceptions.
	2. Use an 'int' return type on '_fftw_execute_null' to allow an error code to be returned.
performance hint: pyfftw/pyfftw.pyx:1425:31: Exception check after calling 'fftw_planner' will always require the GIL to be acquired. Declare 'fftw_planner' as 'noexcept' if you control the definition and you're sure you don't want the function to raise exceptions.
UPDATING build/lib.linux-i686-cpython-313/pyfftw/_version.py
set build/lib.linux-i686-cpython-313/pyfftw/_version.py to '0.15.0'
Compiling pyfftw/pyfftw.pyx because it changed.
[1/1] Cythonizing pyfftw/pyfftw.pyx
INFO:root:building 'pyfftw.pyfftw' extension
INFO:root:creating build/temp.linux-i686-cpython-313/pyfftw
INFO:root:i686-linux-gnu-gcc -fno-strict-overflow -Wsign-compare -DNDEBUG -g -O2 -Wall -g -O2 -Werror=implicit-function-declaration -ffile-prefix-map=/build/reproducible-path/pyfftw-0.15.0=. -fstack-protector-strong -Wformat -Werror=format-security -Wdate-time -D_FORTIFY_SOURCE=2 -fPIC -DPYFFTW_HAVE_DOUBLE=1 -DPYFFTW_HAVE_DOUBLE_OMP=1 -DPYFFTW_HAVE_DOUBLE_THREADS=0 -DPYFFTW_HAVE_DOUBLE_MULTITHREADING=1 -DPYFFTW_HAVE_DOUBLE_MPI=0 -DPYFFTW_HAVE_SINGLE=1 -DPYFFTW_HAVE_SINGLE_OMP=1 -DPYFFTW_HAVE_SINGLE_THREADS=0 -DPYFFTW_HAVE_SINGLE_MULTITHREADING=1 -DPYFFTW_HAVE_SINGLE_MPI=0 -DPYFFTW_HAVE_LONG=1 -DPYFFTW_HAVE_LONG_OMP=1 -DPYFFTW_HAVE_LONG_THREADS=0 -DPYFFTW_HAVE_LONG_MULTITHREADING=1 -DPYFFTW_HAVE_LONG_MPI=0 -DPYFFTW_HAVE_MPI=0 -DNPY_NO_DEPRECATED_API=NPY_1_7_API_VERSION -DFFTW_NO_Complex=1 -I/build/reproducible-path/pyfftw-0.15.0/include -I/build/reproducible-path/pyfftw-0.15.0/pyfftw -I/usr/lib/i386-linux-gnu/python3-numpy/numpy/_core/include -I/usr/include -I/usr/include -I/usr/include/python3.13 -I/usr/include/python3.13 -c pyfftw/pyfftw.c -o build/temp.linux-i686-cpython-313/pyfftw/pyfftw.o
pyfftw/pyfftw.c: In function '__pyx_pf_6pyfftw_6pyfftw_4FFTW_34__cinit__.isra':
pyfftw/pyfftw.c:22737:6: warning: '__pyx_v_plan' may be used uninitialized [-Wmaybe-uninitialized]
22737 |   if (__pyx_t_11) {
      |      ^
pyfftw/pyfftw.c:19135:9: note: '__pyx_v_plan' was declared here
19135 |   void *__pyx_v_plan;
      |         ^~~~~~~~~~~~
INFO:root:i686-linux-gnu-gcc -shared -Wl,-O1 -Wl,-Bsymbolic-functions -Wl,-z,relro -g -fwrapv -O2 -Wl,-z,relro -g -O2 -Werror=implicit-function-declaration -ffile-prefix-map=/build/reproducible-path/pyfftw-0.15.0=. -fstack-protector-strong -Wformat -Werror=format-security -Wdate-time -D_FORTIFY_SOURCE=2 build/temp.linux-i686-cpython-313/pyfftw/pyfftw.o -L/usr/lib/i386-linux-gnu -L/usr/lib -L/usr/lib/i386-linux-gnu -lfftw3l_omp -lfftw3l -lfftw3f_omp -lfftw3f -lfftw3_omp -lfftw3 -lm -o build/lib.linux-i686-cpython-313/pyfftw/pyfftw.cpython-313-i386-linux-gnu.so
INFO:root:installing to build/bdist.linux-i686/wheel
INFO:root:running install
INFO:root:running install_lib
INFO:root:creating build/bdist.linux-i686/wheel
INFO:root:creating build/bdist.linux-i686/wheel/pyfftw
INFO:root:creating build/bdist.linux-i686/wheel/pyfftw/interfaces
INFO:root:copying build/lib.linux-i686-cpython-313/pyfftw/interfaces/scipy_fft.py -> build/bdist.linux-i686/wheel/./pyfftw/interfaces
INFO:root:copying build/lib.linux-i686-cpython-313/pyfftw/interfaces/numpy_fft.py -> build/bdist.linux-i686/wheel/./pyfftw/interfaces
INFO:root:copying build/lib.linux-i686-cpython-313/pyfftw/interfaces/_utils.py -> build/bdist.linux-i686/wheel/./pyfftw/interfaces
INFO:root:copying build/lib.linux-i686-cpython-313/pyfftw/interfaces/scipy_fftpack.py -> build/bdist.linux-i686/wheel/./pyfftw/interfaces
INFO:root:copying build/lib.linux-i686-cpython-313/pyfftw/interfaces/dask_fft.py -> build/bdist.linux-i686/wheel/./pyfftw/interfaces
INFO:root:copying build/lib.linux-i686-cpython-313/pyfftw/interfaces/__init__.py -> build/bdist.linux-i686/wheel/./pyfftw/interfaces
INFO:root:copying build/lib.linux-i686-cpython-313/pyfftw/interfaces/cache.py -> build/bdist.linux-i686/wheel/./pyfftw/interfaces
INFO:root:copying build/lib.linux-i686-cpython-313/pyfftw/utils.pxi -> build/bdist.linux-i686/wheel/./pyfftw
INFO:root:copying build/lib.linux-i686-cpython-313/pyfftw/pyfftw.pyx -> build/bdist.linux-i686/wheel/./pyfftw
INFO:root:copying build/lib.linux-i686-cpython-313/pyfftw/__init__.pxd -> build/bdist.linux-i686/wheel/./pyfftw
INFO:root:copying build/lib.linux-i686-cpython-313/pyfftw/cpu.pxd -> build/bdist.linux-i686/wheel/./pyfftw
INFO:root:copying build/lib.linux-i686-cpython-313/pyfftw/_version.py -> build/bdist.linux-i686/wheel/./pyfftw
INFO:root:copying build/lib.linux-i686-cpython-313/pyfftw/pyfftw.pxd -> build/bdist.linux-i686/wheel/./pyfftw
INFO:root:copying build/lib.linux-i686-cpython-313/pyfftw/config.py -> build/bdist.linux-i686/wheel/./pyfftw
INFO:root:creating build/bdist.linux-i686/wheel/pyfftw/builders
INFO:root:copying build/lib.linux-i686-cpython-313/pyfftw/builders/builders.py -> build/bdist.linux-i686/wheel/./pyfftw/builders
INFO:root:copying build/lib.linux-i686-cpython-313/pyfftw/builders/_utils.py -> build/bdist.linux-i686/wheel/./pyfftw/builders
INFO:root:copying build/lib.linux-i686-cpython-313/pyfftw/builders/__init__.py -> build/bdist.linux-i686/wheel/./pyfftw/builders
INFO:root:copying build/lib.linux-i686-cpython-313/pyfftw/__init__.py -> build/bdist.linux-i686/wheel/./pyfftw
INFO:root:copying build/lib.linux-i686-cpython-313/pyfftw/pyfftw.cpython-313-i386-linux-gnu.so -> build/bdist.linux-i686/wheel/./pyfftw
INFO:root:running install_egg_info
INFO:root:Copying pyFFTW.egg-info to build/bdist.linux-i686/wheel/./pyFFTW-0.15.0.egg-info
INFO:root:running install_scripts
INFO:root:creating build/bdist.linux-i686/wheel/pyFFTW-0.15.0.dist-info/WHEEL
INFO:wheel:creating '/build/reproducible-path/pyfftw-0.15.0/.pybuild/cpython3_3.13_pyfftw/.tmp-7t1ifohl/pyFFTW-0.15.0-cp313-cp313-linux_i686.whl' and adding 'build/bdist.linux-i686/wheel' to it
INFO:wheel:adding 'pyfftw/__init__.pxd'
INFO:wheel:adding 'pyfftw/__init__.py'
INFO:wheel:adding 'pyfftw/_version.py'
INFO:wheel:adding 'pyfftw/config.py'
INFO:wheel:adding 'pyfftw/cpu.pxd'
INFO:wheel:adding 'pyfftw/pyfftw.cpython-313-i386-linux-gnu.so'
INFO:wheel:adding 'pyfftw/pyfftw.pxd'
INFO:wheel:adding 'pyfftw/pyfftw.pyx'
INFO:wheel:adding 'pyfftw/utils.pxi'
INFO:wheel:adding 'pyfftw/builders/__init__.py'
INFO:wheel:adding 'pyfftw/builders/_utils.py'
INFO:wheel:adding 'pyfftw/builders/builders.py'
INFO:wheel:adding 'pyfftw/interfaces/__init__.py'
INFO:wheel:adding 'pyfftw/interfaces/_utils.py'
INFO:wheel:adding 'pyfftw/interfaces/cache.py'
INFO:wheel:adding 'pyfftw/interfaces/dask_fft.py'
INFO:wheel:adding 'pyfftw/interfaces/numpy_fft.py'
INFO:wheel:adding 'pyfftw/interfaces/scipy_fft.py'
INFO:wheel:adding 'pyfftw/interfaces/scipy_fftpack.py'
INFO:wheel:adding 'pyFFTW-0.15.0.dist-info/LICENSE.txt'
INFO:wheel:adding 'pyFFTW-0.15.0.dist-info/METADATA'
INFO:wheel:adding 'pyFFTW-0.15.0.dist-info/WHEEL'
INFO:wheel:adding 'pyFFTW-0.15.0.dist-info/top_level.txt'
INFO:wheel:adding 'pyFFTW-0.15.0.dist-info/RECORD'
INFO:root:removing build/bdist.linux-i686/wheel
Successfully built pyFFTW-0.15.0-cp313-cp313-linux_i686.whl
I: pybuild plugin_pyproject:144: Unpacking wheel built for python3.13 with "installer" module
   debian/rules execute_after_dh_auto_build
make[1]: Entering directory '/build/reproducible-path/pyfftw-0.15.0'
PYTHONPATH=/build/reproducible-path/pyfftw-0.15.0/.pybuild/cpython3_3.13_pyfftw/build \
          make -C docs html
make[2]: Entering directory '/build/reproducible-path/pyfftw-0.15.0/docs'
sphinx-build -b html -d _build/doctrees   . _build/html
Running Sphinx v8.1.3
loading translations [en]... done
making output directory... done
Converting `source_suffix = '.rst'` to `source_suffix = {'.rst': 'restructuredtext'}`.
loading intersphinx inventory 'python' from /usr/share/doc/python3/html/objects.inv ...
loading intersphinx inventory 'numpy' from /usr/share/doc/python-numpy/html/objects.inv ...
loading intersphinx inventory 'scipy' from /usr/share/doc/python-scipy-doc/html/objects.inv ...
WARNING: failed to reach any of the inventories with the following issues:
intersphinx inventory '/usr/share/doc/python-scipy-doc/html/objects.inv' not fetchable due to <class 'FileNotFoundError'>: [Errno 2] No such file or directory: '/usr/share/doc/python-scipy-doc/html/objects.inv'
building [mo]: targets for 0 po files that are out of date
writing output... 
building [html]: targets for 18 source files that are out of date
updating environment: [new config] 18 added, 0 changed, 0 removed
reading sources... [  6%] index
reading sources... [ 11%] release/0.11.0
reading sources... [ 17%] release/0.12.0
reading sources... [ 22%] release/0.13.0
reading sources... [ 28%] release/0.14.0
reading sources... [ 33%] release/0.15.0
reading sources... [ 39%] release/releases
reading sources... [ 44%] source/api
reading sources... [ 50%] source/license
reading sources... [ 56%] source/pyfftw/builders/_utils
reading sources... [ 61%] source/pyfftw/builders/builders
reading sources... [ 67%] source/pyfftw/interfaces/dask_fft
reading sources... [ 72%] source/pyfftw/interfaces/interfaces
reading sources... [ 78%] source/pyfftw/interfaces/numpy_fft
reading sources... [ 83%] source/pyfftw/interfaces/scipy_fft
reading sources... [ 89%] source/pyfftw/interfaces/scipy_fftpack
reading sources... [ 94%] source/pyfftw/pyfftw
reading sources... [100%] source/tutorial

/build/reproducible-path/pyfftw-0.15.0/.pybuild/cpython3_3.13_pyfftw/build/pyfftw/interfaces/dask_fft.py:docstring of dask.array.fft.fft_wrap.<locals>.func:9: WARNING: Block quote ends without a blank line; unexpected unindent. [docutils]
/build/reproducible-path/pyfftw-0.15.0/.pybuild/cpython3_3.13_pyfftw/build/pyfftw/interfaces/dask_fft.py:docstring of dask.array.fft.fft_wrap.<locals>.func:9: WARNING: Block quote ends without a blank line; unexpected unindent. [docutils]
looking for now-outdated files... none found
pickling environment... done
checking consistency... done
preparing documents... done
copying assets... 
copying static files... 
Writing evaluated template result to /build/reproducible-path/pyfftw-0.15.0/docs/_build/html/_static/documentation_options.js
Writing evaluated template result to /build/reproducible-path/pyfftw-0.15.0/docs/_build/html/_static/basic.css
Writing evaluated template result to /build/reproducible-path/pyfftw-0.15.0/docs/_build/html/_static/language_data.js
Writing evaluated template result to /build/reproducible-path/pyfftw-0.15.0/docs/_build/html/_static/classic.css
Writing evaluated template result to /build/reproducible-path/pyfftw-0.15.0/docs/_build/html/_static/sidebar.js
copying static files: done
copying extra files... 
copying extra files: done
copying assets: done
writing output... [  6%] index
writing output... [ 11%] release/0.11.0
writing output... [ 17%] release/0.12.0
writing output... [ 22%] release/0.13.0
writing output... [ 28%] release/0.14.0
writing output... [ 33%] release/0.15.0
writing output... [ 39%] release/releases
writing output... [ 44%] source/api
writing output... [ 50%] source/license
writing output... [ 56%] source/pyfftw/builders/_utils
writing output... [ 61%] source/pyfftw/builders/builders
writing output... [ 67%] source/pyfftw/interfaces/dask_fft
writing output... [ 72%] source/pyfftw/interfaces/interfaces
writing output... [ 78%] source/pyfftw/interfaces/numpy_fft
writing output... [ 83%] source/pyfftw/interfaces/scipy_fft
writing output... [ 89%] source/pyfftw/interfaces/scipy_fftpack
writing output... [ 94%] source/pyfftw/pyfftw
writing output... [100%] source/tutorial

generating indices... genindex py-modindex done
writing additional pages... search done
dumping search index in English (code: en)... done
dumping object inventory... done
build succeeded, 3 warnings.

The HTML pages are in _build/html.

Build finished. The HTML pages are in _build/html.
make[2]: Leaving directory '/build/reproducible-path/pyfftw-0.15.0/docs'
make[1]: Leaving directory '/build/reproducible-path/pyfftw-0.15.0'
   debian/rules override_dh_auto_test
make[1]: Entering directory '/build/reproducible-path/pyfftw-0.15.0'
dh_auto_test || /bin/true
I: pybuild base:311: cd /build/reproducible-path/pyfftw-0.15.0/.pybuild/cpython3_3.12_pyfftw/build; python3.12 -m pytest -k 'not (test_auto_align_input or test_aligned_flag or test_flags or test_alignment or test_get_alignment)'
============================= test session starts ==============================
platform linux -- Python 3.12.9, pytest-8.3.4, pluggy-1.5.0
rootdir: /build/reproducible-path/pyfftw-0.15.0/.pybuild/cpython3_3.12_pyfftw/build
configfile: pyproject.toml
plugins: typeguard-4.4.1
collected 1806 items / 76 deselected / 1730 selected

tests/test_pyfftw_builders.py .....s...............s...............s.... [  2%]
...........s...............s...............s...............s............ [  6%]
...s...............s...............s...............s...............s.... [ 10%]
...............................                                          [ 12%]
tests/test_pyfftw_call.py ....................                           [ 13%]
tests/test_pyfftw_class_misc.py ...............                          [ 14%]
tests/test_pyfftw_complex.py ........................................... [ 17%]
...............................................ss..........              [ 20%]
tests/test_pyfftw_config.py ...                                          [ 20%]
tests/test_pyfftw_dask_interface.py ...s......s.......s.......s......s.. [ 22%]
.....s.......s......s.......s.......s......s.......s.......s......s....  [ 26%]
tests/test_pyfftw_interfaces_cache.py ...s..............s............... [ 28%]
............s..............s..............s..............s.............. [ 32%]
s..............s..............s..............s..............s........... [ 37%]
...s..............s...........                                           [ 38%]
tests/test_pyfftw_multithreaded.py ............                          [ 39%]
tests/test_pyfftw_nbyte_align.py ..F..F.....F........                    [ 40%]
tests/test_pyfftw_numpy_interface.py ....s..............s..............s [ 42%]
..............s..............s..............s..............s............ [ 46%]
...s...............s...............s...............s...............s.... [ 51%]
...........s...............s............                                 [ 53%]
tests/test_pyfftw_partial.py ss                                          [ 53%]
tests/test_pyfftw_real_backward.py ..................................... [ 55%]
.......................................................ss...........     [ 59%]
tests/test_pyfftw_real_forward.py ...................................... [ 61%]
......................................................ss...........      [ 65%]
tests/test_pyfftw_scipy_fft.py ......................................... [ 67%]
............................................................s........... [ 72%]
...s..............s..............s..............s...............s....... [ 76%]
........s...............s...............s..............s..............s. [ 80%]
..............s...............s...............s...............s......... [ 84%]
.....s...........                                                        [ 85%]
tests/test_pyfftw_scipy_interface.py ................................... [ 87%]
...................................................................s.... [ 91%]
..........s..............s..............s...............s............... [ 95%]
s...............s...............s..............s...........              [ 99%]
tests/test_pyfftw_utils.py ..                                            [ 99%]
tests/test_pyfftw_version.py ...                                         [ 99%]
tests/test_pyfftw_wisdom.py ..                                           [ 99%]
tests/test_r2r.py ....                                                   [100%]

=================================== FAILURES ===================================
________________ ByteAlignTest.test_byte_align_different_dtypes ________________

self = <tests.test_pyfftw_nbyte_align.ByteAlignTest testMethod=test_byte_align_different_dtypes>

    def test_byte_align_different_dtypes(self):
        shape = (10,10)
        a = numpy.int16(numpy.random.randn(*shape)*16000)
        b = numpy.float64(numpy.random.randn(*shape))
        c = numpy.int8(numpy.random.randn(*shape)*255)
        # Test a few alignments
        for n in [None, 3, 7, 9, 16, 24, 23, 63, 64]:
            expected_alignment = get_expected_alignment(n)
            d = byte_align(a, n=n)
            self.assertTrue(d.ctypes.data % expected_alignment == 0)
            self.assertTrue(d.__class__ == a.__class__)
    
            d = byte_align(b, n=n)
>           self.assertTrue(d.ctypes.data % expected_alignment == 0)
E           AssertionError: False is not true

tests/test_pyfftw_nbyte_align.py:286: AssertionError
___________________ ByteAlignTest.test_byte_align_set_dtype ____________________

self = <tests.test_pyfftw_nbyte_align.ByteAlignTest testMethod=test_byte_align_set_dtype>

    def test_byte_align_set_dtype(self):
        shape = (10,10)
        a = numpy.int16(numpy.random.randn(*shape)*16000)
        b = numpy.float64(numpy.random.randn(*shape))
        c = numpy.int8(numpy.random.randn(*shape)*255)
        # Test a few alignments
        for n in [None, 3, 7, 9, 16, 24, 23, 63, 64]:
            expected_alignment = get_expected_alignment(n)
            d = byte_align(a, dtype='float32', n=n)
            self.assertTrue(d.ctypes.data % expected_alignment == 0)
            self.assertTrue(d.dtype == 'float32')
    
            d = byte_align(b, dtype='float32', n=n)
>           self.assertTrue(d.ctypes.data % expected_alignment == 0)
E           AssertionError: False is not true

tests/test_pyfftw_nbyte_align.py:326: AssertionError
_______________________ ByteAlignTest.test_n_byte_align ________________________

args = (<tests.test_pyfftw_nbyte_align.ByteAlignTest testMethod=test_n_byte_align>,)
kwargs = {}

    def new_function(*args, **kwargs):
        with warnings.catch_warnings():
            warnings.filterwarnings("ignore", category=DeprecationWarning)
>           return function(*args, **kwargs)

tests/test_pyfftw_nbyte_align.py:55: 
_ _ _ _ _ _ _ _ _ _ _ _ _ _ _ _ _ _ _ _ _ _ _ _ _ _ _ _ _ _ _ _ _ _ _ _ _ _ _ _ 
tests/test_pyfftw_nbyte_align.py:166: in test_n_byte_align
    self.assertTrue(b.ctypes.data%n == 0)
E   AssertionError: False is not true
=============================== warnings summary ===============================
tests/test_r2r.py:125
  /build/reproducible-path/pyfftw-0.15.0/.pybuild/cpython3_3.12_pyfftw/build/tests/test_r2r.py:125: PytestCollectionWarning: cannot collect test class 'TestRealTransform' because it has a __init__ constructor (from: tests/test_r2r.py)
    class TestRealTransform(object):

tests/test_pyfftw_class_misc.py::FFTWMiscTest::test_input_dtype
  /build/reproducible-path/pyfftw-0.15.0/.pybuild/cpython3_3.12_pyfftw/build/tests/test_pyfftw_class_misc.py:300: RuntimeWarning: overflow encountered in cast
    new_input_array = numpy.complex64(self.input_array)

tests/test_pyfftw_class_misc.py::FFTWMiscTest::test_output_dtype
  /build/reproducible-path/pyfftw-0.15.0/.pybuild/cpython3_3.12_pyfftw/build/tests/test_pyfftw_class_misc.py:313: RuntimeWarning: overflow encountered in cast
    new_input_array = numpy.complex64(self.input_array)

tests/test_pyfftw_dask_interface.py: 16 warnings
  /usr/lib/python3/dist-packages/dask/array/fft.py:180: DeprecationWarning: DeprecationWarning: `axes` should not be `None` if `s` is not `None` (Deprecated in NumPy 2.0)
    warnings.warn(

-- Docs: https://docs.pytest.org/en/stable/how-to/capture-warnings.html
=========================== short test summary info ============================
FAILED tests/test_pyfftw_nbyte_align.py::ByteAlignTest::test_byte_align_different_dtypes
FAILED tests/test_pyfftw_nbyte_align.py::ByteAlignTest::test_byte_align_set_dtype
FAILED tests/test_pyfftw_nbyte_align.py::ByteAlignTest::test_n_byte_align - A...
= 3 failed, 1641 passed, 86 skipped, 76 deselected, 19 warnings in 2235.33s (0:37:15) =
E: pybuild pybuild:389: test: plugin pyproject failed with: exit code=1: cd /build/reproducible-path/pyfftw-0.15.0/.pybuild/cpython3_3.12_pyfftw/build; python3.12 -m pytest -k 'not (test_auto_align_input or test_aligned_flag or test_flags or test_alignment or test_get_alignment)'
I: pybuild base:311: cd /build/reproducible-path/pyfftw-0.15.0/.pybuild/cpython3_3.13_pyfftw/build; python3.13 -m pytest -k 'not (test_auto_align_input or test_aligned_flag or test_flags or test_alignment or test_get_alignment)'
============================= test session starts ==============================
platform linux -- Python 3.13.2, pytest-8.3.4, pluggy-1.5.0
rootdir: /build/reproducible-path/pyfftw-0.15.0/.pybuild/cpython3_3.13_pyfftw/build
configfile: pyproject.toml
plugins: typeguard-4.4.1
collected 1806 items / 76 deselected / 1730 selected

tests/test_pyfftw_builders.py .....s...............s...............s.... [  2%]
...........s...............s...............s...............s............ [  6%]
...s...............s...............s...............s...............s.... [ 10%]
...............................                                          [ 12%]
tests/test_pyfftw_call.py ....................                           [ 13%]
tests/test_pyfftw_class_misc.py ...............                          [ 14%]
tests/test_pyfftw_complex.py ........................................... [ 17%]
...............................................ss..........              [ 20%]
tests/test_pyfftw_config.py ...                                          [ 20%]
tests/test_pyfftw_dask_interface.py ...s......s.......s.......s......s.. [ 22%]
.....s.......s......s.......s.......s......s.......s.......s......s....  [ 26%]
tests/test_pyfftw_interfaces_cache.py ...s..............s............... [ 28%]
............s..............s..............s..............s.............. [ 32%]
s..............s..............s..............s..............s........... [ 37%]
...s..............s...........                                           [ 38%]
tests/test_pyfftw_multithreaded.py ............                          [ 39%]
tests/test_pyfftw_nbyte_align.py ..F..FF..........F..                    [ 40%]
tests/test_pyfftw_numpy_interface.py ....s..............s..............s [ 42%]
..............s..............s..............s..............s............ [ 46%]
...s...............s...............s...............s...............s.... [ 51%]
...........s...............s............                                 [ 53%]
tests/test_pyfftw_partial.py ss                                          [ 53%]
tests/test_pyfftw_real_backward.py ..................................... [ 55%]
.......................................................ss...........     [ 59%]
tests/test_pyfftw_real_forward.py ...................................... [ 61%]
......................................................ss...........      [ 65%]
tests/test_pyfftw_scipy_fft.py ......................................... [ 67%]
............................................................s........... [ 72%]
...s..............s..............s..............s...............s....... [ 76%]
........s...............s...............s..............s..............s. [ 80%]
..............s...............s...............s...............s......... [ 84%]
.....s...........                                                        [ 85%]
tests/test_pyfftw_scipy_interface.py ................................... [ 87%]
...................................................................s.... [ 91%]
..........s..............s..............s...............s............... [ 95%]
s...............s...............s..............s...........              [ 99%]
tests/test_pyfftw_utils.py ..                                            [ 99%]
tests/test_pyfftw_version.py ...                                         [ 99%]
tests/test_pyfftw_wisdom.py ..                                           [ 99%]
tests/test_r2r.py ....                                                   [100%]

=================================== FAILURES ===================================
________________ ByteAlignTest.test_byte_align_different_dtypes ________________

self = <tests.test_pyfftw_nbyte_align.ByteAlignTest testMethod=test_byte_align_different_dtypes>

    def test_byte_align_different_dtypes(self):
        shape = (10,10)
        a = numpy.int16(numpy.random.randn(*shape)*16000)
        b = numpy.float64(numpy.random.randn(*shape))
        c = numpy.int8(numpy.random.randn(*shape)*255)
        # Test a few alignments
        for n in [None, 3, 7, 9, 16, 24, 23, 63, 64]:
            expected_alignment = get_expected_alignment(n)
            d = byte_align(a, n=n)
            self.assertTrue(d.ctypes.data % expected_alignment == 0)
            self.assertTrue(d.__class__ == a.__class__)
    
            d = byte_align(b, n=n)
>           self.assertTrue(d.ctypes.data % expected_alignment == 0)
E           AssertionError: False is not true

tests/test_pyfftw_nbyte_align.py:286: AssertionError
___________________ ByteAlignTest.test_byte_align_set_dtype ____________________

self = <tests.test_pyfftw_nbyte_align.ByteAlignTest testMethod=test_byte_align_set_dtype>

    def test_byte_align_set_dtype(self):
        shape = (10,10)
        a = numpy.int16(numpy.random.randn(*shape)*16000)
        b = numpy.float64(numpy.random.randn(*shape))
        c = numpy.int8(numpy.random.randn(*shape)*255)
        # Test a few alignments
        for n in [None, 3, 7, 9, 16, 24, 23, 63, 64]:
            expected_alignment = get_expected_alignment(n)
            d = byte_align(a, dtype='float32', n=n)
            self.assertTrue(d.ctypes.data % expected_alignment == 0)
            self.assertTrue(d.dtype == 'float32')
    
            d = byte_align(b, dtype='float32', n=n)
            self.assertTrue(d.ctypes.data % expected_alignment == 0)
            self.assertTrue(d.dtype == 'float32')
    
            d = byte_align(c, dtype='float64', n=n)
>           self.assertTrue(d.ctypes.data % expected_alignment == 0)
E           AssertionError: False is not true

tests/test_pyfftw_nbyte_align.py:330: AssertionError
_______________________ ByteAlignTest.test_empty_aligned _______________________

self = <tests.test_pyfftw_nbyte_align.ByteAlignTest testMethod=test_empty_aligned>

    def test_empty_aligned(self):
        shape = (10,10)
        # Test a few alignments and dtypes
        for each in [(3, 'float64'),
                (7, 'float64'),
                (9, 'float32'),
                (16, 'int64'),
                (24, 'bool'),
                (23, 'complex64'),
                (63, 'complex128'),
                (64, 'int8')]:
    
            n = each[0]
            b = empty_aligned(shape, dtype=each[1], n=n)
>           self.assertTrue(b.ctypes.data%n == 0)
E           AssertionError: False is not true

tests/test_pyfftw_nbyte_align.py:129: AssertionError
__________________ ByteAlignTest.test_n_byte_align_set_dtype ___________________

args = (<tests.test_pyfftw_nbyte_align.ByteAlignTest testMethod=test_n_byte_align_set_dtype>,)
kwargs = {}

    def new_function(*args, **kwargs):
        with warnings.catch_warnings():
            warnings.filterwarnings("ignore", category=DeprecationWarning)
>           return function(*args, **kwargs)

tests/test_pyfftw_nbyte_align.py:55: 
_ _ _ _ _ _ _ _ _ _ _ _ _ _ _ _ _ _ _ _ _ _ _ _ _ _ _ _ _ _ _ _ _ _ _ _ _ _ _ _ 
tests/test_pyfftw_nbyte_align.py:346: in test_n_byte_align_set_dtype
    self.assertTrue(d.ctypes.data%n == 0)
E   AssertionError: False is not true
=============================== warnings summary ===============================
tests/test_r2r.py:125
  /build/reproducible-path/pyfftw-0.15.0/.pybuild/cpython3_3.13_pyfftw/build/tests/test_r2r.py:125: PytestCollectionWarning: cannot collect test class 'TestRealTransform' because it has a __init__ constructor (from: tests/test_r2r.py)
    class TestRealTransform(object):

tests/test_pyfftw_dask_interface.py: 16 warnings
  /usr/lib/python3/dist-packages/dask/array/fft.py:180: DeprecationWarning: DeprecationWarning: `axes` should not be `None` if `s` is not `None` (Deprecated in NumPy 2.0)
    warnings.warn(

-- Docs: https://docs.pytest.org/en/stable/how-to/capture-warnings.html
=========================== short test summary info ============================
FAILED tests/test_pyfftw_nbyte_align.py::ByteAlignTest::test_byte_align_different_dtypes
FAILED tests/test_pyfftw_nbyte_align.py::ByteAlignTest::test_byte_align_set_dtype
FAILED tests/test_pyfftw_nbyte_align.py::ByteAlignTest::test_empty_aligned - ...
FAILED tests/test_pyfftw_nbyte_align.py::ByteAlignTest::test_n_byte_align_set_dtype
= 4 failed, 1640 passed, 86 skipped, 76 deselected, 17 warnings in 3107.20s (0:51:47) =
E: pybuild pybuild:389: test: plugin pyproject failed with: exit code=1: cd /build/reproducible-path/pyfftw-0.15.0/.pybuild/cpython3_3.13_pyfftw/build; python3.13 -m pytest -k 'not (test_auto_align_input or test_aligned_flag or test_flags or test_alignment or test_get_alignment)'
dh_auto_test: error: pybuild --test --test-pytest -i python{version} -p "3.12 3.13" returned exit code 13
make[1]: Leaving directory '/build/reproducible-path/pyfftw-0.15.0'
   create-stamp debian/debhelper-build-stamp
   dh_testroot -O--buildsystem=pybuild
   dh_prep -O--buildsystem=pybuild
   dh_auto_install -O--buildsystem=pybuild
I: pybuild plugin_pyproject:178: Copying package built for python3.12 to destdir
I: pybuild pybuild:334: dh_numpy3
I: pybuild plugin_pyproject:178: Copying package built for python3.13 to destdir
I: pybuild pybuild:334: dh_numpy3
   dh_installdocs -O--buildsystem=pybuild
dh_installdocs: warning: Cannot auto-detect main package for python-pyfftw-doc.  If the default is wrong, please use --doc-main-package
   dh_sphinxdoc -O--buildsystem=pybuild
   dh_installchangelogs -O--buildsystem=pybuild
   dh_python3 -O--buildsystem=pybuild
W: dh_python3 fs:125: Paths differ: debian/python3-pyfftw/usr/lib/python3.13/dist-packages/.pytest_cache/v/cache/lastfailed and debian/python3-pyfftw/usr/lib/python3/dist-packages/.pytest_cache/v/cache/lastfailed
   dh_installsystemduser -O--buildsystem=pybuild
   dh_perl -O--buildsystem=pybuild
   dh_link -O--buildsystem=pybuild
   dh_strip_nondeterminism -O--buildsystem=pybuild
   dh_compress -O--buildsystem=pybuild
   dh_fixperms -O--buildsystem=pybuild
   dh_missing -O--buildsystem=pybuild
   dh_dwz -a -O--buildsystem=pybuild
   dh_strip -a -O--buildsystem=pybuild
   dh_makeshlibs -a -O--buildsystem=pybuild
   dh_shlibdeps -a -O--buildsystem=pybuild
   dh_installdeb -O--buildsystem=pybuild
   dh_gencontrol -O--buildsystem=pybuild
dpkg-gencontrol: warning: package python-pyfftw-doc: substitution variable ${sphinxdoc:Built-Using} unused, but is defined
   dh_md5sums -O--buildsystem=pybuild
   dh_builddeb -O--buildsystem=pybuild
dpkg-deb: building package 'python3-pyfftw' in '../python3-pyfftw_0.15.0-1_i386.deb'.
dpkg-deb: building package 'python-pyfftw-doc' in '../python-pyfftw-doc_0.15.0-1_all.deb'.
dpkg-deb: building package 'python3-pyfftw-dbgsym' in '../python3-pyfftw-dbgsym_0.15.0-1_i386.deb'.
 dpkg-genbuildinfo --build=binary -O../pyfftw_0.15.0-1_i386.buildinfo
 dpkg-genchanges --build=binary -O../pyfftw_0.15.0-1_i386.changes
dpkg-genchanges: info: binary-only upload (no source code included)
 dpkg-source --after-build .
dpkg-buildpackage: info: binary-only upload (no source included)
dpkg-genchanges: info: including full source code in upload
I: copying local configuration
I: user script /srv/workspace/pbuilder/17652/tmp/hooks/B01_cleanup starting
I: user script /srv/workspace/pbuilder/17652/tmp/hooks/B01_cleanup finished
I: unmounting dev/ptmx filesystem
I: unmounting dev/pts filesystem
I: unmounting dev/shm filesystem
I: unmounting proc filesystem
I: unmounting sys filesystem
I: cleaning the build env 
I: removing directory /srv/workspace/pbuilder/17652 and its subdirectories
I: Current time: Sat Feb  8 05:11:55 +14 2025
I: pbuilder-time-stamp: 1738941115