I: pbuilder: network access will be disabled during build
I: Current time: Tue Mar 18 00:21:13 +14 2025
I: pbuilder-time-stamp: 1742206873
I: Building the build Environment
I: extracting base tarball [/var/cache/pbuilder/unstable-reproducible-base.tgz]
I: copying local configuration
W: --override-config is not set; not updating apt.conf Read the manpage for details.
I: mounting /proc filesystem
I: mounting /sys filesystem
I: creating /{dev,run}/shm
I: mounting /dev/pts filesystem
I: redirecting /dev/ptmx to /dev/pts/ptmx
I: policy-rc.d already exists
I: Copying source file
I: copying [emacs-buttercup_1.37-1.dsc]
I: copying [./emacs-buttercup_1.37.orig.tar.gz]
I: copying [./emacs-buttercup_1.37-1.debian.tar.xz]
I: Extracting source
dpkg-source: warning: cannot verify inline signature for ./emacs-buttercup_1.37-1.dsc: unsupported subcommand
dpkg-source: info: extracting emacs-buttercup in emacs-buttercup-1.37
dpkg-source: info: unpacking emacs-buttercup_1.37.orig.tar.gz
dpkg-source: info: unpacking emacs-buttercup_1.37-1.debian.tar.xz
I: Not using root during the build.
I: Installing the build-deps
I: user script /srv/workspace/pbuilder/1363266/tmp/hooks/D01_modify_environment starting
debug: Running on ionos1-amd64.
I: Changing host+domainname to test build reproducibility
I: Adding a custom variable just for the fun of it...
I: Changing /bin/sh to bash
'/bin/sh' -> '/bin/bash'
lrwxrwxrwx 1 root root 9 Mar 17 10:21 /bin/sh -> /bin/bash
I: Setting pbuilder2's login shell to /bin/bash
I: Setting pbuilder2's GECOS to second user,second room,second work-phone,second home-phone,second other
I: user script /srv/workspace/pbuilder/1363266/tmp/hooks/D01_modify_environment finished
I: user script /srv/workspace/pbuilder/1363266/tmp/hooks/D02_print_environment starting
I: set
  BASH=/bin/sh
  BASHOPTS=checkwinsize:cmdhist:complete_fullquote:extquote:force_fignore:globasciiranges:globskipdots:hostcomplete:interactive_comments:patsub_replacement:progcomp:promptvars:sourcepath
  BASH_ALIASES=()
  BASH_ARGC=()
  BASH_ARGV=()
  BASH_CMDS=()
  BASH_LINENO=([0]="12" [1]="0")
  BASH_LOADABLES_PATH=/usr/local/lib/bash:/usr/lib/bash:/opt/local/lib/bash:/usr/pkg/lib/bash:/opt/pkg/lib/bash:.
  BASH_SOURCE=([0]="/tmp/hooks/D02_print_environment" [1]="/tmp/hooks/D02_print_environment")
  BASH_VERSINFO=([0]="5" [1]="2" [2]="37" [3]="1" [4]="release" [5]="x86_64-pc-linux-gnu")
  BASH_VERSION='5.2.37(1)-release'
  BUILDDIR=/build/reproducible-path
  BUILDUSERGECOS='second user,second room,second work-phone,second home-phone,second other'
  BUILDUSERNAME=pbuilder2
  BUILD_ARCH=amd64
  DEBIAN_FRONTEND=noninteractive
  DEB_BUILD_OPTIONS='buildinfo=+all reproducible=+all parallel=20 '
  DIRSTACK=()
  DISTRIBUTION=unstable
  EUID=0
  FUNCNAME=([0]="Echo" [1]="main")
  GROUPS=()
  HOME=/root
  HOSTNAME=i-capture-the-hostname
  HOSTTYPE=x86_64
  HOST_ARCH=amd64
  IFS=' 	
  '
  INVOCATION_ID=c4fbe043090340bf92745175535e0cd1
  LANG=C
  LANGUAGE=et_EE:et
  LC_ALL=C
  MACHTYPE=x86_64-pc-linux-gnu
  MAIL=/var/mail/root
  OPTERR=1
  OPTIND=1
  OSTYPE=linux-gnu
  PATH=/usr/sbin:/usr/bin:/sbin:/bin:/usr/games:/i/capture/the/path
  PBCURRENTCOMMANDLINEOPERATION=build
  PBUILDER_OPERATION=build
  PBUILDER_PKGDATADIR=/usr/share/pbuilder
  PBUILDER_PKGLIBDIR=/usr/lib/pbuilder
  PBUILDER_SYSCONFDIR=/etc
  PIPESTATUS=([0]="0")
  POSIXLY_CORRECT=y
  PPID=1363266
  PS4='+ '
  PWD=/
  SHELL=/bin/bash
  SHELLOPTS=braceexpand:errexit:hashall:interactive-comments:posix
  SHLVL=3
  SUDO_COMMAND='/usr/bin/timeout -k 24.1h 24h /usr/bin/ionice -c 3 /usr/bin/nice -n 11 /usr/bin/unshare --uts -- /usr/sbin/pbuilder --build --configfile /srv/reproducible-results/rbuild-debian/r-b-build.ozGcecJa/pbuilderrc_uBbm --distribution unstable --hookdir /etc/pbuilder/rebuild-hooks --debbuildopts -b --basetgz /var/cache/pbuilder/unstable-reproducible-base.tgz --buildresult /srv/reproducible-results/rbuild-debian/r-b-build.ozGcecJa/b2 --logfile b2/build.log emacs-buttercup_1.37-1.dsc'
  SUDO_GID=110
  SUDO_UID=105
  SUDO_USER=jenkins
  TERM=unknown
  TZ=/usr/share/zoneinfo/Etc/GMT-14
  UID=0
  USER=root
  _='I: set'
  http_proxy=http://46.16.76.132:3128
I: uname -a
  Linux i-capture-the-hostname 6.1.0-32-amd64 #1 SMP PREEMPT_DYNAMIC Debian 6.1.129-1 (2025-03-06) x86_64 GNU/Linux
I: ls -l /bin
  lrwxrwxrwx 1 root root 7 Mar  4 11:20 /bin -> usr/bin
I: user script /srv/workspace/pbuilder/1363266/tmp/hooks/D02_print_environment finished
 -> Attempting to satisfy build-dependencies
 -> Creating pbuilder-satisfydepends-dummy package
Package: pbuilder-satisfydepends-dummy
Version: 0.invalid.0
Architecture: amd64
Maintainer: Debian Pbuilder Team <pbuilder-maint@lists.alioth.debian.org>
Description: Dummy package to satisfy dependencies with aptitude - created by pbuilder
 This package was created automatically by pbuilder to satisfy the
 build-dependencies of the package being currently built.
Depends: debhelper-compat (= 13), dh-elpa (>= 0.0.17), emacs (>= 1:28.2+1-9)
dpkg-deb: building package 'pbuilder-satisfydepends-dummy' in '/tmp/satisfydepends-aptitude/pbuilder-satisfydepends-dummy.deb'.
Selecting previously unselected package pbuilder-satisfydepends-dummy.
(Reading database ... 19784 files and directories currently installed.)
Preparing to unpack .../pbuilder-satisfydepends-dummy.deb ...
Unpacking pbuilder-satisfydepends-dummy (0.invalid.0) ...
dpkg: pbuilder-satisfydepends-dummy: dependency problems, but configuring anyway as you requested:
 pbuilder-satisfydepends-dummy depends on debhelper-compat (= 13); however:
  Package debhelper-compat is not installed.
 pbuilder-satisfydepends-dummy depends on dh-elpa (>= 0.0.17); however:
  Package dh-elpa is not installed.
 pbuilder-satisfydepends-dummy depends on emacs (>= 1:28.2+1-9); however:
  Package emacs is not installed.

Setting up pbuilder-satisfydepends-dummy (0.invalid.0) ...
Reading package lists...
Building dependency tree...
Reading state information...
Initializing package states...
Writing extended state information...
Building tag database...
pbuilder-satisfydepends-dummy is already installed at the requested version (0.invalid.0)
pbuilder-satisfydepends-dummy is already installed at the requested version (0.invalid.0)
The following NEW packages will be installed:
  autoconf{a} automake{a} autopoint{a} autotools-dev{a} bsdextrautils{a} ca-certificates{a} debhelper{a} dh-autoreconf{a} dh-elpa{a} dh-strip-nondeterminism{a} dwz{a} emacs{a} emacs-bin-common{a} emacs-common{a} emacs-el{a} emacs-nox{a} emacsen-common{a} file{a} gettext{a} gettext-base{a} groff-base{a} install-info{a} intltool-debian{a} libapt-pkg-perl{a} libarchive-zip-perl{a} libarray-unique-perl{a} libarray-utils-perl{a} libasound2-data{a} libasound2t64{a} libcgi-pm-perl{a} libclass-accessor-perl{a} libclone-perl{a} libconfig-tiny-perl{a} libdbus-1-3{a} libdebhelper-perl{a} libdebian-source-perl{a} libelf1t64{a} libencode-locale-perl{a} liberror-perl{a} libexporter-lite-perl{a} libexporter-tiny-perl{a} libffi8{a} libfile-find-rule-perl{a} libfile-listing-perl{a} libfile-stripnondeterminism-perl{a} libgccjit0{a} libgnutls30t64{a} libgpm2{a} libhtml-form-perl{a} libhtml-parser-perl{a} libhtml-tagset-perl{a} libhtml-tree-perl{a} libhttp-cookies-perl{a} libhttp-date-perl{a} libhttp-message-perl{a} libhttp-negotiate-perl{a} libicu76{a} libidn2-0{a} libio-html-perl{a} libio-socket-ssl-perl{a} libio-stringy-perl{a} liblcms2-2{a} liblist-moreutils-perl{a} liblist-moreutils-xs-perl{a} liblwp-mediatypes-perl{a} liblwp-protocol-https-perl{a} libmagic-mgc{a} libmagic1t64{a} libnet-http-perl{a} libnet-ssleay-perl{a} libnumber-compare-perl{a} libp11-kit0{a} libparse-debcontrol-perl{a} libpipeline1{a} libsub-install-perl{a} libsub-name-perl{a} libtasn1-6{a} libtext-glob-perl{a} libtie-ixhash-perl{a} libtimedate-perl{a} libtool{a} libtree-sitter0.22{a} libtry-tiny-perl{a} libuchardet0{a} libunistring5{a} liburi-perl{a} libwww-mechanize-perl{a} libwww-perl{a} libwww-robotrules-perl{a} libxml2{a} m4{a} man-db{a} netbase{a} openssl{a} perl-openssl-defaults{a} po-debconf{a} sensible-utils{a} 
The following packages are RECOMMENDED but will NOT be installed:
  alsa-topology-conf alsa-ucm-conf curl dbus libarchive-cpio-perl libcgi-fast-perl libdata-dump-perl libhtml-format-perl libhttp-daemon-perl libio-compress-brotli-perl libltdl-dev libmail-sendmail-perl libmailtools-perl lynx mailutils wget 
0 packages upgraded, 97 newly installed, 0 to remove and 0 not upgraded.
Need to get 81.1 MB of archives. After unpacking 287 MB will be used.
Writing extended state information...
Get: 1 http://deb.debian.org/debian unstable/main amd64 netbase all 6.5 [12.4 kB]
Get: 2 http://deb.debian.org/debian unstable/main amd64 sensible-utils all 0.0.24 [24.8 kB]
Get: 3 http://deb.debian.org/debian unstable/main amd64 openssl amd64 3.4.1-1 [1427 kB]
Get: 4 http://deb.debian.org/debian unstable/main amd64 ca-certificates all 20241223 [164 kB]
Get: 5 http://deb.debian.org/debian unstable/main amd64 libmagic-mgc amd64 1:5.46-2 [337 kB]
Get: 6 http://deb.debian.org/debian unstable/main amd64 libmagic1t64 amd64 1:5.46-2 [109 kB]
Get: 7 http://deb.debian.org/debian unstable/main amd64 file amd64 1:5.46-2 [43.5 kB]
Get: 8 http://deb.debian.org/debian unstable/main amd64 gettext-base amd64 0.23.1-1 [243 kB]
Get: 9 http://deb.debian.org/debian unstable/main amd64 libuchardet0 amd64 0.0.8-1+b2 [68.9 kB]
Get: 10 http://deb.debian.org/debian unstable/main amd64 groff-base amd64 1.23.0-7 [1185 kB]
Get: 11 http://deb.debian.org/debian unstable/main amd64 bsdextrautils amd64 2.40.4-5 [92.4 kB]
Get: 12 http://deb.debian.org/debian unstable/main amd64 libpipeline1 amd64 1.5.8-1 [42.0 kB]
Get: 13 http://deb.debian.org/debian unstable/main amd64 man-db amd64 2.13.0-1 [1420 kB]
Get: 14 http://deb.debian.org/debian unstable/main amd64 m4 amd64 1.4.19-7 [294 kB]
Get: 15 http://deb.debian.org/debian unstable/main amd64 autoconf all 2.72-3 [493 kB]
Get: 16 http://deb.debian.org/debian unstable/main amd64 autotools-dev all 20220109.1 [51.6 kB]
Get: 17 http://deb.debian.org/debian unstable/main amd64 automake all 1:1.17-3 [862 kB]
Get: 18 http://deb.debian.org/debian unstable/main amd64 autopoint all 0.23.1-1 [770 kB]
Get: 19 http://deb.debian.org/debian unstable/main amd64 libdebhelper-perl all 13.24.1 [90.9 kB]
Get: 20 http://deb.debian.org/debian unstable/main amd64 libtool all 2.5.4-4 [539 kB]
Get: 21 http://deb.debian.org/debian unstable/main amd64 dh-autoreconf all 20 [17.1 kB]
Get: 22 http://deb.debian.org/debian unstable/main amd64 libarchive-zip-perl all 1.68-1 [104 kB]
Get: 23 http://deb.debian.org/debian unstable/main amd64 libfile-stripnondeterminism-perl all 1.14.1-2 [19.7 kB]
Get: 24 http://deb.debian.org/debian unstable/main amd64 dh-strip-nondeterminism all 1.14.1-2 [8620 B]
Get: 25 http://deb.debian.org/debian unstable/main amd64 libelf1t64 amd64 0.192-4 [189 kB]
Get: 26 http://deb.debian.org/debian unstable/main amd64 dwz amd64 0.15-1+b1 [110 kB]
Get: 27 http://deb.debian.org/debian unstable/main amd64 libunistring5 amd64 1.3-1 [476 kB]
Get: 28 http://deb.debian.org/debian unstable/main amd64 libicu76 amd64 76.1-3 [9721 kB]
Get: 29 http://deb.debian.org/debian unstable/main amd64 libxml2 amd64 2.12.7+dfsg+really2.9.14-0.3+b1 [699 kB]
Get: 30 http://deb.debian.org/debian unstable/main amd64 gettext amd64 0.23.1-1 [1680 kB]
Get: 31 http://deb.debian.org/debian unstable/main amd64 intltool-debian all 0.35.0+20060710.6 [22.9 kB]
Get: 32 http://deb.debian.org/debian unstable/main amd64 po-debconf all 1.0.21+nmu1 [248 kB]
Get: 33 http://deb.debian.org/debian unstable/main amd64 debhelper all 13.24.1 [920 kB]
Get: 34 http://deb.debian.org/debian unstable/main amd64 libapt-pkg-perl amd64 0.1.41 [68.3 kB]
Get: 35 http://deb.debian.org/debian unstable/main amd64 libtie-ixhash-perl all 1.23-4 [11.7 kB]
Get: 36 http://deb.debian.org/debian unstable/main amd64 libarray-unique-perl all 0.09-1 [12.9 kB]
Get: 37 http://deb.debian.org/debian unstable/main amd64 libsub-name-perl amd64 0.28-1 [12.2 kB]
Get: 38 http://deb.debian.org/debian unstable/main amd64 libclass-accessor-perl all 0.51-2 [22.7 kB]
Get: 39 http://deb.debian.org/debian unstable/main amd64 libexporter-tiny-perl all 1.006002-1 [38.7 kB]
Get: 40 http://deb.debian.org/debian unstable/main amd64 liblist-moreutils-xs-perl amd64 0.430-4+b2 [42.1 kB]
Get: 41 http://deb.debian.org/debian unstable/main amd64 liblist-moreutils-perl all 0.430-2 [46.9 kB]
Get: 42 http://deb.debian.org/debian unstable/main amd64 libio-stringy-perl all 2.113-2 [48.3 kB]
Get: 43 http://deb.debian.org/debian unstable/main amd64 libencode-locale-perl all 1.05-3 [12.9 kB]
Get: 44 http://deb.debian.org/debian unstable/main amd64 libtimedate-perl all 2.3300-2 [39.3 kB]
Get: 45 http://deb.debian.org/debian unstable/main amd64 libhttp-date-perl all 6.06-1 [10.7 kB]
Get: 46 http://deb.debian.org/debian unstable/main amd64 libfile-listing-perl all 6.16-1 [12.4 kB]
Get: 47 http://deb.debian.org/debian unstable/main amd64 libhtml-tagset-perl all 3.24-1 [14.7 kB]
Get: 48 http://deb.debian.org/debian unstable/main amd64 liburi-perl all 5.30-1 [105 kB]
Get: 49 http://deb.debian.org/debian unstable/main amd64 libhtml-parser-perl amd64 3.83-1+b2 [99.7 kB]
Get: 50 http://deb.debian.org/debian unstable/main amd64 libhtml-tree-perl all 5.07-3 [211 kB]
Get: 51 http://deb.debian.org/debian unstable/main amd64 libclone-perl amd64 0.47-1+b1 [13.9 kB]
Get: 52 http://deb.debian.org/debian unstable/main amd64 libio-html-perl all 1.004-3 [16.2 kB]
Get: 53 http://deb.debian.org/debian unstable/main amd64 liblwp-mediatypes-perl all 6.04-2 [20.2 kB]
Get: 54 http://deb.debian.org/debian unstable/main amd64 libhttp-message-perl all 7.00-2 [79.8 kB]
Get: 55 http://deb.debian.org/debian unstable/main amd64 libhttp-cookies-perl all 6.11-1 [19.1 kB]
Get: 56 http://deb.debian.org/debian unstable/main amd64 libhttp-negotiate-perl all 6.01-2 [13.1 kB]
Get: 57 http://deb.debian.org/debian unstable/main amd64 perl-openssl-defaults amd64 7+b2 [6724 B]
Get: 58 http://deb.debian.org/debian unstable/main amd64 libnet-ssleay-perl amd64 1.94-3 [339 kB]
Get: 59 http://deb.debian.org/debian unstable/main amd64 libio-socket-ssl-perl all 2.089-1 [223 kB]
Get: 60 http://deb.debian.org/debian unstable/main amd64 libnet-http-perl all 6.23-1 [23.9 kB]
Get: 61 http://deb.debian.org/debian unstable/main amd64 liblwp-protocol-https-perl all 6.14-1 [10.8 kB]
Get: 62 http://deb.debian.org/debian unstable/main amd64 libtry-tiny-perl all 0.32-1 [22.9 kB]
Get: 63 http://deb.debian.org/debian unstable/main amd64 libwww-robotrules-perl all 6.02-1 [12.9 kB]
Get: 64 http://deb.debian.org/debian unstable/main amd64 libwww-perl all 6.78-1 [183 kB]
Get: 65 http://deb.debian.org/debian unstable/main amd64 liberror-perl all 0.17030-1 [26.9 kB]
Get: 66 http://deb.debian.org/debian unstable/main amd64 libexporter-lite-perl all 0.09-2 [10.7 kB]
Get: 67 http://deb.debian.org/debian unstable/main amd64 libparse-debcontrol-perl all 2.005-6 [21.6 kB]
Get: 68 http://deb.debian.org/debian unstable/main amd64 libsub-install-perl all 0.929-1 [10.5 kB]
Get: 69 http://deb.debian.org/debian unstable/main amd64 libcgi-pm-perl all 4.67-1 [217 kB]
Get: 70 http://deb.debian.org/debian unstable/main amd64 libhtml-form-perl all 6.12-1 [32.3 kB]
Get: 71 http://deb.debian.org/debian unstable/main amd64 libwww-mechanize-perl all 2.19-1 [114 kB]
Get: 72 http://deb.debian.org/debian unstable/main amd64 libdebian-source-perl all 0.128 [53.2 kB]
Get: 73 http://deb.debian.org/debian unstable/main amd64 emacs-el all 1:30.1+1-4 [19.5 MB]
Get: 74 http://deb.debian.org/debian unstable/main amd64 emacsen-common all 3.0.5 [12.3 kB]
Get: 75 http://deb.debian.org/debian unstable/main amd64 install-info amd64 7.1.1-1+b1 [166 kB]
Get: 76 http://deb.debian.org/debian unstable/main amd64 emacs-common all 1:30.1+1-4 [15.8 MB]
Get: 77 http://deb.debian.org/debian unstable/main amd64 emacs-bin-common amd64 1:30.1+1-4+b1 [98.0 kB]
Get: 78 http://deb.debian.org/debian unstable/main amd64 libasound2-data all 1.2.13-1 [21.1 kB]
Get: 79 http://deb.debian.org/debian unstable/main amd64 libasound2t64 amd64 1.2.13-1+b1 [373 kB]
Get: 80 http://deb.debian.org/debian unstable/main amd64 libdbus-1-3 amd64 1.16.2-2 [178 kB]
Get: 81 http://deb.debian.org/debian unstable/main amd64 libgccjit0 amd64 14.2.0-19 [10.4 MB]
Get: 82 http://deb.debian.org/debian unstable/main amd64 libidn2-0 amd64 2.3.8-2 [109 kB]
Get: 83 http://deb.debian.org/debian unstable/main amd64 libffi8 amd64 3.4.7-1 [23.9 kB]
Get: 84 http://deb.debian.org/debian unstable/main amd64 libp11-kit0 amd64 0.25.5-3 [425 kB]
Get: 85 http://deb.debian.org/debian unstable/main amd64 libtasn1-6 amd64 4.20.0-2 [49.9 kB]
Get: 86 http://deb.debian.org/debian unstable/main amd64 libgnutls30t64 amd64 3.8.9-2 [1464 kB]
Get: 87 http://deb.debian.org/debian unstable/main amd64 libgpm2 amd64 1.20.7-11+b2 [14.4 kB]
Get: 88 http://deb.debian.org/debian unstable/main amd64 liblcms2-2 amd64 2.16-2 [160 kB]
Get: 89 http://deb.debian.org/debian unstable/main amd64 libtree-sitter0.22 amd64 0.22.6-6 [94.0 kB]
Get: 90 http://deb.debian.org/debian unstable/main amd64 emacs-nox amd64 1:30.1+1-4+b1 [7265 kB]
Get: 91 http://deb.debian.org/debian unstable/main amd64 emacs all 1:30.1+1-4 [19.2 kB]
Get: 92 http://deb.debian.org/debian unstable/main amd64 libarray-utils-perl all 0.5-3 [6184 B]
Get: 93 http://deb.debian.org/debian unstable/main amd64 libconfig-tiny-perl all 2.30-1 [18.9 kB]
Get: 94 http://deb.debian.org/debian unstable/main amd64 libnumber-compare-perl all 0.03-3 [6332 B]
Get: 95 http://deb.debian.org/debian unstable/main amd64 libtext-glob-perl all 0.11-3 [7676 B]
Get: 96 http://deb.debian.org/debian unstable/main amd64 libfile-find-rule-perl all 0.34-3 [26.6 kB]
Get: 97 http://deb.debian.org/debian unstable/main amd64 dh-elpa all 2.1.9 [30.5 kB]
Fetched 81.1 MB in 2s (41.5 MB/s)
Preconfiguring packages ...
Selecting previously unselected package netbase.
(Reading database ... 
(Reading database ... 5%
(Reading database ... 10%
(Reading database ... 15%
(Reading database ... 20%
(Reading database ... 25%
(Reading database ... 30%
(Reading database ... 35%
(Reading database ... 40%
(Reading database ... 45%
(Reading database ... 50%
(Reading database ... 55%
(Reading database ... 60%
(Reading database ... 65%
(Reading database ... 70%
(Reading database ... 75%
(Reading database ... 80%
(Reading database ... 85%
(Reading database ... 90%
(Reading database ... 95%
(Reading database ... 100%
(Reading database ... 19784 files and directories currently installed.)
Preparing to unpack .../00-netbase_6.5_all.deb ...
Unpacking netbase (6.5) ...
Selecting previously unselected package sensible-utils.
Preparing to unpack .../01-sensible-utils_0.0.24_all.deb ...
Unpacking sensible-utils (0.0.24) ...
Selecting previously unselected package openssl.
Preparing to unpack .../02-openssl_3.4.1-1_amd64.deb ...
Unpacking openssl (3.4.1-1) ...
Selecting previously unselected package ca-certificates.
Preparing to unpack .../03-ca-certificates_20241223_all.deb ...
Unpacking ca-certificates (20241223) ...
Selecting previously unselected package libmagic-mgc.
Preparing to unpack .../04-libmagic-mgc_1%3a5.46-2_amd64.deb ...
Unpacking libmagic-mgc (1:5.46-2) ...
Selecting previously unselected package libmagic1t64:amd64.
Preparing to unpack .../05-libmagic1t64_1%3a5.46-2_amd64.deb ...
Unpacking libmagic1t64:amd64 (1:5.46-2) ...
Selecting previously unselected package file.
Preparing to unpack .../06-file_1%3a5.46-2_amd64.deb ...
Unpacking file (1:5.46-2) ...
Selecting previously unselected package gettext-base.
Preparing to unpack .../07-gettext-base_0.23.1-1_amd64.deb ...
Unpacking gettext-base (0.23.1-1) ...
Selecting previously unselected package libuchardet0:amd64.
Preparing to unpack .../08-libuchardet0_0.0.8-1+b2_amd64.deb ...
Unpacking libuchardet0:amd64 (0.0.8-1+b2) ...
Selecting previously unselected package groff-base.
Preparing to unpack .../09-groff-base_1.23.0-7_amd64.deb ...
Unpacking groff-base (1.23.0-7) ...
Selecting previously unselected package bsdextrautils.
Preparing to unpack .../10-bsdextrautils_2.40.4-5_amd64.deb ...
Unpacking bsdextrautils (2.40.4-5) ...
Selecting previously unselected package libpipeline1:amd64.
Preparing to unpack .../11-libpipeline1_1.5.8-1_amd64.deb ...
Unpacking libpipeline1:amd64 (1.5.8-1) ...
Selecting previously unselected package man-db.
Preparing to unpack .../12-man-db_2.13.0-1_amd64.deb ...
Unpacking man-db (2.13.0-1) ...
Selecting previously unselected package m4.
Preparing to unpack .../13-m4_1.4.19-7_amd64.deb ...
Unpacking m4 (1.4.19-7) ...
Selecting previously unselected package autoconf.
Preparing to unpack .../14-autoconf_2.72-3_all.deb ...
Unpacking autoconf (2.72-3) ...
Selecting previously unselected package autotools-dev.
Preparing to unpack .../15-autotools-dev_20220109.1_all.deb ...
Unpacking autotools-dev (20220109.1) ...
Selecting previously unselected package automake.
Preparing to unpack .../16-automake_1%3a1.17-3_all.deb ...
Unpacking automake (1:1.17-3) ...
Selecting previously unselected package autopoint.
Preparing to unpack .../17-autopoint_0.23.1-1_all.deb ...
Unpacking autopoint (0.23.1-1) ...
Selecting previously unselected package libdebhelper-perl.
Preparing to unpack .../18-libdebhelper-perl_13.24.1_all.deb ...
Unpacking libdebhelper-perl (13.24.1) ...
Selecting previously unselected package libtool.
Preparing to unpack .../19-libtool_2.5.4-4_all.deb ...
Unpacking libtool (2.5.4-4) ...
Selecting previously unselected package dh-autoreconf.
Preparing to unpack .../20-dh-autoreconf_20_all.deb ...
Unpacking dh-autoreconf (20) ...
Selecting previously unselected package libarchive-zip-perl.
Preparing to unpack .../21-libarchive-zip-perl_1.68-1_all.deb ...
Unpacking libarchive-zip-perl (1.68-1) ...
Selecting previously unselected package libfile-stripnondeterminism-perl.
Preparing to unpack .../22-libfile-stripnondeterminism-perl_1.14.1-2_all.deb ...
Unpacking libfile-stripnondeterminism-perl (1.14.1-2) ...
Selecting previously unselected package dh-strip-nondeterminism.
Preparing to unpack .../23-dh-strip-nondeterminism_1.14.1-2_all.deb ...
Unpacking dh-strip-nondeterminism (1.14.1-2) ...
Selecting previously unselected package libelf1t64:amd64.
Preparing to unpack .../24-libelf1t64_0.192-4_amd64.deb ...
Unpacking libelf1t64:amd64 (0.192-4) ...
Selecting previously unselected package dwz.
Preparing to unpack .../25-dwz_0.15-1+b1_amd64.deb ...
Unpacking dwz (0.15-1+b1) ...
Selecting previously unselected package libunistring5:amd64.
Preparing to unpack .../26-libunistring5_1.3-1_amd64.deb ...
Unpacking libunistring5:amd64 (1.3-1) ...
Selecting previously unselected package libicu76:amd64.
Preparing to unpack .../27-libicu76_76.1-3_amd64.deb ...
Unpacking libicu76:amd64 (76.1-3) ...
Selecting previously unselected package libxml2:amd64.
Preparing to unpack .../28-libxml2_2.12.7+dfsg+really2.9.14-0.3+b1_amd64.deb ...
Unpacking libxml2:amd64 (2.12.7+dfsg+really2.9.14-0.3+b1) ...
Selecting previously unselected package gettext.
Preparing to unpack .../29-gettext_0.23.1-1_amd64.deb ...
Unpacking gettext (0.23.1-1) ...
Selecting previously unselected package intltool-debian.
Preparing to unpack .../30-intltool-debian_0.35.0+20060710.6_all.deb ...
Unpacking intltool-debian (0.35.0+20060710.6) ...
Selecting previously unselected package po-debconf.
Preparing to unpack .../31-po-debconf_1.0.21+nmu1_all.deb ...
Unpacking po-debconf (1.0.21+nmu1) ...
Selecting previously unselected package debhelper.
Preparing to unpack .../32-debhelper_13.24.1_all.deb ...
Unpacking debhelper (13.24.1) ...
Selecting previously unselected package libapt-pkg-perl.
Preparing to unpack .../33-libapt-pkg-perl_0.1.41_amd64.deb ...
Unpacking libapt-pkg-perl (0.1.41) ...
Selecting previously unselected package libtie-ixhash-perl.
Preparing to unpack .../34-libtie-ixhash-perl_1.23-4_all.deb ...
Unpacking libtie-ixhash-perl (1.23-4) ...
Selecting previously unselected package libarray-unique-perl.
Preparing to unpack .../35-libarray-unique-perl_0.09-1_all.deb ...
Unpacking libarray-unique-perl (0.09-1) ...
Selecting previously unselected package libsub-name-perl:amd64.
Preparing to unpack .../36-libsub-name-perl_0.28-1_amd64.deb ...
Unpacking libsub-name-perl:amd64 (0.28-1) ...
Selecting previously unselected package libclass-accessor-perl.
Preparing to unpack .../37-libclass-accessor-perl_0.51-2_all.deb ...
Unpacking libclass-accessor-perl (0.51-2) ...
Selecting previously unselected package libexporter-tiny-perl.
Preparing to unpack .../38-libexporter-tiny-perl_1.006002-1_all.deb ...
Unpacking libexporter-tiny-perl (1.006002-1) ...
Selecting previously unselected package liblist-moreutils-xs-perl.
Preparing to unpack .../39-liblist-moreutils-xs-perl_0.430-4+b2_amd64.deb ...
Unpacking liblist-moreutils-xs-perl (0.430-4+b2) ...
Selecting previously unselected package liblist-moreutils-perl.
Preparing to unpack .../40-liblist-moreutils-perl_0.430-2_all.deb ...
Unpacking liblist-moreutils-perl (0.430-2) ...
Selecting previously unselected package libio-stringy-perl.
Preparing to unpack .../41-libio-stringy-perl_2.113-2_all.deb ...
Unpacking libio-stringy-perl (2.113-2) ...
Selecting previously unselected package libencode-locale-perl.
Preparing to unpack .../42-libencode-locale-perl_1.05-3_all.deb ...
Unpacking libencode-locale-perl (1.05-3) ...
Selecting previously unselected package libtimedate-perl.
Preparing to unpack .../43-libtimedate-perl_2.3300-2_all.deb ...
Unpacking libtimedate-perl (2.3300-2) ...
Selecting previously unselected package libhttp-date-perl.
Preparing to unpack .../44-libhttp-date-perl_6.06-1_all.deb ...
Unpacking libhttp-date-perl (6.06-1) ...
Selecting previously unselected package libfile-listing-perl.
Preparing to unpack .../45-libfile-listing-perl_6.16-1_all.deb ...
Unpacking libfile-listing-perl (6.16-1) ...
Selecting previously unselected package libhtml-tagset-perl.
Preparing to unpack .../46-libhtml-tagset-perl_3.24-1_all.deb ...
Unpacking libhtml-tagset-perl (3.24-1) ...
Selecting previously unselected package liburi-perl.
Preparing to unpack .../47-liburi-perl_5.30-1_all.deb ...
Unpacking liburi-perl (5.30-1) ...
Selecting previously unselected package libhtml-parser-perl:amd64.
Preparing to unpack .../48-libhtml-parser-perl_3.83-1+b2_amd64.deb ...
Unpacking libhtml-parser-perl:amd64 (3.83-1+b2) ...
Selecting previously unselected package libhtml-tree-perl.
Preparing to unpack .../49-libhtml-tree-perl_5.07-3_all.deb ...
Unpacking libhtml-tree-perl (5.07-3) ...
Selecting previously unselected package libclone-perl:amd64.
Preparing to unpack .../50-libclone-perl_0.47-1+b1_amd64.deb ...
Unpacking libclone-perl:amd64 (0.47-1+b1) ...
Selecting previously unselected package libio-html-perl.
Preparing to unpack .../51-libio-html-perl_1.004-3_all.deb ...
Unpacking libio-html-perl (1.004-3) ...
Selecting previously unselected package liblwp-mediatypes-perl.
Preparing to unpack .../52-liblwp-mediatypes-perl_6.04-2_all.deb ...
Unpacking liblwp-mediatypes-perl (6.04-2) ...
Selecting previously unselected package libhttp-message-perl.
Preparing to unpack .../53-libhttp-message-perl_7.00-2_all.deb ...
Unpacking libhttp-message-perl (7.00-2) ...
Selecting previously unselected package libhttp-cookies-perl.
Preparing to unpack .../54-libhttp-cookies-perl_6.11-1_all.deb ...
Unpacking libhttp-cookies-perl (6.11-1) ...
Selecting previously unselected package libhttp-negotiate-perl.
Preparing to unpack .../55-libhttp-negotiate-perl_6.01-2_all.deb ...
Unpacking libhttp-negotiate-perl (6.01-2) ...
Selecting previously unselected package perl-openssl-defaults:amd64.
Preparing to unpack .../56-perl-openssl-defaults_7+b2_amd64.deb ...
Unpacking perl-openssl-defaults:amd64 (7+b2) ...
Selecting previously unselected package libnet-ssleay-perl:amd64.
Preparing to unpack .../57-libnet-ssleay-perl_1.94-3_amd64.deb ...
Unpacking libnet-ssleay-perl:amd64 (1.94-3) ...
Selecting previously unselected package libio-socket-ssl-perl.
Preparing to unpack .../58-libio-socket-ssl-perl_2.089-1_all.deb ...
Unpacking libio-socket-ssl-perl (2.089-1) ...
Selecting previously unselected package libnet-http-perl.
Preparing to unpack .../59-libnet-http-perl_6.23-1_all.deb ...
Unpacking libnet-http-perl (6.23-1) ...
Selecting previously unselected package liblwp-protocol-https-perl.
Preparing to unpack .../60-liblwp-protocol-https-perl_6.14-1_all.deb ...
Unpacking liblwp-protocol-https-perl (6.14-1) ...
Selecting previously unselected package libtry-tiny-perl.
Preparing to unpack .../61-libtry-tiny-perl_0.32-1_all.deb ...
Unpacking libtry-tiny-perl (0.32-1) ...
Selecting previously unselected package libwww-robotrules-perl.
Preparing to unpack .../62-libwww-robotrules-perl_6.02-1_all.deb ...
Unpacking libwww-robotrules-perl (6.02-1) ...
Selecting previously unselected package libwww-perl.
Preparing to unpack .../63-libwww-perl_6.78-1_all.deb ...
Unpacking libwww-perl (6.78-1) ...
Selecting previously unselected package liberror-perl.
Preparing to unpack .../64-liberror-perl_0.17030-1_all.deb ...
Unpacking liberror-perl (0.17030-1) ...
Selecting previously unselected package libexporter-lite-perl.
Preparing to unpack .../65-libexporter-lite-perl_0.09-2_all.deb ...
Unpacking libexporter-lite-perl (0.09-2) ...
Selecting previously unselected package libparse-debcontrol-perl.
Preparing to unpack .../66-libparse-debcontrol-perl_2.005-6_all.deb ...
Unpacking libparse-debcontrol-perl (2.005-6) ...
Selecting previously unselected package libsub-install-perl.
Preparing to unpack .../67-libsub-install-perl_0.929-1_all.deb ...
Unpacking libsub-install-perl (0.929-1) ...
Selecting previously unselected package libcgi-pm-perl.
Preparing to unpack .../68-libcgi-pm-perl_4.67-1_all.deb ...
Unpacking libcgi-pm-perl (4.67-1) ...
Selecting previously unselected package libhtml-form-perl.
Preparing to unpack .../69-libhtml-form-perl_6.12-1_all.deb ...
Unpacking libhtml-form-perl (6.12-1) ...
Selecting previously unselected package libwww-mechanize-perl.
Preparing to unpack .../70-libwww-mechanize-perl_2.19-1_all.deb ...
Unpacking libwww-mechanize-perl (2.19-1) ...
Selecting previously unselected package libdebian-source-perl.
Preparing to unpack .../71-libdebian-source-perl_0.128_all.deb ...
Unpacking libdebian-source-perl (0.128) ...
Selecting previously unselected package emacs-el.
Preparing to unpack .../72-emacs-el_1%3a30.1+1-4_all.deb ...
Unpacking emacs-el (1:30.1+1-4) ...
Selecting previously unselected package emacsen-common.
Preparing to unpack .../73-emacsen-common_3.0.5_all.deb ...
Unpacking emacsen-common (3.0.5) ...
Selecting previously unselected package install-info.
Preparing to unpack .../74-install-info_7.1.1-1+b1_amd64.deb ...
Unpacking install-info (7.1.1-1+b1) ...
Selecting previously unselected package emacs-common.
Preparing to unpack .../75-emacs-common_1%3a30.1+1-4_all.deb ...
Unpacking emacs-common (1:30.1+1-4) ...
Selecting previously unselected package emacs-bin-common.
Preparing to unpack .../76-emacs-bin-common_1%3a30.1+1-4+b1_amd64.deb ...
Unpacking emacs-bin-common (1:30.1+1-4+b1) ...
Selecting previously unselected package libasound2-data.
Preparing to unpack .../77-libasound2-data_1.2.13-1_all.deb ...
Unpacking libasound2-data (1.2.13-1) ...
Selecting previously unselected package libasound2t64:amd64.
Preparing to unpack .../78-libasound2t64_1.2.13-1+b1_amd64.deb ...
Unpacking libasound2t64:amd64 (1.2.13-1+b1) ...
Selecting previously unselected package libdbus-1-3:amd64.
Preparing to unpack .../79-libdbus-1-3_1.16.2-2_amd64.deb ...
Unpacking libdbus-1-3:amd64 (1.16.2-2) ...
Selecting previously unselected package libgccjit0:amd64.
Preparing to unpack .../80-libgccjit0_14.2.0-19_amd64.deb ...
Unpacking libgccjit0:amd64 (14.2.0-19) ...
Selecting previously unselected package libidn2-0:amd64.
Preparing to unpack .../81-libidn2-0_2.3.8-2_amd64.deb ...
Unpacking libidn2-0:amd64 (2.3.8-2) ...
Selecting previously unselected package libffi8:amd64.
Preparing to unpack .../82-libffi8_3.4.7-1_amd64.deb ...
Unpacking libffi8:amd64 (3.4.7-1) ...
Selecting previously unselected package libp11-kit0:amd64.
Preparing to unpack .../83-libp11-kit0_0.25.5-3_amd64.deb ...
Unpacking libp11-kit0:amd64 (0.25.5-3) ...
Selecting previously unselected package libtasn1-6:amd64.
Preparing to unpack .../84-libtasn1-6_4.20.0-2_amd64.deb ...
Unpacking libtasn1-6:amd64 (4.20.0-2) ...
Selecting previously unselected package libgnutls30t64:amd64.
Preparing to unpack .../85-libgnutls30t64_3.8.9-2_amd64.deb ...
Unpacking libgnutls30t64:amd64 (3.8.9-2) ...
Selecting previously unselected package libgpm2:amd64.
Preparing to unpack .../86-libgpm2_1.20.7-11+b2_amd64.deb ...
Unpacking libgpm2:amd64 (1.20.7-11+b2) ...
Selecting previously unselected package liblcms2-2:amd64.
Preparing to unpack .../87-liblcms2-2_2.16-2_amd64.deb ...
Unpacking liblcms2-2:amd64 (2.16-2) ...
Selecting previously unselected package libtree-sitter0.22:amd64.
Preparing to unpack .../88-libtree-sitter0.22_0.22.6-6_amd64.deb ...
Unpacking libtree-sitter0.22:amd64 (0.22.6-6) ...
Selecting previously unselected package emacs-nox.
Preparing to unpack .../89-emacs-nox_1%3a30.1+1-4+b1_amd64.deb ...
Unpacking emacs-nox (1:30.1+1-4+b1) ...
Selecting previously unselected package emacs.
Preparing to unpack .../90-emacs_1%3a30.1+1-4_all.deb ...
Unpacking emacs (1:30.1+1-4) ...
Selecting previously unselected package libarray-utils-perl.
Preparing to unpack .../91-libarray-utils-perl_0.5-3_all.deb ...
Unpacking libarray-utils-perl (0.5-3) ...
Selecting previously unselected package libconfig-tiny-perl.
Preparing to unpack .../92-libconfig-tiny-perl_2.30-1_all.deb ...
Unpacking libconfig-tiny-perl (2.30-1) ...
Selecting previously unselected package libnumber-compare-perl.
Preparing to unpack .../93-libnumber-compare-perl_0.03-3_all.deb ...
Unpacking libnumber-compare-perl (0.03-3) ...
Selecting previously unselected package libtext-glob-perl.
Preparing to unpack .../94-libtext-glob-perl_0.11-3_all.deb ...
Unpacking libtext-glob-perl (0.11-3) ...
Selecting previously unselected package libfile-find-rule-perl.
Preparing to unpack .../95-libfile-find-rule-perl_0.34-3_all.deb ...
Unpacking libfile-find-rule-perl (0.34-3) ...
Selecting previously unselected package dh-elpa.
Preparing to unpack .../96-dh-elpa_2.1.9_all.deb ...
Unpacking dh-elpa (2.1.9) ...
Setting up libapt-pkg-perl (0.1.41) ...
Setting up libarray-utils-perl (0.5-3) ...
Setting up libpipeline1:amd64 (1.5.8-1) ...
Setting up liblcms2-2:amd64 (2.16-2) ...
Setting up libtie-ixhash-perl (1.23-4) ...
Setting up libgpm2:amd64 (1.20.7-11+b2) ...
Setting up bsdextrautils (2.40.4-5) ...
Setting up libtext-glob-perl (0.11-3) ...
Setting up libmagic-mgc (1:5.46-2) ...
Setting up libclone-perl:amd64 (0.47-1+b1) ...
Setting up libarchive-zip-perl (1.68-1) ...
Setting up libio-stringy-perl (2.113-2) ...
Setting up libhtml-tagset-perl (3.24-1) ...
Setting up libdebhelper-perl (13.24.1) ...
Setting up liblwp-mediatypes-perl (6.04-2) ...
Setting up libmagic1t64:amd64 (1:5.46-2) ...
Setting up libtry-tiny-perl (0.32-1) ...
Setting up perl-openssl-defaults:amd64 (7+b2) ...
Setting up gettext-base (0.23.1-1) ...
Setting up m4 (1.4.19-7) ...
Setting up libencode-locale-perl (1.05-3) ...
Setting up file (1:5.46-2) ...
Setting up libconfig-tiny-perl (2.30-1) ...
Setting up libsub-install-perl (0.929-1) ...
Setting up libelf1t64:amd64 (0.192-4) ...
Setting up libnumber-compare-perl (0.03-3) ...
Setting up liberror-perl (0.17030-1) ...
Setting up libasound2-data (1.2.13-1) ...
Setting up libtree-sitter0.22:amd64 (0.22.6-6) ...
Setting up autotools-dev (20220109.1) ...
Setting up libasound2t64:amd64 (1.2.13-1+b1) ...
Setting up emacsen-common (3.0.5) ...
Setting up libfile-find-rule-perl (0.34-3) ...
Setting up libdbus-1-3:amd64 (1.16.2-2) ...
Setting up libunistring5:amd64 (1.3-1) ...
Setting up libarray-unique-perl (0.09-1) ...
Setting up libio-html-perl (1.004-3) ...
Setting up autopoint (0.23.1-1) ...
Setting up liblist-moreutils-xs-perl (0.430-4+b2) ...
Setting up autoconf (2.72-3) ...
Setting up libtimedate-perl (2.3300-2) ...
Setting up libexporter-lite-perl (0.09-2) ...
Setting up libsub-name-perl:amd64 (0.28-1) ...
Setting up libffi8:amd64 (3.4.7-1) ...
Setting up dwz (0.15-1+b1) ...
Setting up sensible-utils (0.0.24) ...
Setting up libuchardet0:amd64 (0.0.8-1+b2) ...
Setting up libtasn1-6:amd64 (4.20.0-2) ...
Setting up netbase (6.5) ...
Setting up libicu76:amd64 (76.1-3) ...
Setting up install-info (7.1.1-1+b1) ...
Setting up libexporter-tiny-perl (1.006002-1) ...
Setting up libclass-accessor-perl (0.51-2) ...
Setting up libgccjit0:amd64 (14.2.0-19) ...
Setting up openssl (3.4.1-1) ...
Setting up libxml2:amd64 (2.12.7+dfsg+really2.9.14-0.3+b1) ...
Setting up liburi-perl (5.30-1) ...
Setting up libnet-ssleay-perl:amd64 (1.94-3) ...
Setting up automake (1:1.17-3) ...
update-alternatives: using /usr/bin/automake-1.17 to provide /usr/bin/automake (automake) in auto mode
Setting up libfile-stripnondeterminism-perl (1.14.1-2) ...
Setting up libhttp-date-perl (6.06-1) ...
Setting up gettext (0.23.1-1) ...
Setting up libfile-listing-perl (6.16-1) ...
Setting up libtool (2.5.4-4) ...
Setting up liblist-moreutils-perl (0.430-2) ...
Setting up libnet-http-perl (6.23-1) ...
Setting up libidn2-0:amd64 (2.3.8-2) ...
Setting up intltool-debian (0.35.0+20060710.6) ...
Setting up dh-autoreconf (20) ...
Setting up ca-certificates (20241223) ...
Updating certificates in /etc/ssl/certs...
152 added, 0 removed; done.
Setting up libp11-kit0:amd64 (0.25.5-3) ...
Setting up dh-strip-nondeterminism (1.14.1-2) ...
Setting up libwww-robotrules-perl (6.02-1) ...
Setting up groff-base (1.23.0-7) ...
Setting up libhtml-parser-perl:amd64 (3.83-1+b2) ...
Setting up libio-socket-ssl-perl (2.089-1) ...
Setting up libhttp-message-perl (7.00-2) ...
Setting up libhtml-form-perl (6.12-1) ...
Setting up libgnutls30t64:amd64 (3.8.9-2) ...
Setting up libhttp-negotiate-perl (6.01-2) ...
Setting up libhttp-cookies-perl (6.11-1) ...
Setting up po-debconf (1.0.21+nmu1) ...
Setting up libhtml-tree-perl (5.07-3) ...
Setting up libcgi-pm-perl (4.67-1) ...
Setting up man-db (2.13.0-1) ...
Not building database; man-db/auto-update is not 'true'.
Setting up debhelper (13.24.1) ...
Setting up emacs-el (1:30.1+1-4) ...
Setting up emacs-common (1:30.1+1-4) ...
Setting up liblwp-protocol-https-perl (6.14-1) ...
Setting up libwww-perl (6.78-1) ...
Setting up libparse-debcontrol-perl (2.005-6) ...
Setting up libwww-mechanize-perl (2.19-1) ...
Setting up libdebian-source-perl (0.128) ...
Setting up emacs-bin-common (1:30.1+1-4+b1) ...
update-alternatives: using /usr/bin/ctags.emacs to provide /usr/bin/ctags (ctags) in auto mode
update-alternatives: using /usr/bin/ebrowse.emacs to provide /usr/bin/ebrowse (ebrowse) in auto mode
update-alternatives: using /usr/bin/etags.emacs to provide /usr/bin/etags (etags) in auto mode
Setting up emacs-nox (1:30.1+1-4+b1) ...
update-alternatives: using /usr/bin/emacs-nox to provide /usr/bin/emacs (emacs) in auto mode
update-alternatives: using /usr/bin/emacs to provide /usr/bin/editor (editor) in auto mode
update-alternatives: using /usr/bin/emacsclient.emacs to provide /usr/bin/emacsclient (emacsclient) in auto mode
Install emacsen-common for emacs
emacsen-common: Handling install of emacsen flavor emacs

In toplevel form:
usr/share/emacs/site-lisp/debian-startup.el:1:1: Warning: file has no `lexical-binding' directive on its first line
Setting up dh-elpa (2.1.9) ...
Setting up emacs (1:30.1+1-4) ...
Processing triggers for libc-bin (2.41-6) ...
Processing triggers for ca-certificates (20241223) ...
Updating certificates in /etc/ssl/certs...
0 added, 0 removed; done.
Running hooks in /etc/ca-certificates/update.d...
done.
Reading package lists...
Building dependency tree...
Reading state information...
Reading extended state information...
Initializing package states...
Writing extended state information...
Building tag database...
 -> Finished parsing the build-deps
I: Building the package
I: user script /srv/workspace/pbuilder/1363266/tmp/hooks/A99_set_merged_usr starting
Not re-configuring usrmerge for unstable
I: user script /srv/workspace/pbuilder/1363266/tmp/hooks/A99_set_merged_usr finished
hostname: Name or service not known
I: Running cd /build/reproducible-path/emacs-buttercup-1.37/ && env PATH="/usr/sbin:/usr/bin:/sbin:/bin:/usr/games:/i/capture/the/path" HOME="/nonexistent/second-build" dpkg-buildpackage -us -uc -b && env PATH="/usr/sbin:/usr/bin:/sbin:/bin:/usr/games:/i/capture/the/path" HOME="/nonexistent/second-build" dpkg-genchanges -S  > ../emacs-buttercup_1.37-1_source.changes
dpkg-buildpackage: info: source package emacs-buttercup
dpkg-buildpackage: info: source version 1.37-1
dpkg-buildpackage: info: source distribution unstable
dpkg-buildpackage: info: source changed by Xiyue Deng <manphiz@gmail.com>
 dpkg-source --before-build .
dpkg-buildpackage: info: host architecture amd64
dpkg-source: info: using options from emacs-buttercup-1.37/debian/source/options: --single-debian-patch --auto-commit
 debian/rules clean
dh clean --with elpa
   dh_auto_clean
	make -j20 clean
make[1]: Entering directory '/build/reproducible-path/emacs-buttercup-1.37'
rm -f *.elc tests/*.elc
make[1]: Leaving directory '/build/reproducible-path/emacs-buttercup-1.37'
   dh_clean
	rm -f debian/debhelper-build-stamp
	rm -rf debian/.debhelper/
	rm -f -- debian/elpa-buttercup.substvars debian/files
	rm -fr -- debian/elpa-buttercup/ debian/tmp/
	find .  \( \( \
		\( -path .\*/.git -o -path .\*/.svn -o -path .\*/.bzr -o -path .\*/.hg -o -path .\*/CVS -o -path .\*/.pc -o -path .\*/_darcs \) -prune -o -type f -a \
	        \( -name '#*#' -o -name '.*~' -o -name '*~' -o -name DEADJOE \
		 -o -name '*.orig' -o -name '*.rej' -o -name '*.bak' \
		 -o -name '.*.orig' -o -name .*.rej -o -name '.SUMS' \
		 -o -name TAGS -o \( -path '*/.deps/*' -a -name '*.P' \) \
		\) -exec rm -f {} + \) -o \
		\( -type d -a \( -name autom4te.cache -o -name __pycache__ \) -prune -exec rm -rf {} + \) \)
 debian/rules binary
dh binary --with elpa
   dh_update_autotools_config
   dh_autoreconf
   dh_auto_configure
   debian/rules override_dh_auto_build
make[1]: Entering directory '/build/reproducible-path/emacs-buttercup-1.37'
Loading /etc/emacs/site-start.d/00debian.el (source)...
Loading /etc/emacs/site-start.d/50autoconf.el (source)...
Loading /etc/emacs/site-start.d/00debian.el (source)...
Loading /etc/emacs/site-start.d/50autoconf.el (source)...
Loading /etc/emacs/site-start.d/00debian.el (source)...
Loading /etc/emacs/site-start.d/50autoconf.el (source)...
Package autoload is deprecated
Loading /etc/emacs/site-start.d/00debian.el (source)...
Loading /etc/emacs/site-start.d/50autoconf.el (source)...
dh_auto_build just runs make[2]: Entering directory '/build/reproducible-path/emacs-buttercup-1.37' emacs -batch -L . -f batch-byte-compile buttercup-compat.el emacs -batch -L . -f batch-byte-compile buttercup.el ./bin/buttercup -L . tests Running 291 specs. The buttercup--enclosed-expr function should handle expressions wrapped by buttercup--wrap-expr
 expressions wrapped by buttercup--wrap-expr (16.31ms) a closure with expression copy?
 a closure with expression copy? !! CANCELLED !! Not testable on Emacs 30+, not relevant for Emacs 29+ (0.26ms) a lambda with expression copy?
 a lambda with expression copy? (0.51ms) byte compiled lambda objects
 lambda objects (0.66ms) wrapped expression
 wrapped expression !! CANCELLED !! Not with Oclosures (0.16ms) should error on a simple closure
 on a simple closure (0.46ms) on a closure with stackframe marker but no quoted expression
 on a closure with stackframe marker but no quoted expression (0.42ms) for multi-statement closures
 for multi-statement closures (0.45ms) for closures with non-empty argument lists
 for closures with non-empty argument lists (0.41ms) on simple lambda objects
 on simple lambda objects (8.77ms) on a lambda with stackframe marker but no quoted expression
 on a lambda with stackframe marker but no quoted expression (0.42ms) for multi-statement lambdas
 for multi-statement lambdas (0.18ms) for lambdas with non-empty argument lists
 for lambdas with non-empty argument lists (0.24ms) on byte-compiled functions with arguments
 on byte-compiled functions with arguments (0.52ms) The buttercup-failed signal can be raised
 can be raised (0.16ms) The buttercup-pending signal can be raised
 can be raised (0.14ms) The `expect' form with a matcher should translate to the function call with closures
 with a matcher should translate to the function call with closures (2.12ms) with no matcher should use `:to-be-truthy' as the matcher
 with no matcher should use `:to-be-truthy' as the matcher (0.60ms) The `buttercup-expect' function with a function as a matcher argument should not raise an error if the function returns true
 should not raise an error if the function returns true (0.26ms) should raise an error if the function returns false
 should raise an error if the function returns false (0.23ms) with a matcher argument should not raise an error if the matcher returns true
 should not raise an error if the matcher returns true (0.19ms) should raise an error if the matcher returns false
 should raise an error if the matcher returns false (0.19ms) The `buttercup-fail' function should raise a signal with its arguments
 should raise a signal with its arguments (0.17ms) The `assume' form should raise a signal if the condition is nil
 should raise a signal if the condition is nil (0.17ms) should show the format if no message is given
 should show the format if no message is given (0.17ms) should not raise a signal if the condition is non-nil
 should not raise a signal if the condition is non-nil (0.13ms) The `buttercup-skip' function should raise a signal with its arguments
 should raise a signal with its arguments (0.17ms) The `buttercup-define-matcher' macro should create a matcher usable by apply-matcher
 should create a matcher usable by apply-matcher (0.20ms) The `buttercup--apply-matcher' function should work with functions
 should work with functions (0.26ms) should work with matchers
 should work with matchers (9.40ms) should fail if the matcher is not defined
 should fail if the matcher is not defined (0.31ms) The :buttercup-define-matcher-for-unary-function helper should not modify match data
 should not modify match data (0.35ms) The :buttercup-define-matcher-for-binary-function helper should not modify match data
 should not modify match data (0.31ms) The included matcher :to-be-truthy should match for a truthy expression
 should match for a truthy expression (0.25ms) should not match for an untruthy expression
 should not match for an untruthy expression (0.23ms) :to-be should match if the args are `eq'
 should match if the args are `eq' (0.43ms) should not match if the args are not `eq'
 should not match if the args are not `eq' (0.67ms) :to-equal should match if the args are `equal'
 should match if the args are `equal' (0.38ms) should not match if the args are not `equal'
 should not match if the args are not `equal' (0.36ms) :not should invert the car of the nested matcher's return value
 should invert the car of the nested matcher's return value (0.51ms) :to-have-same-items-as should match equal sets
 should match equal sets (0.45ms) should notice missing elements in the second argument
 should notice missing elements in the second argument (0.48ms) should notice extra items in the second argument
 should notice extra items in the second argument (0.49ms) should notice extra items in both arguments
 should notice extra items in both arguments (0.51ms) :to-match should match the first argument against a regex
 should match the first argument against a regex (4.73ms) should show regex mismatches
 should show regex mismatches (0.40ms) :to-be-in should match when the first argument is a member of the second argument
 should match when the first argument is a member of the second argument (0.44ms) should not match when the first argument is not a member of the second argument
 should not match when the first argument is not a member of the second argument (0.43ms) :to-contain should match when the second argument is a member of the first argument
 should match when the second argument is a member of the first argument (0.40ms) should not match when the second argument is not a member of the first argument
 should not match when the second argument is not a member of the first argument (0.43ms) :to-be-less-than should match when the first argument is less than the second argument
 should match when the first argument is less than the second argument (0.35ms) should not match when the first argument is equal to the second argument
 should not match when the first argument is equal to the second argument (0.33ms) should not match when the first argument is greater than the second argument
 should not match when the first argument is greater than the second argument (4.66ms) :to-be-greater-than should match when the first argument is greater than the second argument
 should match when the first argument is greater than the second argument (0.65ms) should not match when the first argument is equal to the second argument
 should not match when the first argument is equal to the second argument (0.31ms) should not match when the first argument is greater than the second argument
 should not match when the first argument is greater than the second argument (0.33ms) :to-be-weakly-less-than should match when the first argument is less than the second argument
 should match when the first argument is less than the second argument (0.32ms) should match when the first argument is equal to the second argument
 should match when the first argument is equal to the second argument (0.32ms) should not match when the first argument is greater than the second argument
 should not match when the first argument is greater than the second argument (0.34ms) :to-be-weakly-greater-than should match when the first argument is greater than the second argument
 should match when the first argument is greater than the second argument (0.33ms) should match when the first argument is equal to the second argument
 should match when the first argument is equal to the second argument (0.31ms) should not match when the first argument is greater than the second argument
 should not match when the first argument is greater than the second argument (4.62ms) :to-be-close-to should match when value difference is less than precision
 should match when value difference is less than precision (0.71ms) should not match when value difference is larger than precision
 should not match when value difference is larger than precision (0.41ms) :to-throw should match when signal symbol and argument match exactly
 should match when signal symbol and argument match exactly (0.27ms) should match the error symbol without args
 should match the error symbol without args (0.28ms) should match the with no error signal specified
 should match the with no error signal specified (0.22ms) should match a child signal
 should match a child signal (0.27ms) should match child signals and equal arguments
 should match child signals and equal arguments (0.28ms) should not match with different arguments
 should not match with different arguments (0.34ms) should not match an unrelated symbol
 should not match an unrelated symbol (0.30ms) should not match a parent signal
 should not match a parent signal (4.64ms) should not match when no signal is raised and not mention unspecified signal
 and not mention unspecified signal (0.41ms) and mention any specified signal
 and mention any specified signal (0.34ms) :to-have-been-called should not match if the spy has not been called
 should not match if the spy has not been called (0.23ms) should match if the spy has been called once
 should match if the spy has been called once (0.20ms) should match if the spy has been called multiple times
 should match if the spy has been called multiple times (133.76ms) :to-have-been-called-with should not match if the spy has not been called at all
 should not match if the spy has not been called at all (2.32ms) should not match if the spy has not been called with the specified arguments
 should not match if the spy has not been called with the specified arguments (0.38ms) should match if the spy has been called once with the specified arguments
 should match if the spy has been called once with the specified arguments (0.27ms) should match if the spy has been called multiple times with the specified arguments
 should match if the spy has been called multiple times with the specified arguments (0.25ms) :to-have-been-called-times should not match if the spy has been called less times
 should not match if the spy has been called less times (0.27ms) should not match if the spy has been called more times
 should not match if the spy has been called more times (0.30ms) should match if the spy has been called the correct number of times
 should match if the spy has been called the correct number of times (0.31ms) should match if the spy has been called 0 times
 should match if the spy has been called 0 times (0.29ms) The `buttercup-suite-add-child' function should add an element at the end of the list and return it
 should add an element at the end of the list and return it (0.48ms) should add an element even if the list is empty and return it
 should add an element even if the list is empty and return it (0.31ms) should add the parent to the child
 should add the parent to the child (0.19ms) The `buttercup-suite-parents' function should return the list of parents for a suite
 should return the list of parents for a suite (0.21ms) The `buttercup-spec-parents' function should return the list of parents for a spec
 should return the list of parents for a spec (0.21ms) The `buttercup-suites-total-specs-defined' function should return the number of specs in a list of suites
 should return the number of specs in a list of suites (0.19ms) The `buttercup-suites-total-specs-pending' function should return the number of pending specs in a list of suites
 should return the number of pending specs in a list of suites (0.44ms) should also count skipped specs
 should also count skipped specs (0.40ms) The `buttercup-suites-total-specs-failed' function should return the number of failed specs in a list of suites
 should return the number of failed specs in a list of suites (0.20ms) The `buttercup-suite-full-name' function should return the full name of a suite without parents
 should return the full name of a suite without parents (0.18ms) should return the full name of a suite with parents
 should return the full name of a suite with parents (0.20ms) The `buttercup-spec-full-name' function should return the full name of a spec without parents
 should return the full name of a spec without parents (0.70ms) should return the full name of a spec with parents
 should return the full name of a spec with parents (0.53ms) The `buttercup-elapsed-time' function should report elapsed time for suites
 should report elapsed time for suites (1.01ms) should report elapsed time for specs
 should report elapsed time for specs (0.79ms) The `buttercup--run-suite' function should set start and end time of the suite
 should set start and end time of the suite (0.80ms) The `buttercup--run-spec' function should set start and end time of the spec
 should set start and end time of the spec (1.02ms) should not overwrite pending status with `after-each' results
 should not overwrite pending status with `after-each' results (0.35ms) should set status to pending for assume in `before-each'
 for assume in `before-each' (0.58ms) for assume in spec
 for assume in spec (0.32ms) for assume in `after-each'
 for assume in `after-each' (0.46ms) The `describe' macro should expand to a simple call to the buttercup-describe function
 should expand to a simple call to the buttercup-describe function (0.19ms) should support the :var argument
 should support the :var argument (0.21ms) should support the :var* argument
 should support the :var* argument (0.17ms) should error when :var is not first
 :var is not first (0.18ms) :var* is not first
 :var* is not first (0.20ms) is expanded with `lexical-binding' nil
 is expanded with `lexical-binding' nil (0.22ms) The `buttercup-describe' function should run the enclosing body
 should run the enclosing body (0.15ms) should set the `buttercup-suites' variable
 should set the `buttercup-suites' variable (0.20ms) should add child suites when called nested
 should add child suites when called nested (0.35ms) The `it' macro should expand to a call to the `buttercup-it' function
 should expand to a call to the `buttercup-it' function (0.16ms) without argument should expand to xit.
 without argument should expand to xit. (0.15ms) The `buttercup-it' function should fail if not called from within a describe form
 should fail if not called from within a describe form (0.15ms) should add a spec to the current suite and return the spec
 should add a spec to the current suite and return the spec (0.47ms) The `before-each' macro expands to a function call
 expands to a function call (0.16ms) The `buttercup-before-each' function adds its argument to the before-each list of the current suite
 adds its argument to the before-each list of the current suite (0.17ms) The `after-each' macro expands to a function call
 expands to a function call (0.16ms) The `buttercup-after-each' function adds its argument to the after-each list of the current suite
 adds its argument to the after-each list of the current suite (0.18ms) The `before-all' macro expands to a function call
 expands to a function call (0.16ms) The `buttercup-before-all' function adds its argument to the before-all list of the current suite
 adds its argument to the before-all list of the current suite (0.22ms) The `after-all' macro expands to a function call
 expands to a function call (0.19ms) The `buttercup-after-all' function adds its argument to the after-all list of the current suite
 adds its argument to the after-all list of the current suite (3.01ms) The `xdescribe' macro expands directly to a function call
 expands directly to a function call (0.26ms) changes contained it-specs to pending specs
 changes contained it-specs to pending specs (0.24ms) should add a pending suite
 should add a pending suite (0.24ms) The `xit' macro expands directly to a function call
 expands directly to a function call (0.17ms) The `buttercup-xit' function should be a no-op
 should be a no-op (0.19ms) should add a function that raises a pending signal
 should add a function that raises a pending signal (0.30ms) should mark the suite as pending
 should mark the suite as pending (0.22ms) should set the failure description to PENDING
 should set the failure description to PENDING (0.38ms) The Spy `spy-on' function replaces a symbol's function slot
 replaces a symbol's function slot (0.18ms) restores the old value after a spec run
 restores the old value after a spec run (0.15ms) allows a spied-on command to be executed as a command
 allows a spied-on command to be executed as a command (0.26ms) can spy on autoloaded functions
 can spy on autoloaded functions (15.37ms) can spy on non-existing functions
 can spy on non-existing functions (0.17ms) only accepts ARG for keywords that use it
 only accepts ARG for keywords that use it (0.50ms) works on native-compilation primitives
 works on native-compilation primitives (0.48ms) will signal en error if used in before-all
 used in before-all (0.20ms) used directly in describe
 used directly in describe (0.17ms) :to-have-been-called matcher returns false if the spy was not called
 returns false if the spy was not called (0.22ms) returns true if the spy was called at all
 returns true if the spy was called at all (0.20ms) :to-have-been-called-with matcher returns false if the spy was not called at all
 returns false if the spy was not called at all (0.40ms) returns false if the spy was called with different arguments
 returns false if the spy was called with different arguments (0.37ms) returns true if the spy was called with those arguments
 returns true if the spy was called with those arguments (0.29ms) :to-have-been-called-times matcher returns error if the spy was called less than expected
 returns error if the spy was called less than expected (0.25ms) returns error if the spy was called more than expected
 returns error if the spy was called more than expected (0.25ms) returns true if the spy was called the expected number of times
 returns true if the spy was called the expected number of times (0.25ms) use plural words in error message
 use plural words in error message (0.25ms) use singular expected word in error message
 use singular expected word in error message (0.25ms) use singular actual word in error message
 use singular actual word in error message (0.24ms) :and-call-through keyword functionality tracks calls to the function
 tracks calls to the function (0.07ms) passes the arguments to the original function
 passes the arguments to the original function (0.20ms) :and-return-value keyword functionality tracks calls to the function
 tracks calls to the function (0.08ms) returns the specified value
 returns the specified value (0.19ms) works with strings
 works with strings (0.19ms) works with vectors
 works with vectors (0.19ms) works with symbols
 works with symbols (0.19ms) works with conses
 works with conses (0.19ms) works with lists
 works with lists (0.19ms) works with alists
 works with alists (8.86ms) :and-call-fake keyword functionality tracks calls to the function
 tracks calls to the function (0.17ms) returns the specified value
 returns the specified value (0.18ms) :and-throw-error keyword functionality throws an error when called
 throws an error when called (0.23ms) error-recording functionality records the function as called even if it throws an error
 records the function as called even if it throws an error (0.34ms) counts both successful calls and calls that threw errors
 counts both successful calls and calls that threw errors (0.36ms) records args to the function whether it throw an error or not
 records args to the function whether it throw an error or not (0.50ms) records the signal thrown by a call to the function
 records the signal thrown by a call to the function (0.41ms) The batch reporters on the buttercup-started event should print the number of specs
 should print the number of specs (0.65ms) should color-print the number of specs with the default color
 should color-print the number of specs with the default color (0.94ms) should print the number of skipped specs
 should print the number of skipped specs (0.37ms) should color-print the number of skipped specs with the default color
 should color-print the number of skipped specs with the default color (0.35ms) on the suite-started event should emit an indented suite description
 should emit an indented suite description (0.31ms) should color-print an indented suite description with the default color
 should color-print an indented suite description with the default color (0.32ms) on the spec-started event should emit an indented spec description
 should emit an indented spec description (0.31ms) should color-print an indented spec description with the default color
 should color-print an indented spec description with the default color (0.31ms) on the spec-done event for a passed spec should print no status tag
 should print no status tag (0.43ms) should color-print the description in green and no status tag
 should color-print the description in green and no status tag (1.23ms) should print multiline specs cleanly
 should print multiline specs cleanly (0.49ms) should color-print multiline specs cleanly
 should color-print multiline specs cleanly (0.62ms) for a failed spec should say FAILED
 should say FAILED (0.74ms) should color-print the description in red and say FAILED
 should color-print the description in red and say FAILED (0.91ms) for a pending spec should output the failure-description
 should output the failure-description (0.59ms) should color-print the description and failure-description in yellow
 should color-print the description and failure-description in yellow (0.72ms) should throw an error for an unknown spec status for plain output
 for plain output (0.24ms) for colored output
 for colored output (0.21ms) on the suite-done event should emit a newline at the end of a top-level suite
 should emit a newline at the end of a top-level suite (0.33ms) should color-print a newline at the end of a top-level suite
 should color-print a newline at the end of a top-level suite (0.31ms) should not emit anything at the end of other suites
 should not emit anything at the end of other suites (0.28ms) should not color-print anything at the end of other suites
 should not color-print anything at the end of other suites (0.26ms) on the buttercup-done event should print a summary of run and failing specs
 should print a summary of run and failing specs (9.26ms) should color-print `0 failed' specs in green
 should color-print `0 failed' specs in green (0.93ms) should color-print `X failed' specs in red
 should color-print `X failed' specs in red (0.65ms) should print a summary separating run and pending specs
 should print a summary separating run and pending specs (0.42ms) should color-print pending spec count in default color
 should color-print pending spec count in default color (0.62ms) should not raise any error even if a spec failed
 should not raise any error even if a spec failed (9.56ms) on an unknown event should raise an error
 should raise an error (0.25ms) Backtraces should not be collected or printed for failed specs
 failed specs (2.72ms) passed specs
 passed specs (0.97ms) skipped specs
 skipped specs (0.84ms) should be collected for errors in matchers
 matchers (1.23ms) with style `crop' should print truncated lines
 `crop' should print truncated lines (25.48ms) `full' should print full lines
 `full' should print full lines (2.01ms) `pretty' should pretty-print frames
 `pretty' should pretty-print frames (6.57ms) `omit' should print nothing
 `omit' should print nothing (0.58ms) should signal an error for unknown styles
 should signal an error for unknown styles (0.25ms) should generate correct backtrace for no matcher
 no matcher (6.79ms) :to-be-truthy
 :to-be-truthy (5.00ms) :not :to-be-truthy
 :not :to-be-truthy (1.53ms) :to-be
 :to-be (1.24ms) :not :to-be
 :not :to-be (1.28ms) :to-equal
 :to-equal (3.79ms) :not :to-equal
 :not :to-equal (1.36ms) :to-have-same-items-as
 :to-have-same-items-as (1.18ms) :not :to-have-same-items-as
 :not :to-have-same-items-as (1.60ms) :to-match
 :to-match (7.72ms) :not :to-match
 :not :to-match (1.48ms) :to-be-in
 :to-be-in (1.21ms) :not :to-be-in
 :not :to-be-in (1.19ms) :to-contain
 :to-contain (68.54ms) :not :to-contain
 :not :to-contain (1.23ms) :to-be-less-than
 :to-be-less-than (1.10ms) :not :to-be-less-than
 :not :to-be-less-than (1.12ms) :to-be-greater-than
 :to-be-greater-than (1.33ms) :not :to-be-greater-than
 :not :to-be-greater-than (1.27ms) :to-be-weakly-less-than
 :to-be-weakly-less-than (1.22ms) :not :to-be-weakly-less-than
 :not :to-be-weakly-less-than (1.33ms) :to-be-weakly-greater-than
 :to-be-weakly-greater-than (1.19ms) :not :to-be-weakly-greater-than
 :not :to-be-weakly-greater-than (1.29ms) :to-be-close-to
 :to-be-close-to (1.64ms) :not :to-be-close-to
 :not :to-be-close-to (1.08ms) :to-have-been-called
 :to-have-been-called (1.01ms) :not :to-have-been-called
 :not :to-have-been-called (1.08ms) :to-have-been-called-with
 :to-have-been-called-with (1.10ms) :not :to-have-been-called-with
 :not :to-have-been-called-with (1.07ms) :to-have-been-called-times
 :to-have-been-called-times (0.99ms) :not :to-have-been-called-times
 :not :to-have-been-called-times (3.24ms) function matcher
 function matcher (1.16ms) :not function matcher
 :not function matcher (1.10ms) When using quiet specs in the batch reporter it should print nothing if all specs are quiet and color is disabled
 and color is disabled (0.71ms) and color is enabled
 and color is enabled (0.76ms) should print the containing suites for non-quiet specs and color is disabled
 and color is disabled (1.22ms) and color is enabled
 and color is enabled (2.47ms) should quiet all of the given spec statuses and color is disabled
 and color is disabled (0.79ms) and color is enabled
 and color is enabled (0.79ms) should handle `skipped' virtual status in quiet list
 should handle `skipped' virtual status in quiet list (1.62ms) should handle `disabled' virtual status in quiet list
 should handle `disabled' virtual status in quiet list (1.60ms) The `buttercup-run' function should signal an error if no suites are defined
 should signal an error if no suites are defined (0.23ms) should return :no-suites for no suites and noerror
 should return :no-suites for no suites and noerror (0.22ms) should raise an error if at least one spec failed
 should raise an error if at least one spec failed (0.27ms) should return nil for failing specs and noerror
 should return nil for failing specs and noerror (0.54ms) should return t for passing specs
 should return t for passing specs (0.34ms) should call the reporter twice with events buttercup-started and -done
 should call the reporter twice with events buttercup-started and -done (0.41ms) should call `buttercup--run-suite' once per suite
 should call `buttercup--run-suite' once per suite (0.30ms) The `buttercup--print' function should send a formatted string to the terminal
 should send a formatted string to the terminal (0.10ms) The `buttercup-mark-skipped' function should do nothing with a reversed match-all pattern
 should do nothing with a reversed match-all pattern (1.45ms) should mark all specs as pending with a reversed match none pattern
 should mark all specs as pending with a reversed match none pattern (0.58ms) should handle multiple patterns
 should handle multiple patterns (0.67ms) should support predicates
 should support predicates (0.57ms) should support reversed predicates
 should support reversed predicates (0.57ms) should signal an error for invalid matchers
 should signal an error for invalid matchers (0.49ms) Buttercup's ERT compatibility wrapper should convert `ert-test-failed' into `buttercup-failed'
 should convert `ert-test-failed' into `buttercup-failed' (0.29ms) should convert `ert-test-skipped' into `buttercup-pending'
 should convert `ert-test-skipped' into `buttercup-pending' (0.19ms) `buttercup-run-discover' should parse command line arguments ignoring `--'
 ignoring `--' (0.20ms) requiring an extra argument for `--traceback'
 requiring an extra argument for `--traceback' (0.21ms) checking `--traceback' argument for validity
 checking `--traceback' argument for validity (0.26ms) setting `buttercup-stack-frame-style' from `--traceback' arg
 setting `buttercup-stack-frame-style' from `--traceback' arg (0.37ms) requiring an extra argument for `--pattern' or `-p'
 requiring an extra argument for `--pattern' or `-p' (0.43ms) collecting `--pattern' and `-p' args and send to `buttercup-mark-skipped'
 collecting `--pattern' and `-p' args and send to `buttercup-mark-skipped' (0.42ms) clearing `buttercup-color' if `--no-color' is given
 clearing `buttercup-color' if `--no-color' is given (0.57ms) adding `skipped' and `disabled' to quiet statuses if `--no-skip' is given
 adding `skipped' and `disabled' to quiet statuses if `--no-skip' is given (0.51ms) adding `pending' and `passed' to quiet statuses if `--only-error' is given
 adding `pending' and `passed' to quiet statuses if `--only-error' is given (0.49ms) calling `buttercup-error-on-stale-elc' if `--stale-file-error' is given
 calling `buttercup-error-on-stale-elc' if `--stale-file-error' is given (0.28ms) search any unknown args for test files
 search any unknown args for test files (0.52ms) find and load files named test-*.el and *-tests?.el but no other files
 named test-*.el and *-tests?.el but no other files (28.63ms) only in given directories
 only in given directories (24.58ms) butter-minor-mode should fontify `describe' special form
 should fontify `describe' special form (0.83ms) should fontify `it' special form
 should fontify `it' special form (0.42ms) should add special forms to `imenu'
 should add special forms to `imenu' (0.95ms) should define `buttercup-minor-mode-map'
 should define `buttercup-minor-mode-map' (0.13ms) For stale `elc' file checks `buttercup-check-for-stale-elc' should do nothing for `el' files
 should do nothing for `el' files (0.24ms) should signal error when `elc' is older than `el'
 should signal error when `elc' is older than `el' (0.28ms) should not signal error when `elc' is newer than `el'
 should not signal error when `elc' is newer than `el' (9.26ms) should do nothing if the `el' file does not exist
 should do nothing if the `el' file does not exist (0.26ms) `buttercup-error-on-stale-elc' should activate with no argument
 should activate with no argument (0.20ms) should deactivate with almost any argument
 should deactivate with almost any argument (0.20ms) should toggle when given `toggle' as argument
 should toggle when given `toggle' as argument (0.32ms) Ran 289 out of 291 specs, 0 failed, in -918.00ms. emacs -batch -L . -l buttercup.el -f buttercup-run-markdown docs/writing-tests.md Running 60 out of 63 specs. A suite contains a spec with an expectation
 contains a spec with an expectation (22.94ms) A suite is just a function and so is a spec
 and so is a spec (0.52ms) The :to-be matcher compares with `eq' and has a positive case
 and has a positive case (0.23ms) and can have a negative case
 and can have a negative case (0.29ms) Included matchers: The :to-be matcher compares with `eq'
 The :to-be matcher compares with `eq' (0.42ms) The :to-equal matcher works for simple literals and variables
 works for simple literals and variables (0.27ms) should work for compound objects
 should work for compound objects (0.26ms) The :to-have-same-items-as matcher compares two lists as sets
 The :to-have-same-items-as matcher compares two lists as sets (1.60ms) The :to-match matcher is for regular expressions
 The :to-match matcher is for regular expressions (0.69ms) The :to-be-truthy matcher is for boolean casting testing
 The :to-be-truthy matcher is for boolean casting testing (0.36ms) The :to-contain matcher is for finding an item in a list
 The :to-contain matcher is for finding an item in a list (0.43ms) The :to-be-less-than matcher is for mathematical comparisons
 The :to-be-less-than matcher is for mathematical comparisons (0.47ms) The :to-be-greater-than matcher is for mathematical comparisons
 The :to-be-greater-than matcher is for mathematical comparisons (0.55ms) The :to-be-close-to matcher is for precision math comparison
 The :to-be-close-to matcher is for precision math comparison (0.52ms) The :to-throw matcher is for testing if an expression throws an exception
 is for testing if an expression throws an exception (0.69ms) accepts a symbol to check for the signal thrown
 accepts a symbol to check for the signal thrown (0.67ms) optionally matches arguments to signals
 optionally matches arguments to signals (0.72ms) matches inherited signals
 matches inherited signals (1.68ms) ERT support allows you to use ERT macros in tests
 allows you to use ERT macros in tests (0.17ms) A spec is just a function, so it can contain any code
 is just a function, so it can contain any code (0.27ms) can have more than one expectation
 can have more than one expectation (0.37ms) A spec using :VAR has access to the variables bound in :VAR
 has access to the variables bound in :VAR (0.32ms) A spec using :VAR* has access to the variables bound in :VAR* which can refer to symbols already bound
 has access to the variables bound in :VAR* which can refer to symbols already bound (0.26ms) A spec using `before-each' and `after-each' is just a function, so it can contain any code
 is just a function, so it can contain any code (0.27ms) can have more than one expectation
 can have more than one expectation (0.43ms) A spec using `before-all' and `after-all' sets the initial value of foo before specs run
 sets the initial value of foo before specs run (0.48ms) does not reset foo between specs
 does not reset foo between specs (0.36ms) A spec is just a function, so it can contain any code
 is just a function, so it can contain any code (0.30ms) can have more than one expectation
 can have more than one expectation (0.45ms) nested inside a second describe can reference both scopes as needed
 can reference both scopes as needed (0.30ms) A spec is just a function, so it can contain any code
 is just a function, so it can contain any code PENDING (0.13ms) Pending specs can be declared using `xit'
 can be declared using `xit' PENDING (0.12ms) can be declared with `it' but without a body
 can be declared with `it' but without a body PENDING (0.12ms) Conditionally skip specs with the `assume' macro
 with the `assume' macro !! CANCELLED !! `new-function' not availeble (0.13ms) A spy tracks that the spy was called
 tracks that the spy was called (0.31ms) resets tracking after each spec
 resets tracking after each spec (0.41ms) that is defined in a nested `describe' will override any outer spy
 will override any outer spy (0.59ms) will not be active outside it's scope
 will not be active outside it's scope (0.43ms) tracks all arguments of its calls
 tracks all arguments of its calls (0.33ms) stops all execution on a function
 stops all execution on a function (0.39ms) A spy tracks that the spy was called twice
 tracks that the spy was called twice (0.29ms) A spy, when configured to call through tracks that the spy was called
 tracks that the spy was called (0.26ms) should not affect other functions
 should not affect other functions (0.41ms) when called returns the requested value
 when called returns the requested value (0.39ms) A spy, when configured to fake a return value tracks that the spy was called
 tracks that the spy was called (0.31ms) should not affect other functions
 should not affect other functions (0.40ms) when called returns the requested value
 when called returns the requested value (4.55ms) A spy, when configured with an alternate implementation tracks that the spy was called
 tracks that the spy was called (0.56ms) should not affect other functions
 should not affect other functions (0.53ms) when called returns the requested value
 when called returns the requested value (0.40ms) A spy, when configured to throw an error throws the error
 throws the error (0.51ms) A spy tracks if it was called at all
 tracks if it was called at all (0.51ms) tracks the number of times it was called
 tracks the number of times it was called (0.52ms) tracks the arguments of each call
 tracks the arguments of each call (1.18ms) tracks the arguments of all calls
 tracks the arguments of all calls (0.41ms) can provide the context and arguments to all calls
 can provide the context and arguments to all calls (0.48ms) has a shortcut to the most recent call
 has a shortcut to the most recent call (0.65ms) has a shortcut to the first call
 has a shortcut to the first call (0.47ms) tracks the return values and error signals of each call
 tracks the return values and error signals of each call (51.09ms) counts the number of successful and failed calls
 counts the number of successful and failed calls (3.83ms) can be reset
 can be reset (0.60ms) A test can issue warnings while running
 can issue warnings while running (0.37ms) Warning (buttercup): This warning should be visible after the test report. can capture its own warnings as part of the test
 can capture its own warnings as part of the test (0.57ms) Ran 59 out of 63 specs, 0 failed, in 117.51ms. make[2]: Leaving directory '/build/reproducible-path/emacs-buttercup-1.37', so suppress it.
make[1]: Leaving directory '/build/reproducible-path/emacs-buttercup-1.37'
   dh_auto_test
	make -j20 test
make[1]: Entering directory '/build/reproducible-path/emacs-buttercup-1.37'
./bin/buttercup -L . tests 
emacs -batch -L . -l buttercup.el -f buttercup-run-markdown docs/writing-tests.md
Loading /etc/emacs/site-start.d/00debian.el (source)...
Loading /etc/emacs/site-start.d/50autoconf.el (source)...
Loading /etc/emacs/site-start.d/00debian.el (source)...
Package autoload is deprecated
Loading /etc/emacs/site-start.d/50autoconf.el (source)...
Running 291 specs.

The buttercup--enclosed-expr function
  should handle
    expressions wrapped by buttercup--wrap-expr
    expressions wrapped by buttercup--wrap-expr (5.72ms)
    a closure with expression copy?
    a closure with expression copy?  !! CANCELLED !! Not testable on Emacs 30+, not relevant for Emacs 29+ (0.51ms)
    a lambda with expression copy?
    a lambda with expression copy? (0.48ms)
    byte compiled
      lambda objects
      lambda objects (0.60ms)
      wrapped expression
      wrapped expression  !! CANCELLED !! Not with Oclosures (0.42ms)
  should error
    on a simple closure
    on a simple closure (0.50ms)
    on a closure with stackframe marker but no quoted expression
    on a closure with stackframe marker but no quoted expression (0.50ms)
    for multi-statement closures
    for multi-statement closures (0.45ms)
    for closures with non-empty argument lists
    for closures with non-empty argument lists (0.76ms)
    on simple lambda objects
    on simple lambda objects (0.41ms)
    on a lambda with stackframe marker but no quoted expression
    on a lambda with stackframe marker but no quoted expression (0.43ms)
    for multi-statement lambdas
    for multi-statement lambdas (0.46ms)
    for lambdas with non-empty argument lists
    for lambdas with non-empty argument lists (0.48ms)
    on byte-compiled functions with arguments
    on byte-compiled functions with arguments (1.06ms)

The buttercup-failed signal
  can be raised
  can be raised (0.56ms)

The buttercup-pending signal
  can be raised
  can be raised (0.97ms)

The `expect' form
  with a matcher should translate to the function call with closures
  with a matcher should translate to the function call with closures (1.53ms)
  with no matcher should use `:to-be-truthy' as the matcher
  with no matcher should use `:to-be-truthy' as the matcher (0.81ms)

The `buttercup-expect' function
  with a function as a matcher argument
    should not raise an error if the function returns true
    should not raise an error if the function returns true (6.33ms)
    should raise an error if the function returns false
    should raise an error if the function returns false (0.84ms)
  with a matcher argument
    should not raise an error if the matcher returns true
    should not raise an error if the matcher returns true (0.48ms)
    should raise an error if the matcher returns false
    should raise an error if the matcher returns false (0.48ms)

The `buttercup-fail' function
  should raise a signal with its arguments
  should raise a signal with its arguments (0.46ms)

The `assume' form
  should raise a signal if the condition is nil
  should raise a signal if the condition is nil (1.17ms)
  should show the format if no message is given
  should show the format if no message is given (0.46ms)
  should not raise a signal if the condition is non-nil
  should not raise a signal if the condition is non-nil (0.49ms)

The `buttercup-skip' function
  should raise a signal with its arguments
  should raise a signal with its arguments (0.45ms)

The `buttercup-define-matcher' macro
  should create a matcher usable by apply-matcher
  should create a matcher usable by apply-matcher (0.67ms)

The `buttercup--apply-matcher' function
  should work with functions
  should work with functions (0.51ms)
  should work with matchers
  should work with matchers (0.47ms)
  should fail if the matcher is not defined
  should fail if the matcher is not defined (0.45ms)

The :buttercup-define-matcher-for-unary-function helper
  should not modify match data
  should not modify match data (0.54ms)

The :buttercup-define-matcher-for-binary-function helper
  should not modify match data
  should not modify match data (0.62ms)

The included matcher
  :to-be-truthy
    should match for a truthy expression
    should match for a truthy expression (0.64ms)
    should not match for an untruthy expression
    should not match for an untruthy expression (0.51ms)
  :to-be
    should match if the args are `eq'
    should match if the args are `eq' (0.71ms)
    should not match if the args are not `eq'
    should not match if the args are not `eq' (0.71ms)
  :to-equal
    should match if the args are `equal'
    should match if the args are `equal' (0.68ms)
    should not match if the args are not `equal'
    should not match if the args are not `equal' (0.65ms)
  :not
    should invert the car of the nested matcher's return value
    should invert the car of the nested matcher's return value (0.85ms)
  :to-have-same-items-as
    should match equal sets
    should match equal sets (0.68ms)
    should notice missing elements in the second argument
    should notice missing elements in the second argument (0.77ms)
    should notice extra items in the second argument
    should notice extra items in the second argument (0.80ms)
    should notice extra items in both arguments
    should notice extra items in both arguments (0.84ms)
  :to-match
    should match the first argument against a regex
    should match the first argument against a regex (0.64ms)
    should show regex mismatches
    should show regex mismatches (0.55ms)
  :to-be-in
    should match when the first argument is a member of the second argument
    should match when the first argument is a member of the second argument (1.49ms)
    should not match when the first argument is not a member of the second argument
    should not match when the first argument is not a member of the second argument (0.77ms)
  :to-contain
    should match when the second argument is a member of the first argument
    should match when the second argument is a member of the first argument (0.68ms)
    should not match when the second argument is not a member of the first argument
    should not match when the second argument is not a member of the first argument (0.82ms)
  :to-be-less-than
    should match when the first argument is less than the second argument
    should match when the first argument is less than the second argument (0.60ms)
    should not match when the first argument is equal to the second argument
    should not match when the first argument is equal to the second argument (0.56ms)
    should not match when the first argument is greater than the second argument
    should not match when the first argument is greater than the second argument (0.57ms)
  :to-be-greater-than
    should match when the first argument is greater than the second argument
    should match when the first argument is greater than the second argument (0.58ms)
    should not match when the first argument is equal to the second argument
    should not match when the first argument is equal to the second argument (0.74ms)
    should not match when the first argument is greater than the second argument
    should not match when the first argument is greater than the second argument (0.65ms)
  :to-be-weakly-less-than
    should match when the first argument is less than the second argument
    should match when the first argument is less than the second argument (0.63ms)
    should match when the first argument is equal to the second argument
    should match when the first argument is equal to the second argument (0.58ms)
    should not match when the first argument is greater than the second argument
    should not match when the first argument is greater than the second argument (0.59ms)
  :to-be-weakly-greater-than
    should match when the first argument is greater than the second argument
    should match when the first argument is greater than the second argument (0.64ms)
    should match when the first argument is equal to the second argument
    should match when the first argument is equal to the second argument (0.58ms)
    should not match when the first argument is greater than the second argument
    should not match when the first argument is greater than the second argument (0.61ms)
  :to-be-close-to
    should match when value difference is less than precision
    should match when value difference is less than precision (0.94ms)
    should not match when value difference is larger than precision
    should not match when value difference is larger than precision (0.69ms)
  :to-throw
    should match when signal symbol and argument match exactly
    should match when signal symbol and argument match exactly (0.71ms)
    should match the error symbol without args
    should match the error symbol without args (0.50ms)
    should match the with no error signal specified
    should match the with no error signal specified (0.50ms)
    should match a child signal
    should match a child signal (0.51ms)
    should match child signals and equal arguments
    should match child signals and equal arguments (0.57ms)
    should not match with different arguments
    should not match with different arguments (0.57ms)
    should not match an unrelated symbol
    should not match an unrelated symbol (0.61ms)
    should not match a parent signal
    should not match a parent signal (0.50ms)
    should not match when no signal is raised
      and not mention unspecified signal
      and not mention unspecified signal (0.54ms)
      and mention any specified signal
      and mention any specified signal (0.67ms)
  :to-have-been-called
    should not match if the spy has not been called
    should not match if the spy has not been called (0.53ms)
    should match if the spy has been called once
    should match if the spy has been called once (0.63ms)
    should match if the spy has been called multiple times
    should match if the spy has been called multiple times (63.06ms)
  :to-have-been-called-with
    should not match if the spy has not been called at all
    should not match if the spy has not been called at all (0.78ms)
    should not match if the spy has not been called with the specified arguments
    should not match if the spy has not been called with the specified arguments (0.61ms)
    should match if the spy has been called once with the specified arguments
    should match if the spy has been called once with the specified arguments (0.55ms)
    should match if the spy has been called multiple times with the specified arguments
    should match if the spy has been called multiple times with the specified arguments (0.53ms)
  :to-have-been-called-times
    should not match if the spy has been called less times
    should not match if the spy has been called less times (0.55ms)
    should not match if the spy has been called more times
    should not match if the spy has been called more times (0.60ms)
    should match if the spy has been called the correct number of times
    should match if the spy has been called the correct number of times (0.56ms)
    should match if the spy has been called 0 times
    should match if the spy has been called 0 times (0.51ms)

The `buttercup-suite-add-child' function
  should add an element at the end of the list and return itRunning 60 out of 63 specs.


A suite
  should add an element at the end of the list and return it  contains a spec with an expectation (0.96ms)
  should add an element even if the list is empty and return it
  should add an element even if the list is empty and return it (0.58ms)
  should add the parent to the child
  should add the parent to the child (0.59ms)

The `buttercup-suite-parents' function
  should return the list of parents for a suite
  should return the list of parents for a suite (0.56ms)

The `buttercup-spec-parents' function
  should return the list of parents for a spec
  should return the list of parents for a spec (0.55ms)

The `buttercup-suites-total-specs-defined' function
  should return the number of specs in a list of suites
  should return the number of specs in a list of suites (0.47ms)

The `buttercup-suites-total-specs-pending' function
  should return the number of pending specs in a list of suites
  should return the number of pending specs in a list of suites (0.68ms)
  should also count skipped specs
  should also count skipped specs (0.70ms)

The `buttercup-suites-total-specs-failed' function
  should return the number of failed specs in a list of suites
  contains a spec with an expectation
  should return the number of failed specs in a list of suites (0.62ms)

The `buttercup-suite-full-name' function
  should return the full name of a suite without parents
  should return the full name of a suite without parents (0.46ms)
  should return the full name of a suite with parents
  should return the full name of a suite with parents (0.46ms)

The `buttercup-spec-full-name' function
  should return the full name of a spec without parents
  should return the full name of a spec without parents (0.49ms)
  should return the full name of a spec with parents
  should return the full name of a spec with parents (0.61ms)

The `buttercup-elapsed-time' function
  should report elapsed time for suites
  should report elapsed time for suites (0.59ms)
  should report elapsed time for specs
  should report elapsed time for specs (0.48ms)

The `buttercup--run-suite' function
  should set start and end time of the suite
  should set start and end time of the suite (0.81ms)

The `buttercup--run-spec' function
  should set start and end time of the spec
  should set start and end time of the spec (1.03ms)
  should not overwrite pending status with `after-each' results
  should not overwrite pending status with `after-each' results (0.58ms)
  should set status to pending
    for assume in `before-each'
    for assume in `before-each' (0.76ms)
    for assume in spec
    for assume in spec (16.01ms)
 (0.57ms)

    for assume in `after-each'A suite is just a function
  and so is a spec

  and so is a spec (0.60ms)

The :to-be matcher compares with `eq'
    for assume in `after-each'  and has a positive case (0.99ms)


  and has a positive case (0.38ms)
  and can have a negative caseThe `describe' macro

  and can have a negative case (0.29ms)

Included matchers:
  The :to-be matcher compares with `eq'  should expand to a simple call to the buttercup-describe function
  The :to-be matcher compares with `eq' (0.72ms)
  The :to-equal matcher
    works for simple literals and variables

    works for simple literals and variables (0.42ms)
    should work for compound objects  should expand to a simple call to the buttercup-describe function
    should work for compound objects (0.29ms)
 (1.64ms)
  The :to-have-same-items-as matcher compares two lists as sets  should support the :var argument
  should support the :var argument (0.72ms)
  should support the :var* argument
  The :to-have-same-items-as matcher compares two lists as sets (1.57ms)
  The :to-match matcher is for regular expressions
  should support the :var* argument (0.94ms)
  should error when 
    :var is not first

    :var is not first (0.31ms)
    :var* is not first
    :var* is not first (0.20ms)
    is expanded with `lexical-binding' nil
    is expanded with `lexical-binding' nil (0.30ms)

The `buttercup-describe' function
  should run the enclosing body
  should run the enclosing body (0.29ms)
  should set the `buttercup-suites' variable  The :to-match matcher is for regular expressions
 (2.40ms)
  The :to-be-truthy matcher is for boolean casting testing  should set the `buttercup-suites' variable (0.66ms)
  should add child suites when called nested
  The :to-be-truthy matcher is for boolean casting testing (0.45ms)
  The :to-contain matcher is for finding an item in a list

  should add child suites when called nested (0.59ms)

  The :to-contain matcher is for finding an item in a list (0.77ms)
  The :to-be-less-than matcher is for mathematical comparisonsThe `it' macro
  should expand to a call to the `buttercup-it' function

  The :to-be-less-than matcher is for mathematical comparisons (0.70ms)
  The :to-be-greater-than matcher is for mathematical comparisons  should expand to a call to the `buttercup-it' function (0.67ms)
  without argument should expand to xit.
  The :to-be-greater-than matcher is for mathematical comparisons (0.51ms)
  The :to-be-close-to matcher is for precision math comparison
  without argument should expand to xit.
  The :to-be-close-to matcher is for precision math comparison (0.49ms)
  The :to-throw matcher
    is for testing if an expression throws an exception (0.87ms)

The `buttercup-it' function
  should fail if not called from within a describe form
    is for testing if an expression throws an exception (0.71ms)
    accepts a symbol to check for the signal thrown
  should fail if not called from within a describe form (0.77ms)
  should add a spec to the current suite and return the spec
    accepts a symbol to check for the signal thrown (0.74ms)
    optionally matches arguments to signals
  should add a spec to the current suite and return the spec
    optionally matches arguments to signals (1.42ms)
    matches inherited signals (0.99ms)

The `before-each' macro
  expands to a function call
  expands to a function call (0.46ms)

The `buttercup-before-each' function
  adds its argument to the before-each list of the current suite
  adds its argument to the before-each list of the current suite
    matches inherited signals (1.73ms)

ERT support
  allows you to use ERT macros in tests (0.72ms)

The `after-each' macro

  allows you to use ERT macros in tests (0.45ms)

A spec
  is just a function, so it can contain any code  expands to a function call
  is just a function, so it can contain any code (0.32ms)
  can have more than one expectation

  can have more than one expectation (0.50ms)

A spec using :VAR
  has access to the variables bound in :VAR  expands to a function call
 (1.04ms)

  has access to the variables bound in :VARThe `buttercup-after-each' function
 (0.43ms)

  adds its argument to the after-each list of the current suiteA spec using :VAR*
  has access to the variables bound in :VAR* which can refer to symbols already bound
  has access to the variables bound in :VAR* which can refer to symbols already bound (0.37ms)

A spec using `before-each' and `after-each'
  is just a function, so it can contain any code
  adds its argument to the after-each list of the current suite
  is just a function, so it can contain any code (0.33ms)
  can have more than one expectation (1.18ms)

The `before-all' macro

  can have more than one expectation (0.45ms)

A spec using `before-all' and `after-all'
  expands to a function call  sets the initial value of foo before specs run
  expands to a function call (0.46ms)

  sets the initial value of foo before specs run (0.43ms)
  does not reset foo between specs
The `buttercup-before-all' function

  does not reset foo between specs (0.27ms)

A spec
  is just a function, so it can contain any code  adds its argument to the before-all list of the current suite
  is just a function, so it can contain any code (0.35ms)
  can have more than one expectation
  adds its argument to the before-all list of the current suite (0.72ms)

The `after-all' macro

  can have more than one expectation (0.52ms)
  nested inside a second describe
  expands to a function call
  expands to a function call (0.21ms)

The `buttercup-after-all' function
  adds its argument to the after-all list of the current suite
  adds its argument to the after-all list of the current suite (0.27ms)

The `xdescribe' macro
  expands directly to a function call
  expands directly to a function call (0.35ms)
  changes contained it-specs to pending specs    can reference both scopes as needed
  changes contained it-specs to pending specs (0.53ms)
  should add a pending suite
    can reference both scopes as needed
 (1.21ms)

  should add a pending suite (0.59ms)
A spec

  is just a function, so it can contain any codeThe `xit' macro

  is just a function, so it can contain any code  PENDING (0.24ms)

Pending specs
  expands directly to a function call  can be declared using `xit'
  can be declared using `xit'  PENDING (0.34ms)
  can be declared with `it' but without a body
  can be declared with `it' but without a body
  PENDING (0.39ms)
  expands directly to a function call
Conditionally skip specs
  with the `assume' macro (1.09ms)

  with the `assume' macro  !! CANCELLED !! `new-function' not availeble (0.17ms)

A spy
  tracks that the spy was called
The `buttercup-xit' function
  should be a no-op
  tracks that the spy was called (0.38ms)
  resets tracking after each spec

  resets tracking after each spec (0.42ms)
  that is defined in a nested `describe'
    will override any outer spy  should be a no-op (0.88ms)
  should add a function that raises a pending signal

    will override any outer spy (0.84ms)
  will not be active outside it's scope  should add a function that raises a pending signal (0.79ms)
  should mark the suite as pending
  will not be active outside it's scope (0.42ms)
  tracks all arguments of its calls

  should mark the suite as pending  tracks all arguments of its calls (0.47ms)
 (0.37ms)
  should set the failure description to PENDING  stops all execution on a function
  should set the failure description to PENDING (0.40ms)

The Spy
  `spy-on' function
    replaces a symbol's function slot
    replaces a symbol's function slot
  stops all execution on a function (0.93ms)

A spy
  tracks that the spy was called twice (0.67ms)
    restores the old value after a spec run
  tracks that the spy was called twice (0.32ms)

A spy, when configured to call through
  tracks that the spy was called
  tracks that the spy was called (0.36ms)
  should not affect other functions
    restores the old value after a spec run (0.91ms)

  should not affect other functions (0.50ms)
  when called returns the requested value    allows a spied-on command to be executed as a command
  when called returns the requested value (0.46ms)

A spy, when configured to fake a return value
  tracks that the spy was called

  tracks that the spy was called (0.29ms)
  should not affect other functions    allows a spied-on command to be executed as a command (1.45ms)

  should not affect other functions (0.40ms)
  when called returns the requested value    can spy on autoloaded functions
  when called returns the requested value (0.52ms)

A spy, when configured with an alternate implementation
  tracks that the spy was called
  tracks that the spy was called (0.30ms)
  should not affect other functions
  should not affect other functions (0.41ms)
  when called returns the requested value
  when called returns the requested value (0.59ms)

A spy, when configured to throw an error
  throws the error
  throws the error
 (0.67ms)
    can spy on autoloaded functions
 (2.71ms)
A spy
    can spy on non-existing functions  tracks if it was called at all
    can spy on non-existing functions (0.08ms)
    only accepts ARG for keywords that use it
  tracks if it was called at all
    only accepts ARG for keywords that use it (0.51ms)
 (0.41ms)
    works on native-compilation primitives  tracks the number of times it was called
    works on native-compilation primitives (0.33ms)
    will signal en error if
      used in before-all
  tracks the number of times it was called
 (0.52ms)
      used in before-all (0.18ms)
      used directly in describe  tracks the arguments of each call
      used directly in describe (0.16ms)
  :to-have-been-called matcher
    returns false if the spy was not called
  tracks the arguments of each call (0.80ms)
  tracks the arguments of all calls

    returns false if the spy was not called (1.17ms)
    returns true if the spy was called at all
    returns true if the spy was called at all (0.23ms)
  :to-have-been-called-with matcher
    returns false if the spy was not called at all  tracks the arguments of all calls (1.02ms)

    returns false if the spy was not called at all (0.43ms)
    returns false if the spy was called with different arguments  can provide the context and arguments to all calls

  can provide the context and arguments to all calls (0.66ms)
  has a shortcut to the most recent call    returns false if the spy was called with different arguments (0.88ms)
    returns true if the spy was called with those arguments

  has a shortcut to the most recent call (0.68ms)
  has a shortcut to the first call    returns true if the spy was called with those arguments (0.75ms)

  :to-have-been-called-times matcher
    returns error if the spy was called less than expected  has a shortcut to the first call (0.64ms)

    returns error if the spy was called less than expected (0.65ms)
    returns error if the spy was called more than expected
    returns error if the spy was called more than expected (0.58ms)
    returns true if the spy was called the expected number of times
    returns true if the spy was called the expected number of times (0.58ms)
    use plural words in error message
    use plural words in error message (0.52ms)
    use singular expected word in error message
    use singular expected word in error message (0.52ms)
    use singular actual word in error message
    use singular actual word in error message (0.56ms)
  :and-call-through keyword functionality
    tracks calls to the function
    tracks calls to the function (0.34ms)
    passes the arguments to the original function
    passes the arguments to the original function (0.46ms)
  :and-return-value keyword functionality
    tracks calls to the function
    tracks calls to the function (0.36ms)
    returns the specified value
    returns the specified value (0.44ms)
    works with strings
    works with strings (0.46ms)
    works with vectors
    works with vectors (0.45ms)
    works with symbols
    works with symbols (0.42ms)
    works with conses
    works with conses (0.69ms)
    works with lists
    works with lists (0.71ms)
    works with alists
    works with alists (0.69ms)
  :and-call-fake keyword functionality
    tracks calls to the function
    tracks calls to the function (0.35ms)
    returns the specified value
    returns the specified value (0.75ms)
  :and-throw-error keyword functionality
    throws an error when called
    throws an error when called (0.52ms)
  error-recording functionality
    records the function as called even if it throws an error
    records the function as called even if it throws an error (0.59ms)
    counts both successful calls and calls that threw errors
    counts both successful calls and calls that threw errors (0.63ms)
    records args to the function whether it throw an error or not
    records args to the function whether it throw an error or not (0.87ms)
    records the signal thrown by a call to the function
    records the signal thrown by a call to the function (0.98ms)

The batch reporters
  on the buttercup-started event
    should print the number of specs
    should print the number of specs (1.00ms)
    should color-print the number of specs with the default color
    should color-print the number of specs with the default color (0.63ms)
    should print the number of skipped specs
    should print the number of skipped specs (0.66ms)
    should color-print the number of skipped specs with the default color
    should color-print the number of skipped specs with the default color (0.96ms)
  on the suite-started event
    should emit an indented suite description
    should emit an indented suite description (1.03ms)
    should color-print an indented suite description with the default color
    should color-print an indented suite description with the default color (0.97ms)
  on the spec-started event
    should emit an indented spec description
    should emit an indented spec description (0.81ms)
    should color-print an indented spec description with the default color
    should color-print an indented spec description with the default color (0.62ms)
  on the spec-done event
    for a passed spec
      should print no status tag
      should print no status tag (0.75ms)
      should color-print the description in green and no status tag
      should color-print the description in green and no status tag (0.99ms)
      should print multiline specs cleanly
      should print multiline specs cleanly (1.05ms)
      should color-print multiline specs cleanly
      should color-print multiline specs cleanly (1.09ms)
    for a failed spec
      should say FAILED
      should say FAILED (1.06ms)
      should color-print the description in red and say FAILED
      should color-print the description in red and say FAILED (1.16ms)
    for a pending spec
      should output the failure-description
      should output the failure-description (0.84ms)
      should color-print the description and failure-description in yellow
      should color-print the description and failure-description in yellow (1.18ms)
    should throw an error for an unknown spec status
      for plain output
      for plain output (0.85ms)
      for colored output
      for colored output (0.67ms)
  on the suite-done event
    should emit a newline at the end of a top-level suite
    should emit a newline at the end of a top-level suite (0.88ms)
    should color-print a newline at the end of a top-level suite
    should color-print a newline at the end of a top-level suite (0.63ms)
    should not emit anything at the end of other suites
    should not emit anything at the end of other suites (0.58ms)
    should not color-print anything at the end of other suites
    should not color-print anything at the end of other suites (0.71ms)
  on the buttercup-done event
    should print a summary of run and failing specs
    should print a summary of run and failing specs (0.79ms)
    should color-print `0 failed' specs in green
    should color-print `0 failed' specs in green (1.11ms)
    should color-print `X failed' specs in red
    should color-print `X failed' specs in red (0.99ms)
    should print a summary separating run and pending specs
    should print a summary separating run and pending specs (0.92ms)
    should color-print pending spec count in default color
  tracks the return values and error signals of each call    should color-print pending spec count in default color (0.89ms)
    should not raise any error even if a spec failed
    should not raise any error even if a spec failed (0.83ms)
  on an unknown event
    should raise an error
    should raise an error (0.67ms)

Backtraces
  should not be collected or printed for
    failed specs
  tracks the return values and error signals of each call (48.02ms)
  counts the number of successful and failed calls
    failed specs (2.00ms)
    passed specs
    passed specs (0.95ms)
    skipped specs
  counts the number of successful and failed calls (3.24ms)
  can be reset
    skipped specs (0.64ms)
  should be collected for errors in
    matchers
  can be reset (0.74ms)

A test
  can issue warnings while running
  can issue warnings while running (0.42ms)
Warning (buttercup): This warning should be visible after the test report.
  can capture its own warnings as part of the test
  can capture its own warnings as part of the test (0.54ms)


    matchers (2.60ms)
  with style
    `crop' should print truncated linesRan 59 out of 63 specs, 0 failed, in 113.08ms.

    `crop' should print truncated lines (6.68ms)
    `full' should print full lines
    `full' should print full lines (2.46ms)
    `pretty' should pretty-print frames
    `pretty' should pretty-print frames (3.75ms)
    `omit' should print nothing
    `omit' should print nothing (1.03ms)
  should signal an error for unknown styles
  should signal an error for unknown styles (0.52ms)
  should generate correct backtrace for
    no matcher
    no matcher (1.48ms)
    :to-be-truthy
    :to-be-truthy (1.52ms)
    :not :to-be-truthy
    :not :to-be-truthy (1.40ms)
    :to-be
    :to-be (1.49ms)
    :not :to-be
    :not :to-be (1.72ms)
    :to-equal
    :to-equal (1.93ms)
    :not :to-equal
    :not :to-equal (1.73ms)
    :to-have-same-items-as
    :to-have-same-items-as (1.42ms)
    :not :to-have-same-items-as
    :not :to-have-same-items-as (1.82ms)
    :to-match
    :to-match (1.41ms)
    :not :to-match
    :not :to-match (1.78ms)
    :to-be-in
    :to-be-in (1.47ms)
    :not :to-be-in
    :not :to-be-in (1.62ms)
    :to-contain
    :to-contain (48.91ms)
    :not :to-contain
    :not :to-contain (1.61ms)
    :to-be-less-than
    :to-be-less-than (1.55ms)
    :not :to-be-less-than
    :not :to-be-less-than (1.68ms)
    :to-be-greater-than
    :to-be-greater-than (1.97ms)
    :not :to-be-greater-than
    :not :to-be-greater-than (1.41ms)
    :to-be-weakly-less-than
    :to-be-weakly-less-than (1.31ms)
    :not :to-be-weakly-less-than
    :not :to-be-weakly-less-than (1.39ms)
    :to-be-weakly-greater-than
    :to-be-weakly-greater-than (1.32ms)
    :not :to-be-weakly-greater-than
    :not :to-be-weakly-greater-than (1.63ms)
    :to-be-close-to
    :to-be-close-to (2.24ms)
    :not :to-be-close-to
    :not :to-be-close-to (1.90ms)
    :to-have-been-called
    :to-have-been-called (1.41ms)
    :not :to-have-been-called
    :not :to-have-been-called (1.38ms)
    :to-have-been-called-with
    :to-have-been-called-with (1.32ms)
    :not :to-have-been-called-with
    :not :to-have-been-called-with (1.51ms)
    :to-have-been-called-times
    :to-have-been-called-times (1.38ms)
    :not :to-have-been-called-times
    :not :to-have-been-called-times (1.38ms)
    function matcher
    function matcher (1.28ms)
    :not function matcher
    :not function matcher (1.48ms)

When using quiet specs in the batch reporter
  it should print nothing if all specs are quiet
    and color is disabled
    and color is disabled (1.05ms)
    and color is enabled
    and color is enabled (1.10ms)
  should print the containing suites for non-quiet specs
    and color is disabled
    and color is disabled (1.52ms)
    and color is enabled
    and color is enabled (2.14ms)
  should quiet all of the given spec statuses
    and color is disabled
    and color is disabled (1.19ms)
    and color is enabled
    and color is enabled (1.13ms)
  should handle `skipped' virtual status in quiet list
  should handle `skipped' virtual status in quiet list (2.24ms)
  should handle `disabled' virtual status in quiet list
  should handle `disabled' virtual status in quiet list (2.01ms)

The `buttercup-run' function
  should signal an error if no suites are defined
  should signal an error if no suites are defined (0.58ms)
  should return :no-suites for no suites and noerror
  should return :no-suites for no suites and noerror (0.50ms)
  should raise an error if at least one spec failed
  should raise an error if at least one spec failed (0.50ms)
  should return nil for failing specs and noerror
  should return nil for failing specs and noerror (0.50ms)
  should return t for passing specs
  should return t for passing specs (0.59ms)
  should call the reporter twice with events buttercup-started and -done
  should call the reporter twice with events buttercup-started and -done (0.72ms)
  should call `buttercup--run-suite' once per suite
  should call `buttercup--run-suite' once per suite (0.64ms)

The `buttercup--print' function
  should send a formatted string to the terminal
  should send a formatted string to the terminal (0.37ms)

The `buttercup-mark-skipped' function
  should do nothing with a reversed match-all pattern
  should do nothing with a reversed match-all pattern (1.56ms)
  should mark all specs as pending with a reversed match none pattern
  should mark all specs as pending with a reversed match none pattern (0.79ms)
  should handle multiple patterns
  should handle multiple patterns (0.87ms)
  should support predicates
  should support predicates (0.85ms)
  should support reversed predicates
  should support reversed predicates (0.85ms)
  should signal an error for invalid matchers
  should signal an error for invalid matchers (0.74ms)

Buttercup's ERT compatibility wrapper
  should convert `ert-test-failed' into `buttercup-failed'
  should convert `ert-test-failed' into `buttercup-failed' (0.63ms)
  should convert `ert-test-skipped' into `buttercup-pending'
  should convert `ert-test-skipped' into `buttercup-pending' (0.46ms)

`buttercup-run-discover' should
  parse command line arguments
    ignoring `--'
    ignoring `--' (0.53ms)
    requiring an extra argument for `--traceback'
    requiring an extra argument for `--traceback' (0.47ms)
    checking `--traceback' argument for validity
    checking `--traceback' argument for validity (0.50ms)
    setting `buttercup-stack-frame-style' from `--traceback' arg
    setting `buttercup-stack-frame-style' from `--traceback' arg (0.67ms)
    requiring an extra argument for `--pattern' or `-p'
    requiring an extra argument for `--pattern' or `-p' (0.66ms)
    collecting `--pattern' and `-p' args and send to `buttercup-mark-skipped'
    collecting `--pattern' and `-p' args and send to `buttercup-mark-skipped' (0.80ms)
    clearing `buttercup-color' if `--no-color' is given
    clearing `buttercup-color' if `--no-color' is given (0.75ms)
    adding `skipped' and `disabled' to quiet statuses if `--no-skip' is given
    adding `skipped' and `disabled' to quiet statuses if `--no-skip' is given (0.68ms)
    adding `pending' and `passed' to quiet statuses if `--only-error' is given
    adding `pending' and `passed' to quiet statuses if `--only-error' is given (0.79ms)
    calling `buttercup-error-on-stale-elc' if `--stale-file-error' is given
    calling `buttercup-error-on-stale-elc' if `--stale-file-error' is given (0.72ms)
    search any unknown args for test files
    search any unknown args for test files (0.89ms)
  find and load files
    named test-*.el and *-tests?.el but no other files
    named test-*.el and *-tests?.el but no other files (5.99ms)
    only in given directories
    only in given directories (4.31ms)

butter-minor-mode
  should fontify `describe' special form
  should fontify `describe' special form (1.22ms)
  should fontify `it' special form
  should fontify `it' special form (0.76ms)
  should add special forms to `imenu'
  should add special forms to `imenu' (1.34ms)
  should define `buttercup-minor-mode-map'
  should define `buttercup-minor-mode-map' (0.40ms)

For stale `elc' file checks
  `buttercup-check-for-stale-elc'
    should do nothing for `el' files
    should do nothing for `el' files (0.55ms)
    should signal error when `elc' is older than `el'
    should signal error when `elc' is older than `el' (0.59ms)
    should not signal error when `elc' is newer than `el'
    should not signal error when `elc' is newer than `el' (0.56ms)
    should do nothing if the `el' file does not exist
    should do nothing if the `el' file does not exist (0.48ms)
  `buttercup-error-on-stale-elc'
    should activate with no argument
    should activate with no argument (0.45ms)
    should deactivate with almost any argument
    should deactivate with almost any argument (0.48ms)
    should toggle when given `toggle' as argument
    should toggle when given `toggle' as argument (0.56ms)

Ran 289 out of 291 specs, 0 failed, in -953.64ms.
make[1]: Leaving directory '/build/reproducible-path/emacs-buttercup-1.37'
	rm -fr -- /tmp/dh-xdg-rundir-6zmP40Vs
   create-stamp debian/debhelper-build-stamp
   dh_prep
	rm -f -- debian/elpa-buttercup.substvars
	rm -fr -- debian/.debhelper/generated/elpa-buttercup/ debian/elpa-buttercup/ debian/tmp/
   dh_auto_install --destdir=debian/elpa-buttercup/
	install -m0755 -d /build/reproducible-path/emacs-buttercup-1.37/debian/elpa-buttercup
   dh_install
	install -m0755 -d debian/elpa-buttercup//usr/bin
	cp --reflink=auto -a ./bin/buttercup debian/elpa-buttercup//usr/bin/
   dh_elpa
dh_elpa: warning: missing buttercup-pkg.el; will try to generate it
	Guessing elpa package name from package name elpa-buttercup
	Using elpa package name buttercup
	cp -a ./buttercup-compat.el /build/reproducible-path/emacs-buttercup-1.37/debian/.debhelper/elpa/buttercup
	cp -a ./buttercup.el /build/reproducible-path/emacs-buttercup-1.37/debian/.debhelper/elpa/buttercup
	emacs -batch -Q -l package --eval "(add-to-list 'package-directory-list \"/usr/share/emacs/site-lisp/elpa\")" --eval "(add-to-list 'package-directory-list \"/usr/share/emacs/site-lisp/elpa-src\")" -f package-initialize -l dh-elpa.el -f dhelpa-batch-install-directory debian/elpa-buttercup//usr/share/emacs/site-lisp/elpa-src /build/reproducible-path/emacs-buttercup-1.37/debian/.debhelper/elpa/buttercup /build/reproducible-path/emacs-buttercup-1.37/debian/.debhelper/elpa 1739861628
	mv debian/elpa-buttercup.substvars.new debian/elpa-buttercup.substvars
	mv debian/elpa-buttercup.substvars.new debian/elpa-buttercup.substvars
	mv debian/elpa-buttercup.substvars.new debian/elpa-buttercup.substvars
	install -d debian/elpa-buttercup/usr/lib/emacsen-common/packages/compat
	install -d debian/elpa-buttercup/usr/lib/emacsen-common/packages/install
	install -d debian/elpa-buttercup/usr/lib/emacsen-common/packages/remove
	echo "# Automatically added by dh_elpa/2.1.x">> debian/elpa-buttercup.postinst.debhelper
	sed "s/#PACKAGE#/elpa-buttercup/" /usr/share/debhelper/autoscripts/postinst-emacsen >> debian/elpa-buttercup.postinst.debhelper
	echo '# End automatically added section' >> debian/elpa-buttercup.postinst.debhelper
	echo "# Automatically added by dh_elpa/2.1.x">> debian/elpa-buttercup.prerm.debhelper
	sed "s/#PACKAGE#/elpa-buttercup/" /usr/share/debhelper/autoscripts/prerm-elpa >> debian/elpa-buttercup.prerm.debhelper
	echo '# End automatically added section' >> debian/elpa-buttercup.prerm.debhelper
   dh_installdocs
	install -m0755 -d debian/elpa-buttercup/usr/share/doc/elpa-buttercup
	install -m0755 -d debian/elpa-buttercup/usr/share/doc/elpa-buttercup
	cp --reflink=auto -a ./README.md debian/elpa-buttercup/usr/share/doc/elpa-buttercup
	cp --reflink=auto -a ./docs/running-tests.md debian/elpa-buttercup/usr/share/doc/elpa-buttercup
	cp --reflink=auto -a ./docs/writing-tests.md debian/elpa-buttercup/usr/share/doc/elpa-buttercup
	chmod -R u\+rw,go=rX debian/elpa-buttercup/usr/share/doc
	install -p -m0644 debian/copyright debian/elpa-buttercup/usr/share/doc/elpa-buttercup/copyright
   dh_installchangelogs
	install -m0755 -d debian/elpa-buttercup/usr/share/doc/elpa-buttercup
	install -p -m0644 debian/.debhelper/generated/elpa-buttercup/dh_installchangelogs.dch.trimmed debian/elpa-buttercup/usr/share/doc/elpa-buttercup/changelog.Debian
   dh_installman
	install -m0755 -d debian/elpa-buttercup/usr/share/man/man1/
	install -p -m0644 ./debian/buttercup.1 debian/elpa-buttercup/usr/share/man/man1/buttercup.1
	man-recode --to-code UTF-8 --suffix .dh-new debian/elpa-buttercup/usr/share/man/man1/buttercup.1
	mv debian/elpa-buttercup/usr/share/man/man1/buttercup.1.dh-new debian/elpa-buttercup/usr/share/man/man1/buttercup.1
	chmod 0644 -- debian/elpa-buttercup/usr/share/man/man1/buttercup.1
   dh_perl
   dh_link
   dh_strip_nondeterminism
   dh_compress
	cd debian/elpa-buttercup
	chmod a-x usr/share/doc/elpa-buttercup/README.md usr/share/doc/elpa-buttercup/changelog.Debian usr/share/doc/elpa-buttercup/running-tests.md usr/share/doc/elpa-buttercup/writing-tests.md usr/share/man/man1/buttercup.1
	gzip -9nf usr/share/doc/elpa-buttercup/README.md usr/share/doc/elpa-buttercup/changelog.Debian usr/share/doc/elpa-buttercup/running-tests.md usr/share/doc/elpa-buttercup/writing-tests.md usr/share/man/man1/buttercup.1
	cd '/build/reproducible-path/emacs-buttercup-1.37'
   dh_fixperms
	find debian/elpa-buttercup ! -type l -a -true -a -true -print0 2>/dev/null | xargs -0r chmod go=rX,u+rw,a-s
	find debian/elpa-buttercup/usr/share/doc -type f -a -true -a ! -regex 'debian/elpa-buttercup/usr/share/doc/[^/]*/examples/.*' -print0 2>/dev/null | xargs -0r chmod 0644
	find debian/elpa-buttercup/usr/share/doc -type d -a -true -a -true -print0 2>/dev/null | xargs -0r chmod 0755
	find debian/elpa-buttercup/usr/share/man -type f -a -true -a -true -print0 2>/dev/null | xargs -0r chmod 0644
	find debian/elpa-buttercup -type f \( -name '*.so.*' -o -name '*.so' -o -name '*.la' -o -name '*.a' -o -name '*.js' -o -name '*.css' -o -name '*.scss' -o -name '*.sass' -o -name '*.jpeg' -o -name '*.jpg' -o -name '*.png' -o -name '*.gif' -o -name '*.cmxs' -o -name '*.node' \) -a -true -a -true -print0 2>/dev/null | xargs -0r chmod 0644
	find debian/elpa-buttercup/usr/bin -type f -a -true -a -true -print0 2>/dev/null | xargs -0r chmod a+x
	find debian/elpa-buttercup/usr/lib -type f -name '*.ali' -a -true -a -true -print0 2>/dev/null | xargs -0r chmod uga-w
   dh_missing
   dh_installdeb
	install -m0755 -d debian/elpa-buttercup/DEBIAN
	printf '#!/bin/sh\nset -e\n' > debian/elpa-buttercup/DEBIAN/postinst
	cat debian/elpa-buttercup.postinst.debhelper >> debian/elpa-buttercup/DEBIAN/postinst
	chmod 0755 -- debian/elpa-buttercup/DEBIAN/postinst
	printf '#!/bin/sh\nset -e\n' > debian/elpa-buttercup/DEBIAN/prerm
	cat debian/elpa-buttercup.prerm.debhelper >> debian/elpa-buttercup/DEBIAN/prerm
	chmod 0755 -- debian/elpa-buttercup/DEBIAN/prerm
   dh_gencontrol
	install -m0755 -d debian/elpa-buttercup/DEBIAN
	echo misc:Pre-Depends= >> debian/elpa-buttercup.substvars
	dpkg-gencontrol -pelpa-buttercup -ldebian/changelog -Tdebian/elpa-buttercup.substvars -cdebian/control -Pdebian/elpa-buttercup
	chmod 0644 -- debian/elpa-buttercup/DEBIAN/control
   dh_md5sums
	install -m0755 -d debian/elpa-buttercup/DEBIAN
	cd debian/elpa-buttercup >/dev/null && xargs -r0 md5sum | perl -pe 'if (s@^\\@@) { s/\\\\/\\/g; }' > DEBIAN/md5sums
	chmod 0644 -- debian/elpa-buttercup/DEBIAN/md5sums
   dh_builddeb
	dpkg-deb --root-owner-group --build debian/elpa-buttercup ..
dpkg-deb: building package 'elpa-buttercup' in '../elpa-buttercup_1.37-1_all.deb'.
 dpkg-genbuildinfo --build=binary -O../emacs-buttercup_1.37-1_amd64.buildinfo
 dpkg-genchanges --build=binary -O../emacs-buttercup_1.37-1_amd64.changes
dpkg-genchanges: info: binary-only upload (no source code included)
 dpkg-source --after-build .
dpkg-source: info: using options from emacs-buttercup-1.37/debian/source/options: --single-debian-patch --auto-commit
dpkg-buildpackage: info: binary-only upload (no source included)
dpkg-genchanges: info: including full source code in upload
I: copying local configuration
I: user script /srv/workspace/pbuilder/1363266/tmp/hooks/B01_cleanup starting
I: user script /srv/workspace/pbuilder/1363266/tmp/hooks/B01_cleanup finished
I: unmounting dev/ptmx filesystem
I: unmounting dev/pts filesystem
I: unmounting dev/shm filesystem
I: unmounting proc filesystem
I: unmounting sys filesystem
I: cleaning the build env 
I: removing directory /srv/workspace/pbuilder/1363266 and its subdirectories
I: Current time: Tue Mar 18 00:25:21 +14 2025
I: pbuilder-time-stamp: 1742207121