I: pbuilder: network access will be disabled during build
I: Current time: Thu Jan 30 18:52:46 +14 2025
I: pbuilder-time-stamp: 1738212766
I: Building the build Environment
I: extracting base tarball [/var/cache/pbuilder/trixie-reproducible-base.tgz]
I: copying local configuration
W: --override-config is not set; not updating apt.conf Read the manpage for details.
I: mounting /proc filesystem
I: mounting /sys filesystem
I: creating /{dev,run}/shm
I: mounting /dev/pts filesystem
I: redirecting /dev/ptmx to /dev/pts/ptmx
I: policy-rc.d already exists
I: Copying source file
I: copying [cpuinfo_0.0~git20250110.8a1772a-1.dsc]
I: copying [./cpuinfo_0.0~git20250110.8a1772a.orig.tar.xz]
I: copying [./cpuinfo_0.0~git20250110.8a1772a-1.debian.tar.xz]
I: Extracting source
dpkg-source: warning: cannot verify inline signature for ./cpuinfo_0.0~git20250110.8a1772a-1.dsc: unsupported subcommand
dpkg-source: info: extracting cpuinfo in cpuinfo-0.0~git20250110.8a1772a
dpkg-source: info: unpacking cpuinfo_0.0~git20250110.8a1772a.orig.tar.xz
dpkg-source: info: unpacking cpuinfo_0.0~git20250110.8a1772a-1.debian.tar.xz
dpkg-source: info: using patch list from debian/patches/series
dpkg-source: info: applying cmake-soversion.patch
dpkg-source: info: applying Fix-cmake-config-install.patch
dpkg-source: info: applying fix-ftbts-implicit-function-syscall.patch
I: Not using root during the build.
I: Installing the build-deps
I: user script /srv/workspace/pbuilder/16425/tmp/hooks/D01_modify_environment starting
debug: Running on ff64a.
I: Changing host+domainname to test build reproducibility
I: Adding a custom variable just for the fun of it...
I: Changing /bin/sh to bash
'/bin/sh' -> '/bin/bash'
lrwxrwxrwx 1 root root 9 Jan 30 04:53 /bin/sh -> /bin/bash
I: Setting pbuilder2's login shell to /bin/bash
I: Setting pbuilder2's GECOS to second user,second room,second work-phone,second home-phone,second other
I: user script /srv/workspace/pbuilder/16425/tmp/hooks/D01_modify_environment finished
I: user script /srv/workspace/pbuilder/16425/tmp/hooks/D02_print_environment starting
I: set
  BASH=/bin/sh
  BASHOPTS=checkwinsize:cmdhist:complete_fullquote:extquote:force_fignore:globasciiranges:globskipdots:hostcomplete:interactive_comments:patsub_replacement:progcomp:promptvars:sourcepath
  BASH_ALIASES=()
  BASH_ARGC=()
  BASH_ARGV=()
  BASH_CMDS=()
  BASH_LINENO=([0]="12" [1]="0")
  BASH_LOADABLES_PATH=/usr/local/lib/bash:/usr/lib/bash:/opt/local/lib/bash:/usr/pkg/lib/bash:/opt/pkg/lib/bash:.
  BASH_SOURCE=([0]="/tmp/hooks/D02_print_environment" [1]="/tmp/hooks/D02_print_environment")
  BASH_VERSINFO=([0]="5" [1]="2" [2]="37" [3]="1" [4]="release" [5]="arm-unknown-linux-gnueabihf")
  BASH_VERSION='5.2.37(1)-release'
  BUILDDIR=/build/reproducible-path
  BUILDUSERGECOS='second user,second room,second work-phone,second home-phone,second other'
  BUILDUSERNAME=pbuilder2
  BUILD_ARCH=armhf
  DEBIAN_FRONTEND=noninteractive
  DEB_BUILD_OPTIONS='buildinfo=+all reproducible=+all parallel=6 '
  DIRSTACK=()
  DISTRIBUTION=trixie
  EUID=0
  FUNCNAME=([0]="Echo" [1]="main")
  GROUPS=()
  HOME=/root
  HOSTNAME=i-capture-the-hostname
  HOSTTYPE=arm
  HOST_ARCH=armhf
  IFS=' 	
  '
  INVOCATION_ID=66dd5ad0db694193bc7c1a21acfa3ee4
  LANG=C
  LANGUAGE=it_CH:it
  LC_ALL=C
  MACHTYPE=arm-unknown-linux-gnueabihf
  MAIL=/var/mail/root
  OPTERR=1
  OPTIND=1
  OSTYPE=linux-gnueabihf
  PATH=/usr/sbin:/usr/bin:/sbin:/bin:/usr/games:/i/capture/the/path
  PBCURRENTCOMMANDLINEOPERATION=build
  PBUILDER_OPERATION=build
  PBUILDER_PKGDATADIR=/usr/share/pbuilder
  PBUILDER_PKGLIBDIR=/usr/lib/pbuilder
  PBUILDER_SYSCONFDIR=/etc
  PIPESTATUS=([0]="0")
  POSIXLY_CORRECT=y
  PPID=16425
  PS4='+ '
  PWD=/
  SHELL=/bin/bash
  SHELLOPTS=braceexpand:errexit:hashall:interactive-comments:posix
  SHLVL=3
  SUDO_COMMAND='/usr/bin/timeout -k 24.1h 24h /usr/bin/ionice -c 3 /usr/bin/nice -n 11 /usr/bin/unshare --uts -- /usr/sbin/pbuilder --build --configfile /srv/reproducible-results/rbuild-debian/r-b-build.adWlMLTm/pbuilderrc_89Uu --distribution trixie --hookdir /etc/pbuilder/rebuild-hooks --debbuildopts -b --basetgz /var/cache/pbuilder/trixie-reproducible-base.tgz --buildresult /srv/reproducible-results/rbuild-debian/r-b-build.adWlMLTm/b2 --logfile b2/build.log cpuinfo_0.0~git20250110.8a1772a-1.dsc'
  SUDO_GID=114
  SUDO_UID=109
  SUDO_USER=jenkins
  TERM=unknown
  TZ=/usr/share/zoneinfo/Etc/GMT-14
  UID=0
  USER=root
  _='I: set'
  http_proxy=http://10.0.0.15:3142/
I: uname -a
  Linux i-capture-the-hostname 6.1.0-30-arm64 #1 SMP Debian 6.1.124-1 (2025-01-12) aarch64 GNU/Linux
I: ls -l /bin
  lrwxrwxrwx 1 root root 7 Nov 22 14:40 /bin -> usr/bin
I: user script /srv/workspace/pbuilder/16425/tmp/hooks/D02_print_environment finished
 -> Attempting to satisfy build-dependencies
 -> Creating pbuilder-satisfydepends-dummy package
Package: pbuilder-satisfydepends-dummy
Version: 0.invalid.0
Architecture: armhf
Maintainer: Debian Pbuilder Team <pbuilder-maint@lists.alioth.debian.org>
Description: Dummy package to satisfy dependencies with aptitude - created by pbuilder
 This package was created automatically by pbuilder to satisfy the
 build-dependencies of the package being currently built.
Depends: cmake, debhelper-compat (= 13), googletest, ninja-build
dpkg-deb: building package 'pbuilder-satisfydepends-dummy' in '/tmp/satisfydepends-aptitude/pbuilder-satisfydepends-dummy.deb'.
Selecting previously unselected package pbuilder-satisfydepends-dummy.
(Reading database ... 19575 files and directories currently installed.)
Preparing to unpack .../pbuilder-satisfydepends-dummy.deb ...
Unpacking pbuilder-satisfydepends-dummy (0.invalid.0) ...
dpkg: pbuilder-satisfydepends-dummy: dependency problems, but configuring anyway as you requested:
 pbuilder-satisfydepends-dummy depends on cmake; however:
  Package cmake is not installed.
 pbuilder-satisfydepends-dummy depends on debhelper-compat (= 13); however:
  Package debhelper-compat is not installed.
 pbuilder-satisfydepends-dummy depends on googletest; however:
  Package googletest is not installed.
 pbuilder-satisfydepends-dummy depends on ninja-build; however:
  Package ninja-build is not installed.

Setting up pbuilder-satisfydepends-dummy (0.invalid.0) ...
Reading package lists...
Building dependency tree...
Reading state information...
Initializing package states...
Writing extended state information...
Building tag database...
pbuilder-satisfydepends-dummy is already installed at the requested version (0.invalid.0)
pbuilder-satisfydepends-dummy is already installed at the requested version (0.invalid.0)
The following NEW packages will be installed:
  autoconf{a} automake{a} autopoint{a} autotools-dev{a} bsdextrautils{a} cmake{a} cmake-data{a} debhelper{a} dh-autoreconf{a} dh-strip-nondeterminism{a} dwz{a} file{a} gettext{a} gettext-base{a} googletest{a} groff-base{a} intltool-debian{a} libarchive-zip-perl{a} libarchive13t64{a} libbrotli1{a} libcom-err2{a} libcurl4t64{a} libdebhelper-perl{a} libelf1t64{a} libexpat1{a} libffi8{a} libfile-stripnondeterminism-perl{a} libgnutls30t64{a} libgssapi-krb5-2{a} libicu72{a} libidn2-0{a} libjsoncpp26{a} libk5crypto3{a} libkeyutils1{a} libkrb5-3{a} libkrb5support0{a} libldap2{a} libmagic-mgc{a} libmagic1t64{a} libnghttp2-14{a} libp11-kit0{a} libpipeline1{a} libproc2-0{a} libpsl5t64{a} librhash1{a} librtmp1{a} libsasl2-2{a} libsasl2-modules-db{a} libssh2-1t64{a} libtasn1-6{a} libtool{a} libuchardet0{a} libunistring5{a} libuv1t64{a} libxml2{a} m4{a} man-db{a} ninja-build{a} po-debconf{a} procps{a} sensible-utils{a} 
The following packages are RECOMMENDED but will NOT be installed:
  ca-certificates curl krb5-locales libarchive-cpio-perl libldap-common libltdl-dev libmail-sendmail-perl libsasl2-modules linux-sysctl-defaults lynx psmisc publicsuffix wget 
0 packages upgraded, 61 newly installed, 0 to remove and 0 not upgraded.
Need to get 33.9 MB of archives. After unpacking 127 MB will be used.
Writing extended state information...
Get: 1 http://deb.debian.org/debian trixie/main armhf libproc2-0 armhf 2:4.0.4-6 [56.0 kB]
Get: 2 http://deb.debian.org/debian trixie/main armhf procps armhf 2:4.0.4-6 [864 kB]
Get: 3 http://deb.debian.org/debian trixie/main armhf sensible-utils all 0.0.24 [24.8 kB]
Get: 4 http://deb.debian.org/debian trixie/main armhf libmagic-mgc armhf 1:5.45-3+b1 [314 kB]
Get: 5 http://deb.debian.org/debian trixie/main armhf libmagic1t64 armhf 1:5.45-3+b1 [98.5 kB]
Get: 6 http://deb.debian.org/debian trixie/main armhf file armhf 1:5.45-3+b1 [42.3 kB]
Get: 7 http://deb.debian.org/debian trixie/main armhf gettext-base armhf 0.23.1-1 [238 kB]
Get: 8 http://deb.debian.org/debian trixie/main armhf libuchardet0 armhf 0.0.8-1+b2 [65.6 kB]
Get: 9 http://deb.debian.org/debian trixie/main armhf groff-base armhf 1.23.0-7 [1095 kB]
Get: 10 http://deb.debian.org/debian trixie/main armhf bsdextrautils armhf 2.40.4-1 [84.6 kB]
Get: 11 http://deb.debian.org/debian trixie/main armhf libpipeline1 armhf 1.5.8-1 [35.0 kB]
Get: 12 http://deb.debian.org/debian trixie/main armhf man-db armhf 2.13.0-1 [1382 kB]
Get: 13 http://deb.debian.org/debian trixie/main armhf m4 armhf 1.4.19-5 [272 kB]
Get: 14 http://deb.debian.org/debian trixie/main armhf autoconf all 2.72-3 [493 kB]
Get: 15 http://deb.debian.org/debian trixie/main armhf autotools-dev all 20220109.1 [51.6 kB]
Get: 16 http://deb.debian.org/debian trixie/main armhf automake all 1:1.16.5-1.3 [823 kB]
Get: 17 http://deb.debian.org/debian trixie/main armhf autopoint all 0.23.1-1 [770 kB]
Get: 18 http://deb.debian.org/debian trixie/main armhf cmake-data all 3.31.4-2 [2267 kB]
Get: 19 http://deb.debian.org/debian trixie/main armhf libicu72 armhf 72.1-6 [9086 kB]
Get: 20 http://deb.debian.org/debian trixie/main armhf libxml2 armhf 2.12.7+dfsg+really2.9.14-0.2+b1 [605 kB]
Get: 21 http://deb.debian.org/debian trixie/main armhf libarchive13t64 armhf 3.7.4-1.1 [306 kB]
Get: 22 http://deb.debian.org/debian trixie/main armhf libbrotli1 armhf 1.1.0-2+b6 [282 kB]
Get: 23 http://deb.debian.org/debian trixie/main armhf libkrb5support0 armhf 1.21.3-4 [30.3 kB]
Get: 24 http://deb.debian.org/debian trixie/main armhf libcom-err2 armhf 1.47.2-1 [23.3 kB]
Get: 25 http://deb.debian.org/debian trixie/main armhf libk5crypto3 armhf 1.21.3-4 [75.8 kB]
Get: 26 http://deb.debian.org/debian trixie/main armhf libkeyutils1 armhf 1.6.3-4 [8096 B]
Get: 27 http://deb.debian.org/debian trixie/main armhf libkrb5-3 armhf 1.21.3-4 [285 kB]
Get: 28 http://deb.debian.org/debian trixie/main armhf libgssapi-krb5-2 armhf 1.21.3-4 [116 kB]
Get: 29 http://deb.debian.org/debian trixie/main armhf libunistring5 armhf 1.3-1 [444 kB]
Get: 30 http://deb.debian.org/debian trixie/main armhf libidn2-0 armhf 2.3.7-2+b1 [125 kB]
Get: 31 http://deb.debian.org/debian trixie/main armhf libsasl2-modules-db armhf 2.1.28+dfsg1-8+b1 [18.6 kB]
Get: 32 http://deb.debian.org/debian trixie/main armhf libsasl2-2 armhf 2.1.28+dfsg1-8+b1 [50.6 kB]
Get: 33 http://deb.debian.org/debian trixie/main armhf libldap2 armhf 2.6.9+dfsg-1 [167 kB]
Get: 34 http://deb.debian.org/debian trixie/main armhf libnghttp2-14 armhf 1.64.0-1 [62.9 kB]
Get: 35 http://deb.debian.org/debian trixie/main armhf libpsl5t64 armhf 0.21.2-1.1+b1 [55.8 kB]
Get: 36 http://deb.debian.org/debian trixie/main armhf libffi8 armhf 3.4.6-1 [20.0 kB]
Get: 37 http://deb.debian.org/debian trixie/main armhf libp11-kit0 armhf 0.25.5-3 [385 kB]
Get: 38 http://deb.debian.org/debian trixie/main armhf libtasn1-6 armhf 4.19.0-3+b3 [43.9 kB]
Get: 39 http://deb.debian.org/debian trixie/main armhf libgnutls30t64 armhf 3.8.8-2 [1370 kB]
Get: 40 http://deb.debian.org/debian trixie/main armhf librtmp1 armhf 2.4+20151223.gitfa8646d.1-2+b5 [53.2 kB]
Get: 41 http://deb.debian.org/debian trixie/main armhf libssh2-1t64 armhf 1.11.1-1 [227 kB]
Get: 42 http://deb.debian.org/debian trixie/main armhf libcurl4t64 armhf 8.11.1-1+b1 [304 kB]
Get: 43 http://deb.debian.org/debian trixie/main armhf libexpat1 armhf 2.6.4-1 [83.5 kB]
Get: 44 http://deb.debian.org/debian trixie/main armhf libjsoncpp26 armhf 1.9.6-3 [69.9 kB]
Get: 45 http://deb.debian.org/debian trixie/main armhf librhash1 armhf 1.4.5-1 [143 kB]
Get: 46 http://deb.debian.org/debian trixie/main armhf libuv1t64 armhf 1.48.0-7 [134 kB]
Get: 47 http://deb.debian.org/debian trixie/main armhf cmake armhf 3.31.4-2 [5912 kB]
Get: 48 http://deb.debian.org/debian trixie/main armhf libdebhelper-perl all 13.24.1 [90.9 kB]
Get: 49 http://deb.debian.org/debian trixie/main armhf libtool all 2.5.4-2 [539 kB]
Get: 50 http://deb.debian.org/debian trixie/main armhf dh-autoreconf all 20 [17.1 kB]
Get: 51 http://deb.debian.org/debian trixie/main armhf libarchive-zip-perl all 1.68-1 [104 kB]
Get: 52 http://deb.debian.org/debian trixie/main armhf libfile-stripnondeterminism-perl all 1.14.1-1 [19.6 kB]
Get: 53 http://deb.debian.org/debian trixie/main armhf dh-strip-nondeterminism all 1.14.1-1 [8584 B]
Get: 54 http://deb.debian.org/debian trixie/main armhf libelf1t64 armhf 0.192-4 [184 kB]
Get: 55 http://deb.debian.org/debian trixie/main armhf dwz armhf 0.15-1+b2 [106 kB]
Get: 56 http://deb.debian.org/debian trixie/main armhf gettext armhf 0.23.1-1 [1560 kB]
Get: 57 http://deb.debian.org/debian trixie/main armhf intltool-debian all 0.35.0+20060710.6 [22.9 kB]
Get: 58 http://deb.debian.org/debian trixie/main armhf po-debconf all 1.0.21+nmu1 [248 kB]
Get: 59 http://deb.debian.org/debian trixie/main armhf debhelper all 13.24.1 [920 kB]
Get: 60 http://deb.debian.org/debian trixie/main armhf googletest all 1.15.2-1 [514 kB]
Get: 61 http://deb.debian.org/debian trixie/main armhf ninja-build armhf 1.12.1-1 [125 kB]
Fetched 33.9 MB in 1s (34.6 MB/s)
Preconfiguring packages ...
Selecting previously unselected package libproc2-0:armhf.
(Reading database ... 
(Reading database ... 5%
(Reading database ... 10%
(Reading database ... 15%
(Reading database ... 20%
(Reading database ... 25%
(Reading database ... 30%
(Reading database ... 35%
(Reading database ... 40%
(Reading database ... 45%
(Reading database ... 50%
(Reading database ... 55%
(Reading database ... 60%
(Reading database ... 65%
(Reading database ... 70%
(Reading database ... 75%
(Reading database ... 80%
(Reading database ... 85%
(Reading database ... 90%
(Reading database ... 95%
(Reading database ... 100%
(Reading database ... 19575 files and directories currently installed.)
Preparing to unpack .../00-libproc2-0_2%3a4.0.4-6_armhf.deb ...
Unpacking libproc2-0:armhf (2:4.0.4-6) ...
Selecting previously unselected package procps.
Preparing to unpack .../01-procps_2%3a4.0.4-6_armhf.deb ...
Unpacking procps (2:4.0.4-6) ...
Selecting previously unselected package sensible-utils.
Preparing to unpack .../02-sensible-utils_0.0.24_all.deb ...
Unpacking sensible-utils (0.0.24) ...
Selecting previously unselected package libmagic-mgc.
Preparing to unpack .../03-libmagic-mgc_1%3a5.45-3+b1_armhf.deb ...
Unpacking libmagic-mgc (1:5.45-3+b1) ...
Selecting previously unselected package libmagic1t64:armhf.
Preparing to unpack .../04-libmagic1t64_1%3a5.45-3+b1_armhf.deb ...
Unpacking libmagic1t64:armhf (1:5.45-3+b1) ...
Selecting previously unselected package file.
Preparing to unpack .../05-file_1%3a5.45-3+b1_armhf.deb ...
Unpacking file (1:5.45-3+b1) ...
Selecting previously unselected package gettext-base.
Preparing to unpack .../06-gettext-base_0.23.1-1_armhf.deb ...
Unpacking gettext-base (0.23.1-1) ...
Selecting previously unselected package libuchardet0:armhf.
Preparing to unpack .../07-libuchardet0_0.0.8-1+b2_armhf.deb ...
Unpacking libuchardet0:armhf (0.0.8-1+b2) ...
Selecting previously unselected package groff-base.
Preparing to unpack .../08-groff-base_1.23.0-7_armhf.deb ...
Unpacking groff-base (1.23.0-7) ...
Selecting previously unselected package bsdextrautils.
Preparing to unpack .../09-bsdextrautils_2.40.4-1_armhf.deb ...
Unpacking bsdextrautils (2.40.4-1) ...
Selecting previously unselected package libpipeline1:armhf.
Preparing to unpack .../10-libpipeline1_1.5.8-1_armhf.deb ...
Unpacking libpipeline1:armhf (1.5.8-1) ...
Selecting previously unselected package man-db.
Preparing to unpack .../11-man-db_2.13.0-1_armhf.deb ...
Unpacking man-db (2.13.0-1) ...
Selecting previously unselected package m4.
Preparing to unpack .../12-m4_1.4.19-5_armhf.deb ...
Unpacking m4 (1.4.19-5) ...
Selecting previously unselected package autoconf.
Preparing to unpack .../13-autoconf_2.72-3_all.deb ...
Unpacking autoconf (2.72-3) ...
Selecting previously unselected package autotools-dev.
Preparing to unpack .../14-autotools-dev_20220109.1_all.deb ...
Unpacking autotools-dev (20220109.1) ...
Selecting previously unselected package automake.
Preparing to unpack .../15-automake_1%3a1.16.5-1.3_all.deb ...
Unpacking automake (1:1.16.5-1.3) ...
Selecting previously unselected package autopoint.
Preparing to unpack .../16-autopoint_0.23.1-1_all.deb ...
Unpacking autopoint (0.23.1-1) ...
Selecting previously unselected package cmake-data.
Preparing to unpack .../17-cmake-data_3.31.4-2_all.deb ...
Unpacking cmake-data (3.31.4-2) ...
Selecting previously unselected package libicu72:armhf.
Preparing to unpack .../18-libicu72_72.1-6_armhf.deb ...
Unpacking libicu72:armhf (72.1-6) ...
Selecting previously unselected package libxml2:armhf.
Preparing to unpack .../19-libxml2_2.12.7+dfsg+really2.9.14-0.2+b1_armhf.deb ...
Unpacking libxml2:armhf (2.12.7+dfsg+really2.9.14-0.2+b1) ...
Selecting previously unselected package libarchive13t64:armhf.
Preparing to unpack .../20-libarchive13t64_3.7.4-1.1_armhf.deb ...
Unpacking libarchive13t64:armhf (3.7.4-1.1) ...
Selecting previously unselected package libbrotli1:armhf.
Preparing to unpack .../21-libbrotli1_1.1.0-2+b6_armhf.deb ...
Unpacking libbrotli1:armhf (1.1.0-2+b6) ...
Selecting previously unselected package libkrb5support0:armhf.
Preparing to unpack .../22-libkrb5support0_1.21.3-4_armhf.deb ...
Unpacking libkrb5support0:armhf (1.21.3-4) ...
Selecting previously unselected package libcom-err2:armhf.
Preparing to unpack .../23-libcom-err2_1.47.2-1_armhf.deb ...
Unpacking libcom-err2:armhf (1.47.2-1) ...
Selecting previously unselected package libk5crypto3:armhf.
Preparing to unpack .../24-libk5crypto3_1.21.3-4_armhf.deb ...
Unpacking libk5crypto3:armhf (1.21.3-4) ...
Selecting previously unselected package libkeyutils1:armhf.
Preparing to unpack .../25-libkeyutils1_1.6.3-4_armhf.deb ...
Unpacking libkeyutils1:armhf (1.6.3-4) ...
Selecting previously unselected package libkrb5-3:armhf.
Preparing to unpack .../26-libkrb5-3_1.21.3-4_armhf.deb ...
Unpacking libkrb5-3:armhf (1.21.3-4) ...
Selecting previously unselected package libgssapi-krb5-2:armhf.
Preparing to unpack .../27-libgssapi-krb5-2_1.21.3-4_armhf.deb ...
Unpacking libgssapi-krb5-2:armhf (1.21.3-4) ...
Selecting previously unselected package libunistring5:armhf.
Preparing to unpack .../28-libunistring5_1.3-1_armhf.deb ...
Unpacking libunistring5:armhf (1.3-1) ...
Selecting previously unselected package libidn2-0:armhf.
Preparing to unpack .../29-libidn2-0_2.3.7-2+b1_armhf.deb ...
Unpacking libidn2-0:armhf (2.3.7-2+b1) ...
Selecting previously unselected package libsasl2-modules-db:armhf.
Preparing to unpack .../30-libsasl2-modules-db_2.1.28+dfsg1-8+b1_armhf.deb ...
Unpacking libsasl2-modules-db:armhf (2.1.28+dfsg1-8+b1) ...
Selecting previously unselected package libsasl2-2:armhf.
Preparing to unpack .../31-libsasl2-2_2.1.28+dfsg1-8+b1_armhf.deb ...
Unpacking libsasl2-2:armhf (2.1.28+dfsg1-8+b1) ...
Selecting previously unselected package libldap2:armhf.
Preparing to unpack .../32-libldap2_2.6.9+dfsg-1_armhf.deb ...
Unpacking libldap2:armhf (2.6.9+dfsg-1) ...
Selecting previously unselected package libnghttp2-14:armhf.
Preparing to unpack .../33-libnghttp2-14_1.64.0-1_armhf.deb ...
Unpacking libnghttp2-14:armhf (1.64.0-1) ...
Selecting previously unselected package libpsl5t64:armhf.
Preparing to unpack .../34-libpsl5t64_0.21.2-1.1+b1_armhf.deb ...
Unpacking libpsl5t64:armhf (0.21.2-1.1+b1) ...
Selecting previously unselected package libffi8:armhf.
Preparing to unpack .../35-libffi8_3.4.6-1_armhf.deb ...
Unpacking libffi8:armhf (3.4.6-1) ...
Selecting previously unselected package libp11-kit0:armhf.
Preparing to unpack .../36-libp11-kit0_0.25.5-3_armhf.deb ...
Unpacking libp11-kit0:armhf (0.25.5-3) ...
Selecting previously unselected package libtasn1-6:armhf.
Preparing to unpack .../37-libtasn1-6_4.19.0-3+b3_armhf.deb ...
Unpacking libtasn1-6:armhf (4.19.0-3+b3) ...
Selecting previously unselected package libgnutls30t64:armhf.
Preparing to unpack .../38-libgnutls30t64_3.8.8-2_armhf.deb ...
Unpacking libgnutls30t64:armhf (3.8.8-2) ...
Selecting previously unselected package librtmp1:armhf.
Preparing to unpack .../39-librtmp1_2.4+20151223.gitfa8646d.1-2+b5_armhf.deb ...
Unpacking librtmp1:armhf (2.4+20151223.gitfa8646d.1-2+b5) ...
Selecting previously unselected package libssh2-1t64:armhf.
Preparing to unpack .../40-libssh2-1t64_1.11.1-1_armhf.deb ...
Unpacking libssh2-1t64:armhf (1.11.1-1) ...
Selecting previously unselected package libcurl4t64:armhf.
Preparing to unpack .../41-libcurl4t64_8.11.1-1+b1_armhf.deb ...
Unpacking libcurl4t64:armhf (8.11.1-1+b1) ...
Selecting previously unselected package libexpat1:armhf.
Preparing to unpack .../42-libexpat1_2.6.4-1_armhf.deb ...
Unpacking libexpat1:armhf (2.6.4-1) ...
Selecting previously unselected package libjsoncpp26:armhf.
Preparing to unpack .../43-libjsoncpp26_1.9.6-3_armhf.deb ...
Unpacking libjsoncpp26:armhf (1.9.6-3) ...
Selecting previously unselected package librhash1:armhf.
Preparing to unpack .../44-librhash1_1.4.5-1_armhf.deb ...
Unpacking librhash1:armhf (1.4.5-1) ...
Selecting previously unselected package libuv1t64:armhf.
Preparing to unpack .../45-libuv1t64_1.48.0-7_armhf.deb ...
Unpacking libuv1t64:armhf (1.48.0-7) ...
Selecting previously unselected package cmake.
Preparing to unpack .../46-cmake_3.31.4-2_armhf.deb ...
Unpacking cmake (3.31.4-2) ...
Selecting previously unselected package libdebhelper-perl.
Preparing to unpack .../47-libdebhelper-perl_13.24.1_all.deb ...
Unpacking libdebhelper-perl (13.24.1) ...
Selecting previously unselected package libtool.
Preparing to unpack .../48-libtool_2.5.4-2_all.deb ...
Unpacking libtool (2.5.4-2) ...
Selecting previously unselected package dh-autoreconf.
Preparing to unpack .../49-dh-autoreconf_20_all.deb ...
Unpacking dh-autoreconf (20) ...
Selecting previously unselected package libarchive-zip-perl.
Preparing to unpack .../50-libarchive-zip-perl_1.68-1_all.deb ...
Unpacking libarchive-zip-perl (1.68-1) ...
Selecting previously unselected package libfile-stripnondeterminism-perl.
Preparing to unpack .../51-libfile-stripnondeterminism-perl_1.14.1-1_all.deb ...
Unpacking libfile-stripnondeterminism-perl (1.14.1-1) ...
Selecting previously unselected package dh-strip-nondeterminism.
Preparing to unpack .../52-dh-strip-nondeterminism_1.14.1-1_all.deb ...
Unpacking dh-strip-nondeterminism (1.14.1-1) ...
Selecting previously unselected package libelf1t64:armhf.
Preparing to unpack .../53-libelf1t64_0.192-4_armhf.deb ...
Unpacking libelf1t64:armhf (0.192-4) ...
Selecting previously unselected package dwz.
Preparing to unpack .../54-dwz_0.15-1+b2_armhf.deb ...
Unpacking dwz (0.15-1+b2) ...
Selecting previously unselected package gettext.
Preparing to unpack .../55-gettext_0.23.1-1_armhf.deb ...
Unpacking gettext (0.23.1-1) ...
Selecting previously unselected package intltool-debian.
Preparing to unpack .../56-intltool-debian_0.35.0+20060710.6_all.deb ...
Unpacking intltool-debian (0.35.0+20060710.6) ...
Selecting previously unselected package po-debconf.
Preparing to unpack .../57-po-debconf_1.0.21+nmu1_all.deb ...
Unpacking po-debconf (1.0.21+nmu1) ...
Selecting previously unselected package debhelper.
Preparing to unpack .../58-debhelper_13.24.1_all.deb ...
Unpacking debhelper (13.24.1) ...
Selecting previously unselected package googletest.
Preparing to unpack .../59-googletest_1.15.2-1_all.deb ...
Unpacking googletest (1.15.2-1) ...
Selecting previously unselected package ninja-build.
Preparing to unpack .../60-ninja-build_1.12.1-1_armhf.deb ...
Unpacking ninja-build (1.12.1-1) ...
Setting up libexpat1:armhf (2.6.4-1) ...
Setting up libpipeline1:armhf (1.5.8-1) ...
Setting up libkeyutils1:armhf (1.6.3-4) ...
Setting up libicu72:armhf (72.1-6) ...
Setting up bsdextrautils (2.40.4-1) ...
Setting up libmagic-mgc (1:5.45-3+b1) ...
Setting up libarchive-zip-perl (1.68-1) ...
Setting up libdebhelper-perl (13.24.1) ...
Setting up libbrotli1:armhf (1.1.0-2+b6) ...
Setting up libuv1t64:armhf (1.48.0-7) ...
Setting up libmagic1t64:armhf (1:5.45-3+b1) ...
Setting up libnghttp2-14:armhf (1.64.0-1) ...
Setting up gettext-base (0.23.1-1) ...
Setting up m4 (1.4.19-5) ...
Setting up libcom-err2:armhf (1.47.2-1) ...
Setting up file (1:5.45-3+b1) ...
Setting up googletest (1.15.2-1) ...
Setting up ninja-build (1.12.1-1) ...
Setting up libelf1t64:armhf (0.192-4) ...
Setting up libkrb5support0:armhf (1.21.3-4) ...
Setting up libsasl2-modules-db:armhf (2.1.28+dfsg1-8+b1) ...
Setting up autotools-dev (20220109.1) ...
Setting up libjsoncpp26:armhf (1.9.6-3) ...
Setting up libproc2-0:armhf (2:4.0.4-6) ...
Setting up libunistring5:armhf (1.3-1) ...
Setting up autopoint (0.23.1-1) ...
Setting up libk5crypto3:armhf (1.21.3-4) ...
Setting up libsasl2-2:armhf (2.1.28+dfsg1-8+b1) ...
Setting up autoconf (2.72-3) ...
Setting up libffi8:armhf (3.4.6-1) ...
Setting up dwz (0.15-1+b2) ...
Setting up sensible-utils (0.0.24) ...
Setting up libuchardet0:armhf (0.0.8-1+b2) ...
Setting up procps (2:4.0.4-6) ...
Setting up libtasn1-6:armhf (4.19.0-3+b3) ...
Setting up cmake-data (3.31.4-2) ...
Setting up librhash1:armhf (1.4.5-1) ...
Setting up libkrb5-3:armhf (1.21.3-4) ...
Setting up libssh2-1t64:armhf (1.11.1-1) ...
Setting up libxml2:armhf (2.12.7+dfsg+really2.9.14-0.2+b1) ...
Setting up libldap2:armhf (2.6.9+dfsg-1) ...
Setting up automake (1:1.16.5-1.3) ...
update-alternatives: using /usr/bin/automake-1.16 to provide /usr/bin/automake (automake) in auto mode
Setting up libfile-stripnondeterminism-perl (1.14.1-1) ...
Setting up gettext (0.23.1-1) ...
Setting up libtool (2.5.4-2) ...
Setting up libidn2-0:armhf (2.3.7-2+b1) ...
Setting up intltool-debian (0.35.0+20060710.6) ...
Setting up dh-autoreconf (20) ...
Setting up libp11-kit0:armhf (0.25.5-3) ...
Setting up libgssapi-krb5-2:armhf (1.21.3-4) ...
Setting up dh-strip-nondeterminism (1.14.1-1) ...
Setting up groff-base (1.23.0-7) ...
Setting up libarchive13t64:armhf (3.7.4-1.1) ...
Setting up libgnutls30t64:armhf (3.8.8-2) ...
Setting up po-debconf (1.0.21+nmu1) ...
Setting up libpsl5t64:armhf (0.21.2-1.1+b1) ...
Setting up man-db (2.13.0-1) ...
Not building database; man-db/auto-update is not 'true'.
Setting up librtmp1:armhf (2.4+20151223.gitfa8646d.1-2+b5) ...
Setting up libcurl4t64:armhf (8.11.1-1+b1) ...
Setting up debhelper (13.24.1) ...
Setting up cmake (3.31.4-2) ...
Processing triggers for libc-bin (2.40-6) ...
Reading package lists...
Building dependency tree...
Reading state information...
Reading extended state information...
Initializing package states...
Writing extended state information...
Building tag database...
 -> Finished parsing the build-deps
I: Building the package
I: user script /srv/workspace/pbuilder/16425/tmp/hooks/A99_set_merged_usr starting
Not re-configuring usrmerge for trixie
I: user script /srv/workspace/pbuilder/16425/tmp/hooks/A99_set_merged_usr finished
hostname: Name or service not known
I: Running cd /build/reproducible-path/cpuinfo-0.0~git20250110.8a1772a/ && env PATH="/usr/sbin:/usr/bin:/sbin:/bin:/usr/games:/i/capture/the/path" HOME="/nonexistent/second-build" dpkg-buildpackage -us -uc -b && env PATH="/usr/sbin:/usr/bin:/sbin:/bin:/usr/games:/i/capture/the/path" HOME="/nonexistent/second-build" dpkg-genchanges -S  > ../cpuinfo_0.0~git20250110.8a1772a-1_source.changes
dpkg-buildpackage: info: source package cpuinfo
dpkg-buildpackage: info: source version 0.0~git20250110.8a1772a-1
dpkg-buildpackage: info: source distribution unstable
dpkg-buildpackage: info: source changed by Shengqi Chen <harry@debian.org>
 dpkg-source --before-build .
dpkg-buildpackage: info: host architecture armhf
 debian/rules clean
dh clean -Scmake+ninja
   dh_auto_clean -O-Scmake\+ninja
   dh_clean -O-Scmake\+ninja
 debian/rules binary
dh binary -Scmake+ninja
   dh_update_autotools_config -O-Scmake\+ninja
   dh_autoreconf -O-Scmake\+ninja
   debian/rules override_dh_auto_configure
make[1]: Entering directory '/build/reproducible-path/cpuinfo-0.0~git20250110.8a1772a'
dh_auto_configure -- \
	-DGOOGLETEST_SOURCE_DIR=/usr/src/googletest/ \
	-DCPUINFO_BUILD_BENCHMARKS=OFF \
	-DCPUINFO_LIBRARY_TYPE=shared \
	-DCPUINFO_LOG_LEVEL=error \
	-DCMAKE_SKIP_RPATH=ON
	cd obj-arm-linux-gnueabihf && DEB_PYTHON_INSTALL_LAYOUT=deb PKG_CONFIG=/usr/bin/pkg-config cmake -DCMAKE_INSTALL_PREFIX=/usr -DCMAKE_BUILD_TYPE=None -DCMAKE_INSTALL_SYSCONFDIR=/etc -DCMAKE_INSTALL_LOCALSTATEDIR=/var -DCMAKE_EXPORT_NO_PACKAGE_REGISTRY=ON -DCMAKE_FIND_USE_PACKAGE_REGISTRY=OFF -DCMAKE_FIND_PACKAGE_NO_PACKAGE_REGISTRY=ON -DFETCHCONTENT_FULLY_DISCONNECTED=ON -DCMAKE_INSTALL_RUNSTATEDIR=/run -DCMAKE_SKIP_INSTALL_ALL_DEPENDENCY=ON -GNinja -DCMAKE_VERBOSE_MAKEFILE=ON -DCMAKE_INSTALL_LIBDIR=lib/arm-linux-gnueabihf -DGOOGLETEST_SOURCE_DIR=/usr/src/googletest/ -DCPUINFO_BUILD_BENCHMARKS=OFF -DCPUINFO_LIBRARY_TYPE=shared -DCPUINFO_LOG_LEVEL=error -DCMAKE_SKIP_RPATH=ON ..
CMake Deprecation Warning at CMakeLists.txt:1 (CMAKE_MINIMUM_REQUIRED):
  Compatibility with CMake < 3.10 will be removed from a future version of
  CMake.

  Update the VERSION argument <min> value.  Or, use the <min>...<max> syntax
  to tell CMake that the project requires at least <min> but has been updated
  to work with policies introduced by <max> or earlier.


-- The C compiler identification is GNU 14.2.0
-- Detecting C compiler ABI info
-- Detecting C compiler ABI info - done
-- Check for working C compiler: /usr/bin/cc - skipped
-- Detecting C compile features
-- Detecting C compile features - done
-- The CXX compiler identification is GNU 14.2.0
-- Detecting CXX compiler ABI info
-- Detecting CXX compiler ABI info - done
-- Check for working CXX compiler: /usr/bin/c++ - skipped
-- Detecting CXX compile features
-- Detecting CXX compile features - done
-- Performing Test CMAKE_HAVE_LIBC_PTHREAD
-- Performing Test CMAKE_HAVE_LIBC_PTHREAD - Success
-- Found Threads: TRUE
-- Configuring done (3.4s)
-- Generating done (0.2s)
CMake Warning:
  Manually-specified variables were not used by the project:

    CMAKE_EXPORT_NO_PACKAGE_REGISTRY
    CMAKE_FIND_PACKAGE_NO_PACKAGE_REGISTRY
    FETCHCONTENT_FULLY_DISCONNECTED


-- Build files have been written to: /build/reproducible-path/cpuinfo-0.0~git20250110.8a1772a/obj-arm-linux-gnueabihf
make[1]: Leaving directory '/build/reproducible-path/cpuinfo-0.0~git20250110.8a1772a'
   dh_auto_build -O-Scmake\+ninja
	cd obj-arm-linux-gnueabihf && LC_ALL=C.UTF-8 ninja -j6 -v
[1/78] /usr/bin/cc -DCPUINFO_LOG_LEVEL=2 -DCPUINFO_LOG_TO_STDIO=1 -D_GNU_SOURCE=1 -Dcpuinfo_EXPORTS -I"/build/reproducible-path/cpuinfo-0.0~git20250110.8a1772a/src" -I"/build/reproducible-path/cpuinfo-0.0~git20250110.8a1772a/include" -g -O2 -Werror=implicit-function-declaration -ffile-prefix-map=/build/reproducible-path/cpuinfo-0.0~git20250110.8a1772a=. -fstack-protector-strong -fstack-clash-protection -Wformat -Werror=format-security -D_LARGEFILE_SOURCE -D_FILE_OFFSET_BITS=64 -D_TIME_BITS=64 -Wdate-time -D_FORTIFY_SOURCE=2 -std=c99 -fPIC -MD -MT CMakeFiles/cpuinfo.dir/src/cache.c.o -MF CMakeFiles/cpuinfo.dir/src/cache.c.o.d -o CMakeFiles/cpuinfo.dir/src/cache.c.o -c '/build/reproducible-path/cpuinfo-0.0~git20250110.8a1772a/src/cache.c'
[2/78] /usr/bin/cc -DCPUINFO_LOG_LEVEL=2 -DCPUINFO_LOG_TO_STDIO=1 -D_GNU_SOURCE=1 -Dcpuinfo_EXPORTS -I"/build/reproducible-path/cpuinfo-0.0~git20250110.8a1772a/src" -I"/build/reproducible-path/cpuinfo-0.0~git20250110.8a1772a/include" -g -O2 -Werror=implicit-function-declaration -ffile-prefix-map=/build/reproducible-path/cpuinfo-0.0~git20250110.8a1772a=. -fstack-protector-strong -fstack-clash-protection -Wformat -Werror=format-security -D_LARGEFILE_SOURCE -D_FILE_OFFSET_BITS=64 -D_TIME_BITS=64 -Wdate-time -D_FORTIFY_SOURCE=2 -std=c99 -fPIC -MD -MT CMakeFiles/cpuinfo.dir/src/init.c.o -MF CMakeFiles/cpuinfo.dir/src/init.c.o.d -o CMakeFiles/cpuinfo.dir/src/init.c.o -c '/build/reproducible-path/cpuinfo-0.0~git20250110.8a1772a/src/init.c'
[3/78] /usr/bin/cc -DCPUINFO_LOG_LEVEL=2 -DCPUINFO_LOG_TO_STDIO=1 -D_GNU_SOURCE=1 -Dcpuinfo_EXPORTS -I"/build/reproducible-path/cpuinfo-0.0~git20250110.8a1772a/src" -I"/build/reproducible-path/cpuinfo-0.0~git20250110.8a1772a/include" -g -O2 -Werror=implicit-function-declaration -ffile-prefix-map=/build/reproducible-path/cpuinfo-0.0~git20250110.8a1772a=. -fstack-protector-strong -fstack-clash-protection -Wformat -Werror=format-security -D_LARGEFILE_SOURCE -D_FILE_OFFSET_BITS=64 -D_TIME_BITS=64 -Wdate-time -D_FORTIFY_SOURCE=2 -std=c99 -fPIC -MD -MT CMakeFiles/cpuinfo.dir/src/arm/uarch.c.o -MF CMakeFiles/cpuinfo.dir/src/arm/uarch.c.o.d -o CMakeFiles/cpuinfo.dir/src/arm/uarch.c.o -c '/build/reproducible-path/cpuinfo-0.0~git20250110.8a1772a/src/arm/uarch.c'
[4/78] /usr/bin/cc -DCPUINFO_LOG_LEVEL=2 -DCPUINFO_LOG_TO_STDIO=1 -D_GNU_SOURCE=1 -Dcpuinfo_EXPORTS -I"/build/reproducible-path/cpuinfo-0.0~git20250110.8a1772a/src" -I"/build/reproducible-path/cpuinfo-0.0~git20250110.8a1772a/include" -g -O2 -Werror=implicit-function-declaration -ffile-prefix-map=/build/reproducible-path/cpuinfo-0.0~git20250110.8a1772a=. -fstack-protector-strong -fstack-clash-protection -Wformat -Werror=format-security -D_LARGEFILE_SOURCE -D_FILE_OFFSET_BITS=64 -D_TIME_BITS=64 -Wdate-time -D_FORTIFY_SOURCE=2 -std=c99 -fPIC -MD -MT CMakeFiles/cpuinfo.dir/src/log.c.o -MF CMakeFiles/cpuinfo.dir/src/log.c.o.d -o CMakeFiles/cpuinfo.dir/src/log.c.o -c '/build/reproducible-path/cpuinfo-0.0~git20250110.8a1772a/src/log.c'
[5/78] /usr/bin/cc -DCPUINFO_LOG_LEVEL=2 -DCPUINFO_LOG_TO_STDIO=1 -D_GNU_SOURCE=1 -Dcpuinfo_EXPORTS -I"/build/reproducible-path/cpuinfo-0.0~git20250110.8a1772a/src" -I"/build/reproducible-path/cpuinfo-0.0~git20250110.8a1772a/include" -g -O2 -Werror=implicit-function-declaration -ffile-prefix-map=/build/reproducible-path/cpuinfo-0.0~git20250110.8a1772a=. -fstack-protector-strong -fstack-clash-protection -Wformat -Werror=format-security -D_LARGEFILE_SOURCE -D_FILE_OFFSET_BITS=64 -D_TIME_BITS=64 -Wdate-time -D_FORTIFY_SOURCE=2 -std=c99 -fPIC -MD -MT CMakeFiles/cpuinfo.dir/src/arm/cache.c.o -MF CMakeFiles/cpuinfo.dir/src/arm/cache.c.o.d -o CMakeFiles/cpuinfo.dir/src/arm/cache.c.o -c '/build/reproducible-path/cpuinfo-0.0~git20250110.8a1772a/src/arm/cache.c'
[6/78] /usr/bin/cc -DCPUINFO_LOG_LEVEL=2 -DCPUINFO_LOG_TO_STDIO=1 -D_GNU_SOURCE=1 -Dcpuinfo_EXPORTS -I"/build/reproducible-path/cpuinfo-0.0~git20250110.8a1772a/src" -I"/build/reproducible-path/cpuinfo-0.0~git20250110.8a1772a/include" -g -O2 -Werror=implicit-function-declaration -ffile-prefix-map=/build/reproducible-path/cpuinfo-0.0~git20250110.8a1772a=. -fstack-protector-strong -fstack-clash-protection -Wformat -Werror=format-security -D_LARGEFILE_SOURCE -D_FILE_OFFSET_BITS=64 -D_TIME_BITS=64 -Wdate-time -D_FORTIFY_SOURCE=2 -std=c99 -fPIC -MD -MT CMakeFiles/cpuinfo.dir/src/api.c.o -MF CMakeFiles/cpuinfo.dir/src/api.c.o.d -o CMakeFiles/cpuinfo.dir/src/api.c.o -c '/build/reproducible-path/cpuinfo-0.0~git20250110.8a1772a/src/api.c'
[7/78] /usr/bin/cc -DCPUINFO_LOG_LEVEL=2 -DCPUINFO_LOG_TO_STDIO=1 -D_GNU_SOURCE=1 -Dcpuinfo_EXPORTS -I"/build/reproducible-path/cpuinfo-0.0~git20250110.8a1772a/src" -I"/build/reproducible-path/cpuinfo-0.0~git20250110.8a1772a/include" -g -O2 -Werror=implicit-function-declaration -ffile-prefix-map=/build/reproducible-path/cpuinfo-0.0~git20250110.8a1772a=. -fstack-protector-strong -fstack-clash-protection -Wformat -Werror=format-security -D_LARGEFILE_SOURCE -D_FILE_OFFSET_BITS=64 -D_TIME_BITS=64 -Wdate-time -D_FORTIFY_SOURCE=2 -std=c99 -fPIC -MD -MT CMakeFiles/cpuinfo.dir/src/arm/linux/clusters.c.o -MF CMakeFiles/cpuinfo.dir/src/arm/linux/clusters.c.o.d -o CMakeFiles/cpuinfo.dir/src/arm/linux/clusters.c.o -c '/build/reproducible-path/cpuinfo-0.0~git20250110.8a1772a/src/arm/linux/clusters.c'
[8/78] /usr/bin/cc -DCPUINFO_LOG_LEVEL=2 -DCPUINFO_LOG_TO_STDIO=1 -D_GNU_SOURCE=1 -Dcpuinfo_EXPORTS -I"/build/reproducible-path/cpuinfo-0.0~git20250110.8a1772a/src" -I"/build/reproducible-path/cpuinfo-0.0~git20250110.8a1772a/include" -g -O2 -Werror=implicit-function-declaration -ffile-prefix-map=/build/reproducible-path/cpuinfo-0.0~git20250110.8a1772a=. -fstack-protector-strong -fstack-clash-protection -Wformat -Werror=format-security -D_LARGEFILE_SOURCE -D_FILE_OFFSET_BITS=64 -D_TIME_BITS=64 -Wdate-time -D_FORTIFY_SOURCE=2 -std=c99 -fPIC -MD -MT CMakeFiles/cpuinfo.dir/src/arm/linux/hwcap.c.o -MF CMakeFiles/cpuinfo.dir/src/arm/linux/hwcap.c.o.d -o CMakeFiles/cpuinfo.dir/src/arm/linux/hwcap.c.o -c '/build/reproducible-path/cpuinfo-0.0~git20250110.8a1772a/src/arm/linux/hwcap.c'
[9/78] /usr/bin/cc -DCPUINFO_LOG_LEVEL=2 -DCPUINFO_LOG_TO_STDIO=1 -D_GNU_SOURCE=1 -Dcpuinfo_EXPORTS -I"/build/reproducible-path/cpuinfo-0.0~git20250110.8a1772a/src" -I"/build/reproducible-path/cpuinfo-0.0~git20250110.8a1772a/include" -g -O2 -Werror=implicit-function-declaration -ffile-prefix-map=/build/reproducible-path/cpuinfo-0.0~git20250110.8a1772a=. -fstack-protector-strong -fstack-clash-protection -Wformat -Werror=format-security -D_LARGEFILE_SOURCE -D_FILE_OFFSET_BITS=64 -D_TIME_BITS=64 -Wdate-time -D_FORTIFY_SOURCE=2 -std=c99 -fPIC -MD -MT CMakeFiles/cpuinfo.dir/src/arm/linux/aarch64-isa.c.o -MF CMakeFiles/cpuinfo.dir/src/arm/linux/aarch64-isa.c.o.d -o CMakeFiles/cpuinfo.dir/src/arm/linux/aarch64-isa.c.o -c '/build/reproducible-path/cpuinfo-0.0~git20250110.8a1772a/src/arm/linux/aarch64-isa.c'
FAILED: CMakeFiles/cpuinfo.dir/src/arm/linux/aarch64-isa.c.o 
/usr/bin/cc -DCPUINFO_LOG_LEVEL=2 -DCPUINFO_LOG_TO_STDIO=1 -D_GNU_SOURCE=1 -Dcpuinfo_EXPORTS -I"/build/reproducible-path/cpuinfo-0.0~git20250110.8a1772a/src" -I"/build/reproducible-path/cpuinfo-0.0~git20250110.8a1772a/include" -g -O2 -Werror=implicit-function-declaration -ffile-prefix-map=/build/reproducible-path/cpuinfo-0.0~git20250110.8a1772a=. -fstack-protector-strong -fstack-clash-protection -Wformat -Werror=format-security -D_LARGEFILE_SOURCE -D_FILE_OFFSET_BITS=64 -D_TIME_BITS=64 -Wdate-time -D_FORTIFY_SOURCE=2 -std=c99 -fPIC -MD -MT CMakeFiles/cpuinfo.dir/src/arm/linux/aarch64-isa.c.o -MF CMakeFiles/cpuinfo.dir/src/arm/linux/aarch64-isa.c.o.d -o CMakeFiles/cpuinfo.dir/src/arm/linux/aarch64-isa.c.o -c '/build/reproducible-path/cpuinfo-0.0~git20250110.8a1772a/src/arm/linux/aarch64-isa.c'
/build/reproducible-path/cpuinfo-0.0~git20250110.8a1772a/src/arm/linux/aarch64-isa.c: In function ‘cpuinfo_arm64_linux_decode_isa_from_proc_cpuinfo’:
/build/reproducible-path/cpuinfo-0.0~git20250110.8a1772a/src/arm/linux/aarch64-isa.c:14:24: error: ‘CPUINFO_ARM_LINUX_FEATURE_AES’ undeclared (first use in this function); did you mean ‘CPUINFO_ARM_LINUX_FEATURE2_AES’?
   14 |         if (features & CPUINFO_ARM_LINUX_FEATURE_AES) {
      |                        ^~~~~~~~~~~~~~~~~~~~~~~~~~~~~
      |                        CPUINFO_ARM_LINUX_FEATURE2_AES
/build/reproducible-path/cpuinfo-0.0~git20250110.8a1772a/src/arm/linux/aarch64-isa.c:14:24: note: each undeclared identifier is reported only once for each function it appears in
/build/reproducible-path/cpuinfo-0.0~git20250110.8a1772a/src/arm/linux/aarch64-isa.c:17:24: error: ‘CPUINFO_ARM_LINUX_FEATURE_PMULL’ undeclared (first use in this function); did you mean ‘CPUINFO_ARM_LINUX_FEATURE2_PMULL’?
   17 |         if (features & CPUINFO_ARM_LINUX_FEATURE_PMULL) {
      |                        ^~~~~~~~~~~~~~~~~~~~~~~~~~~~~~~
      |                        CPUINFO_ARM_LINUX_FEATURE2_PMULL
/build/reproducible-path/cpuinfo-0.0~git20250110.8a1772a/src/arm/linux/aarch64-isa.c:20:24: error: ‘CPUINFO_ARM_LINUX_FEATURE_SHA1’ undeclared (first use in this function); did you mean ‘CPUINFO_ARM_LINUX_FEATURE2_SHA1’?
   20 |         if (features & CPUINFO_ARM_LINUX_FEATURE_SHA1) {
      |                        ^~~~~~~~~~~~~~~~~~~~~~~~~~~~~~
      |                        CPUINFO_ARM_LINUX_FEATURE2_SHA1
/build/reproducible-path/cpuinfo-0.0~git20250110.8a1772a/src/arm/linux/aarch64-isa.c:23:24: error: ‘CPUINFO_ARM_LINUX_FEATURE_SHA2’ undeclared (first use in this function); did you mean ‘CPUINFO_ARM_LINUX_FEATURE2_SHA2’?
   23 |         if (features & CPUINFO_ARM_LINUX_FEATURE_SHA2) {
      |                        ^~~~~~~~~~~~~~~~~~~~~~~~~~~~~~
      |                        CPUINFO_ARM_LINUX_FEATURE2_SHA2
/build/reproducible-path/cpuinfo-0.0~git20250110.8a1772a/src/arm/linux/aarch64-isa.c:26:24: error: ‘CPUINFO_ARM_LINUX_FEATURE_CRC32’ undeclared (first use in this function); did you mean ‘CPUINFO_ARM_LINUX_FEATURE2_CRC32’?
   26 |         if (features & CPUINFO_ARM_LINUX_FEATURE_CRC32) {
      |                        ^~~~~~~~~~~~~~~~~~~~~~~~~~~~~~~
      |                        CPUINFO_ARM_LINUX_FEATURE2_CRC32
/build/reproducible-path/cpuinfo-0.0~git20250110.8a1772a/src/arm/linux/aarch64-isa.c:29:24: error: ‘CPUINFO_ARM_LINUX_FEATURE_ATOMICS’ undeclared (first use in this function); did you mean ‘CPUINFO_ARM_LINUX_FEATURE_TLS’?
   29 |         if (features & CPUINFO_ARM_LINUX_FEATURE_ATOMICS) {
      |                        ^~~~~~~~~~~~~~~~~~~~~~~~~~~~~~~~~
      |                        CPUINFO_ARM_LINUX_FEATURE_TLS
/build/reproducible-path/cpuinfo-0.0~git20250110.8a1772a/src/arm/linux/aarch64-isa.c:30:20: error: ‘struct cpuinfo_arm_isa’ has no member named ‘atomics’
   30 |                 isa->atomics = true;
      |                    ^~
/build/reproducible-path/cpuinfo-0.0~git20250110.8a1772a/src/arm/linux/aarch64-isa.c:56:49: error: ‘CPUINFO_ARM_LINUX_FEATURE_FPHP’ undeclared (first use in this function); did you mean ‘CPUINFO_ARM_LINUX_FEATURE_FPA’?
   56 |                 const uint32_t fp16arith_mask = CPUINFO_ARM_LINUX_FEATURE_FPHP | CPUINFO_ARM_LINUX_FEATURE_ASIMDHP;
      |                                                 ^~~~~~~~~~~~~~~~~~~~~~~~~~~~~~
      |                                                 CPUINFO_ARM_LINUX_FEATURE_FPA
/build/reproducible-path/cpuinfo-0.0~git20250110.8a1772a/src/arm/linux/aarch64-isa.c:56:82: error: ‘CPUINFO_ARM_LINUX_FEATURE_ASIMDHP’ undeclared (first use in this function); did you mean ‘CPUINFO_ARM_LINUX_FEATURE_EDSP’?
   56 |                 const uint32_t fp16arith_mask = CPUINFO_ARM_LINUX_FEATURE_FPHP | CPUINFO_ARM_LINUX_FEATURE_ASIMDHP;
      |                                                                                  ^~~~~~~~~~~~~~~~~~~~~~~~~~~~~~~~~
      |                                                                                  CPUINFO_ARM_LINUX_FEATURE_EDSP
/build/reproducible-path/cpuinfo-0.0~git20250110.8a1772a/src/arm/linux/aarch64-isa.c:88:48: error: ‘CPUINFO_ARM_LINUX_FEATURE_ASIMDRDM’ undeclared (first use in this function); did you mean ‘CPUINFO_ARM_LINUX_FEATURE_IDIVT’?
   88 |                                 if (features & CPUINFO_ARM_LINUX_FEATURE_ASIMDRDM) {
      |                                                ^~~~~~~~~~~~~~~~~~~~~~~~~~~~~~~~~~
      |                                                CPUINFO_ARM_LINUX_FEATURE_IDIVT
/build/reproducible-path/cpuinfo-0.0~git20250110.8a1772a/src/arm/linux/aarch64-isa.c:94:25: error: ‘CPUINFO_ARM_LINUX_FEATURE2_I8MM’ undeclared (first use in this function); did you mean ‘CPUINFO_ARM_LINUX_FEATURE_IWMMXT’?
   94 |         if (features2 & CPUINFO_ARM_LINUX_FEATURE2_I8MM) {
      |                         ^~~~~~~~~~~~~~~~~~~~~~~~~~~~~~~
      |                         CPUINFO_ARM_LINUX_FEATURE_IWMMXT
/build/reproducible-path/cpuinfo-0.0~git20250110.8a1772a/src/arm/linux/aarch64-isa.c:95:20: error: ‘struct cpuinfo_arm_isa’ has no member named ‘i8mm’
   95 |                 isa->i8mm = true;
      |                    ^~
/build/reproducible-path/cpuinfo-0.0~git20250110.8a1772a/src/arm/linux/aarch64-isa.c:127:40: error: ‘CPUINFO_ARM_LINUX_FEATURE_ASIMDDP’ undeclared (first use in this function); did you mean ‘CPUINFO_ARM_LINUX_FEATURE_EDSP’?
  127 |                         if (features & CPUINFO_ARM_LINUX_FEATURE_ASIMDDP) {
      |                                        ^~~~~~~~~~~~~~~~~~~~~~~~~~~~~~~~~
      |                                        CPUINFO_ARM_LINUX_FEATURE_EDSP
/build/reproducible-path/cpuinfo-0.0~git20250110.8a1772a/src/arm/linux/aarch64-isa.c:132:24: error: ‘CPUINFO_ARM_LINUX_FEATURE_JSCVT’ undeclared (first use in this function); did you mean ‘CPUINFO_ARM_LINUX_FEATURE_IDIVT’?
  132 |         if (features & CPUINFO_ARM_LINUX_FEATURE_JSCVT) {
      |                        ^~~~~~~~~~~~~~~~~~~~~~~~~~~~~~~
      |                        CPUINFO_ARM_LINUX_FEATURE_IDIVT
/build/reproducible-path/cpuinfo-0.0~git20250110.8a1772a/src/arm/linux/aarch64-isa.c:138:24: error: ‘CPUINFO_ARM_LINUX_FEATURE_FCMA’ undeclared (first use in this function); did you mean ‘CPUINFO_ARM_LINUX_FEATURE_FPA’?
  138 |         if (features & CPUINFO_ARM_LINUX_FEATURE_FCMA) {
      |                        ^~~~~~~~~~~~~~~~~~~~~~~~~~~~~~
      |                        CPUINFO_ARM_LINUX_FEATURE_FPA
/build/reproducible-path/cpuinfo-0.0~git20250110.8a1772a/src/arm/linux/aarch64-isa.c:141:24: error: ‘CPUINFO_ARM_LINUX_FEATURE_SVE’ undeclared (first use in this function); did you mean ‘CPUINFO_ARM_LINUX_FEATURE_SWP’?
  141 |         if (features & CPUINFO_ARM_LINUX_FEATURE_SVE) {
      |                        ^~~~~~~~~~~~~~~~~~~~~~~~~~~~~
      |                        CPUINFO_ARM_LINUX_FEATURE_SWP
/build/reproducible-path/cpuinfo-0.0~git20250110.8a1772a/src/arm/linux/aarch64-isa.c:142:20: error: ‘struct cpuinfo_arm_isa’ has no member named ‘sve’
  142 |                 isa->sve = true;
      |                    ^~
/build/reproducible-path/cpuinfo-0.0~git20250110.8a1772a/src/arm/linux/aarch64-isa.c:144:25: error: ‘CPUINFO_ARM_LINUX_FEATURE2_SVE2’ undeclared (first use in this function); did you mean ‘CPUINFO_ARM_LINUX_FEATURE2_SHA2’?
  144 |         if (features2 & CPUINFO_ARM_LINUX_FEATURE2_SVE2) {
      |                         ^~~~~~~~~~~~~~~~~~~~~~~~~~~~~~~
      |                         CPUINFO_ARM_LINUX_FEATURE2_SHA2
/build/reproducible-path/cpuinfo-0.0~git20250110.8a1772a/src/arm/linux/aarch64-isa.c:145:20: error: ‘struct cpuinfo_arm_isa’ has no member named ‘sve2’
  145 |                 isa->sve2 = true;
      |                    ^~
/build/reproducible-path/cpuinfo-0.0~git20250110.8a1772a/src/arm/linux/aarch64-isa.c:147:25: error: ‘CPUINFO_ARM_LINUX_FEATURE2_SME’ undeclared (first use in this function); did you mean ‘CPUINFO_ARM_LINUX_FEATURE_SWP’?
  147 |         if (features2 & CPUINFO_ARM_LINUX_FEATURE2_SME) {
      |                         ^~~~~~~~~~~~~~~~~~~~~~~~~~~~~~
      |                         CPUINFO_ARM_LINUX_FEATURE_SWP
/build/reproducible-path/cpuinfo-0.0~git20250110.8a1772a/src/arm/linux/aarch64-isa.c:148:20: error: ‘struct cpuinfo_arm_isa’ has no member named ‘sme’
  148 |                 isa->sme = true;
      |                    ^~
/build/reproducible-path/cpuinfo-0.0~git20250110.8a1772a/src/arm/linux/aarch64-isa.c:150:25: error: ‘CPUINFO_ARM_LINUX_FEATURE2_SME2’ undeclared (first use in this function); did you mean ‘CPUINFO_ARM_LINUX_FEATURE2_SHA2’?
  150 |         if (features2 & CPUINFO_ARM_LINUX_FEATURE2_SME2) {
      |                         ^~~~~~~~~~~~~~~~~~~~~~~~~~~~~~~
      |                         CPUINFO_ARM_LINUX_FEATURE2_SHA2
/build/reproducible-path/cpuinfo-0.0~git20250110.8a1772a/src/arm/linux/aarch64-isa.c:151:20: error: ‘struct cpuinfo_arm_isa’ has no member named ‘sme2’
  151 |                 isa->sme2 = true;
      |                    ^~
/build/reproducible-path/cpuinfo-0.0~git20250110.8a1772a/src/arm/linux/aarch64-isa.c:153:25: error: ‘CPUINFO_ARM_LINUX_FEATURE2_SME2P1’ undeclared (first use in this function); did you mean ‘CPUINFO_ARM_LINUX_FEATURE2_SHA1’?
  153 |         if (features2 & CPUINFO_ARM_LINUX_FEATURE2_SME2P1) {
      |                         ^~~~~~~~~~~~~~~~~~~~~~~~~~~~~~~~~
      |                         CPUINFO_ARM_LINUX_FEATURE2_SHA1
/build/reproducible-path/cpuinfo-0.0~git20250110.8a1772a/src/arm/linux/aarch64-isa.c:154:20: error: ‘struct cpuinfo_arm_isa’ has no member named ‘sme2p1’
  154 |                 isa->sme2p1 = true;
      |                    ^~
/build/reproducible-path/cpuinfo-0.0~git20250110.8a1772a/src/arm/linux/aarch64-isa.c:156:25: error: ‘CPUINFO_ARM_LINUX_FEATURE2_SME_I16I32’ undeclared (first use in this function); did you mean ‘CPUINFO_ARM_LINUX_FEATURE2_CRC32’?
  156 |         if (features2 & CPUINFO_ARM_LINUX_FEATURE2_SME_I16I32) {
      |                         ^~~~~~~~~~~~~~~~~~~~~~~~~~~~~~~~~~~~~
      |                         CPUINFO_ARM_LINUX_FEATURE2_CRC32
/build/reproducible-path/cpuinfo-0.0~git20250110.8a1772a/src/arm/linux/aarch64-isa.c:157:20: error: ‘struct cpuinfo_arm_isa’ has no member named ‘sme_i16i32’
  157 |                 isa->sme_i16i32 = true;
      |                    ^~
/build/reproducible-path/cpuinfo-0.0~git20250110.8a1772a/src/arm/linux/aarch64-isa.c:159:25: error: ‘CPUINFO_ARM_LINUX_FEATURE2_SME_BI32I32’ undeclared (first use in this function); did you mean ‘CPUINFO_ARM_LINUX_FEATURE2_CRC32’?
  159 |         if (features2 & CPUINFO_ARM_LINUX_FEATURE2_SME_BI32I32) {
      |                         ^~~~~~~~~~~~~~~~~~~~~~~~~~~~~~~~~~~~~~
      |                         CPUINFO_ARM_LINUX_FEATURE2_CRC32
/build/reproducible-path/cpuinfo-0.0~git20250110.8a1772a/src/arm/linux/aarch64-isa.c:160:20: error: ‘struct cpuinfo_arm_isa’ has no member named ‘sme_bi32i32’
  160 |                 isa->sme_bi32i32 = true;
      |                    ^~
/build/reproducible-path/cpuinfo-0.0~git20250110.8a1772a/src/arm/linux/aarch64-isa.c:162:25: error: ‘CPUINFO_ARM_LINUX_FEATURE2_SME_B16B16’ undeclared (first use in this function); did you mean ‘CPUINFO_ARM_LINUX_FEATURE2_SHA1’?
  162 |         if (features2 & CPUINFO_ARM_LINUX_FEATURE2_SME_B16B16) {
      |                         ^~~~~~~~~~~~~~~~~~~~~~~~~~~~~~~~~~~~~
      |                         CPUINFO_ARM_LINUX_FEATURE2_SHA1
/build/reproducible-path/cpuinfo-0.0~git20250110.8a1772a/src/arm/linux/aarch64-isa.c:163:20: error: ‘struct cpuinfo_arm_isa’ has no member named ‘sme_b16b16’
  163 |                 isa->sme_b16b16 = true;
      |                    ^~
/build/reproducible-path/cpuinfo-0.0~git20250110.8a1772a/src/arm/linux/aarch64-isa.c:165:25: error: ‘CPUINFO_ARM_LINUX_FEATURE2_SME_F16F16’ undeclared (first use in this function); did you mean ‘CPUINFO_ARM_LINUX_FEATURE2_SHA1’?
  165 |         if (features2 & CPUINFO_ARM_LINUX_FEATURE2_SME_F16F16) {
      |                         ^~~~~~~~~~~~~~~~~~~~~~~~~~~~~~~~~~~~~
      |                         CPUINFO_ARM_LINUX_FEATURE2_SHA1
/build/reproducible-path/cpuinfo-0.0~git20250110.8a1772a/src/arm/linux/aarch64-isa.c:166:20: error: ‘struct cpuinfo_arm_isa’ has no member named ‘sme_f16f16’
  166 |                 isa->sme_f16f16 = true;
      |                    ^~
/build/reproducible-path/cpuinfo-0.0~git20250110.8a1772a/src/arm/linux/aarch64-isa.c:171:26: error: ‘CPUINFO_ARM_LINUX_FEATURE2_BF16’ undeclared (first use in this function); did you mean ‘CPUINFO_ARM_LINUX_FEATURE_FPA’?
  171 |         if (features2 & (CPUINFO_ARM_LINUX_FEATURE2_BF16 | CPUINFO_ARM_LINUX_FEATURE2_SVEBF16)) {
      |                          ^~~~~~~~~~~~~~~~~~~~~~~~~~~~~~~
      |                          CPUINFO_ARM_LINUX_FEATURE_FPA
/build/reproducible-path/cpuinfo-0.0~git20250110.8a1772a/src/arm/linux/aarch64-isa.c:171:60: error: ‘CPUINFO_ARM_LINUX_FEATURE2_SVEBF16’ undeclared (first use in this function); did you mean ‘CPUINFO_ARM_LINUX_FEATURE2_SHA1’?
  171 |         if (features2 & (CPUINFO_ARM_LINUX_FEATURE2_BF16 | CPUINFO_ARM_LINUX_FEATURE2_SVEBF16)) {
      |                                                            ^~~~~~~~~~~~~~~~~~~~~~~~~~~~~~~~~~
      |                                                            CPUINFO_ARM_LINUX_FEATURE2_SHA1
/build/reproducible-path/cpuinfo-0.0~git20250110.8a1772a/src/arm/linux/aarch64-isa.c:172:20: error: ‘struct cpuinfo_arm_isa’ has no member named ‘bf16’
  172 |                 isa->bf16 = true;
      |                    ^~
/build/reproducible-path/cpuinfo-0.0~git20250110.8a1772a/src/arm/linux/aarch64-isa.c:174:24: error: ‘CPUINFO_ARM_LINUX_FEATURE_ASIMDFHM’ undeclared (first use in this function); did you mean ‘CPUINFO_ARM_LINUX_FEATURE_IDIVT’?
  174 |         if (features & CPUINFO_ARM_LINUX_FEATURE_ASIMDFHM) {
      |                        ^~~~~~~~~~~~~~~~~~~~~~~~~~~~~~~~~~
      |                        CPUINFO_ARM_LINUX_FEATURE_IDIVT
/build/reproducible-path/cpuinfo-0.0~git20250110.8a1772a/src/arm/linux/aarch64-isa.c:189:20: error: ‘struct cpuinfo_arm_isa’ has no member named ‘svelen’
  189 |                 isa->svelen = 0; // Assume no SVE support if the call fails
      |                    ^~
/build/reproducible-path/cpuinfo-0.0~git20250110.8a1772a/src/arm/linux/aarch64-isa.c:192:20: error: ‘struct cpuinfo_arm_isa’ has no member named ‘svelen’
  192 |                 isa->svelen = ret & PR_SVE_VL_LEN_MASK;
      |                    ^~
[10/78] /usr/bin/cc -DCPUINFO_LOG_LEVEL=2 -DCPUINFO_LOG_TO_STDIO=1 -D_GNU_SOURCE=1 -Dcpuinfo_EXPORTS -I"/build/reproducible-path/cpuinfo-0.0~git20250110.8a1772a/src" -I"/build/reproducible-path/cpuinfo-0.0~git20250110.8a1772a/include" -g -O2 -Werror=implicit-function-declaration -ffile-prefix-map=/build/reproducible-path/cpuinfo-0.0~git20250110.8a1772a=. -fstack-protector-strong -fstack-clash-protection -Wformat -Werror=format-security -D_LARGEFILE_SOURCE -D_FILE_OFFSET_BITS=64 -D_TIME_BITS=64 -Wdate-time -D_FORTIFY_SOURCE=2 -std=c99 -fPIC -MD -MT CMakeFiles/cpuinfo.dir/src/arm/linux/midr.c.o -MF CMakeFiles/cpuinfo.dir/src/arm/linux/midr.c.o.d -o CMakeFiles/cpuinfo.dir/src/arm/linux/midr.c.o -c '/build/reproducible-path/cpuinfo-0.0~git20250110.8a1772a/src/arm/linux/midr.c'
[11/78] /usr/bin/cc -DCPUINFO_LOG_LEVEL=2 -DCPUINFO_LOG_TO_STDIO=1 -D_GNU_SOURCE=1 -Dcpuinfo_EXPORTS -I"/build/reproducible-path/cpuinfo-0.0~git20250110.8a1772a/src" -I"/build/reproducible-path/cpuinfo-0.0~git20250110.8a1772a/include" -g -O2 -Werror=implicit-function-declaration -ffile-prefix-map=/build/reproducible-path/cpuinfo-0.0~git20250110.8a1772a=. -fstack-protector-strong -fstack-clash-protection -Wformat -Werror=format-security -D_LARGEFILE_SOURCE -D_FILE_OFFSET_BITS=64 -D_TIME_BITS=64 -Wdate-time -D_FORTIFY_SOURCE=2 -std=c99 -fPIC -MD -MT CMakeFiles/cpuinfo.dir/src/linux/smallfile.c.o -MF CMakeFiles/cpuinfo.dir/src/linux/smallfile.c.o.d -o CMakeFiles/cpuinfo.dir/src/linux/smallfile.c.o -c '/build/reproducible-path/cpuinfo-0.0~git20250110.8a1772a/src/linux/smallfile.c'
[12/78] /usr/bin/cc -DCPUINFO_LOG_LEVEL=2 -DCPUINFO_LOG_TO_STDIO=1 -D_GNU_SOURCE=1 -Dcpuinfo_EXPORTS -I"/build/reproducible-path/cpuinfo-0.0~git20250110.8a1772a/src" -I"/build/reproducible-path/cpuinfo-0.0~git20250110.8a1772a/include" -g -O2 -Werror=implicit-function-declaration -ffile-prefix-map=/build/reproducible-path/cpuinfo-0.0~git20250110.8a1772a=. -fstack-protector-strong -fstack-clash-protection -Wformat -Werror=format-security -D_LARGEFILE_SOURCE -D_FILE_OFFSET_BITS=64 -D_TIME_BITS=64 -Wdate-time -D_FORTIFY_SOURCE=2 -std=c99 -fPIC -MD -MT CMakeFiles/cpuinfo.dir/src/arm/linux/init.c.o -MF CMakeFiles/cpuinfo.dir/src/arm/linux/init.c.o.d -o CMakeFiles/cpuinfo.dir/src/arm/linux/init.c.o -c '/build/reproducible-path/cpuinfo-0.0~git20250110.8a1772a/src/arm/linux/init.c'
[13/78] /usr/bin/cc -DCPUINFO_LOG_LEVEL=2 -DCPUINFO_LOG_TO_STDIO=1 -D_GNU_SOURCE=1 -Dcpuinfo_EXPORTS -I"/build/reproducible-path/cpuinfo-0.0~git20250110.8a1772a/src" -I"/build/reproducible-path/cpuinfo-0.0~git20250110.8a1772a/include" -g -O2 -Werror=implicit-function-declaration -ffile-prefix-map=/build/reproducible-path/cpuinfo-0.0~git20250110.8a1772a=. -fstack-protector-strong -fstack-clash-protection -Wformat -Werror=format-security -D_LARGEFILE_SOURCE -D_FILE_OFFSET_BITS=64 -D_TIME_BITS=64 -Wdate-time -D_FORTIFY_SOURCE=2 -std=c99 -fPIC -MD -MT CMakeFiles/cpuinfo.dir/src/arm/linux/cpuinfo.c.o -MF CMakeFiles/cpuinfo.dir/src/arm/linux/cpuinfo.c.o.d -o CMakeFiles/cpuinfo.dir/src/arm/linux/cpuinfo.c.o -c '/build/reproducible-path/cpuinfo-0.0~git20250110.8a1772a/src/arm/linux/cpuinfo.c'
[14/78] /usr/bin/cc -DCPUINFO_LOG_LEVEL=2 -DCPUINFO_LOG_TO_STDIO=1 -D_GNU_SOURCE=1 -Dcpuinfo_EXPORTS -I"/build/reproducible-path/cpuinfo-0.0~git20250110.8a1772a/src" -I"/build/reproducible-path/cpuinfo-0.0~git20250110.8a1772a/include" -g -O2 -Werror=implicit-function-declaration -ffile-prefix-map=/build/reproducible-path/cpuinfo-0.0~git20250110.8a1772a=. -fstack-protector-strong -fstack-clash-protection -Wformat -Werror=format-security -D_LARGEFILE_SOURCE -D_FILE_OFFSET_BITS=64 -D_TIME_BITS=64 -Wdate-time -D_FORTIFY_SOURCE=2 -std=c99 -fPIC -MD -MT CMakeFiles/cpuinfo.dir/src/arm/linux/chipset.c.o -MF CMakeFiles/cpuinfo.dir/src/arm/linux/chipset.c.o.d -o CMakeFiles/cpuinfo.dir/src/arm/linux/chipset.c.o -c '/build/reproducible-path/cpuinfo-0.0~git20250110.8a1772a/src/arm/linux/chipset.c'
ninja: build stopped: subcommand failed.
dh_auto_build: error: cd obj-arm-linux-gnueabihf && LC_ALL=C.UTF-8 ninja -j6 -v returned exit code 1
make: *** [debian/rules:5: binary] Error 25
dpkg-buildpackage: error: debian/rules binary subprocess returned exit status 2
I: copying local configuration
E: Failed autobuilding of package
I: user script /srv/workspace/pbuilder/16425/tmp/hooks/C01_cleanup starting
debug output: disk usage on i-capture-the-hostname at Thu Jan 30 04:54:33 UTC 2025
Filesystem      Size  Used Avail Use% Mounted on
tmpfs           1.9G     0  1.9G   0% /dev/shm

I: user script /srv/workspace/pbuilder/16425/tmp/hooks/C01_cleanup finished
I: unmounting dev/ptmx filesystem
I: unmounting dev/pts filesystem
I: unmounting dev/shm filesystem
I: unmounting proc filesystem
I: unmounting sys filesystem
I: cleaning the build env 
I: removing directory /srv/workspace/pbuilder/16425 and its subdirectories