I: pbuilder: network access will be disabled during build
I: Current time: Thu Mar 13 02:28:55 +14 2025
I: pbuilder-time-stamp: 1741782535
I: Building the build Environment
I: extracting base tarball [/var/cache/pbuilder/trixie-reproducible-base.tgz]
I: copying local configuration
W: --override-config is not set; not updating apt.conf Read the manpage for details.
I: mounting /proc filesystem
I: mounting /sys filesystem
I: creating /{dev,run}/shm
I: mounting /dev/pts filesystem
I: redirecting /dev/ptmx to /dev/pts/ptmx
I: policy-rc.d already exists
I: Copying source file
I: copying [prometheus-alertmanager_0.28.1+ds-1.dsc]
I: copying [./prometheus-alertmanager_0.28.1+ds.orig.tar.gz]
I: copying [./prometheus-alertmanager_0.28.1+ds-1.debian.tar.xz]
I: Extracting source
dpkg-source: warning: cannot verify inline signature for ./prometheus-alertmanager_0.28.1+ds-1.dsc: unsupported subcommand
dpkg-source: info: extracting prometheus-alertmanager in prometheus-alertmanager-0.28.1+ds
dpkg-source: info: unpacking prometheus-alertmanager_0.28.1+ds.orig.tar.gz
dpkg-source: info: unpacking prometheus-alertmanager_0.28.1+ds-1.debian.tar.xz
dpkg-source: info: using patch list from debian/patches/series
dpkg-source: info: applying 0001-Do-not-embed-blobs.patch
dpkg-source: info: applying 0002-Fix-acceptance-test-paths.patch
dpkg-source: info: applying 0003-Debian-defaults.patch
dpkg-source: info: applying 0004-Fix-flaky-tests.patch
dpkg-source: info: applying 0005-Disable-network-tests.patch
dpkg-source: info: applying 0007-Revert-kingpin.v2-import-path.patch
dpkg-source: info: applying 0008-Disable-React-app.patch
dpkg-source: info: applying 0010-Extend-testing-CA-certificates-expiry-date.patch
dpkg-source: info: applying 0011-Disable-Jira-notification.patch
dpkg-source: info: applying 0012-Default-to-legacy-label-name-validation-in-tests.patch
I: Not using root during the build.
I: Installing the build-deps
I: user script /srv/workspace/pbuilder/2508373/tmp/hooks/D01_modify_environment starting
debug: Running on ionos1-amd64.
I: Changing host+domainname to test build reproducibility
I: Adding a custom variable just for the fun of it...
I: Changing /bin/sh to bash
'/bin/sh' -> '/bin/bash'
lrwxrwxrwx 1 root root 9 Mar 12 12:29 /bin/sh -> /bin/bash
I: Setting pbuilder2's login shell to /bin/bash
I: Setting pbuilder2's GECOS to second user,second room,second work-phone,second home-phone,second other
I: user script /srv/workspace/pbuilder/2508373/tmp/hooks/D01_modify_environment finished
I: user script /srv/workspace/pbuilder/2508373/tmp/hooks/D02_print_environment starting
I: set
  BASH=/bin/sh
  BASHOPTS=checkwinsize:cmdhist:complete_fullquote:extquote:force_fignore:globasciiranges:globskipdots:hostcomplete:interactive_comments:patsub_replacement:progcomp:promptvars:sourcepath
  BASH_ALIASES=()
  BASH_ARGC=()
  BASH_ARGV=()
  BASH_CMDS=()
  BASH_LINENO=([0]="12" [1]="0")
  BASH_LOADABLES_PATH=/usr/local/lib/bash:/usr/lib/bash:/opt/local/lib/bash:/usr/pkg/lib/bash:/opt/pkg/lib/bash:.
  BASH_SOURCE=([0]="/tmp/hooks/D02_print_environment" [1]="/tmp/hooks/D02_print_environment")
  BASH_VERSINFO=([0]="5" [1]="2" [2]="37" [3]="1" [4]="release" [5]="x86_64-pc-linux-gnu")
  BASH_VERSION='5.2.37(1)-release'
  BUILDDIR=/build/reproducible-path
  BUILDUSERGECOS='second user,second room,second work-phone,second home-phone,second other'
  BUILDUSERNAME=pbuilder2
  BUILD_ARCH=amd64
  DEBIAN_FRONTEND=noninteractive
  DEB_BUILD_OPTIONS='buildinfo=+all reproducible=+all parallel=20 '
  DIRSTACK=()
  DISTRIBUTION=trixie
  EUID=0
  FUNCNAME=([0]="Echo" [1]="main")
  GROUPS=()
  HOME=/root
  HOSTNAME=i-capture-the-hostname
  HOSTTYPE=x86_64
  HOST_ARCH=amd64
  IFS=' 	
  '
  INVOCATION_ID=69581cbfda004e50b70b049a481b4229
  LANG=C
  LANGUAGE=et_EE:et
  LC_ALL=C
  MACHTYPE=x86_64-pc-linux-gnu
  MAIL=/var/mail/root
  OPTERR=1
  OPTIND=1
  OSTYPE=linux-gnu
  PATH=/usr/sbin:/usr/bin:/sbin:/bin:/usr/games:/i/capture/the/path
  PBCURRENTCOMMANDLINEOPERATION=build
  PBUILDER_OPERATION=build
  PBUILDER_PKGDATADIR=/usr/share/pbuilder
  PBUILDER_PKGLIBDIR=/usr/lib/pbuilder
  PBUILDER_SYSCONFDIR=/etc
  PIPESTATUS=([0]="0")
  POSIXLY_CORRECT=y
  PPID=2508373
  PS4='+ '
  PWD=/
  SHELL=/bin/bash
  SHELLOPTS=braceexpand:errexit:hashall:interactive-comments:posix
  SHLVL=3
  SUDO_COMMAND='/usr/bin/timeout -k 24.1h 24h /usr/bin/ionice -c 3 /usr/bin/nice -n 11 /usr/bin/unshare --uts -- /usr/sbin/pbuilder --build --configfile /srv/reproducible-results/rbuild-debian/r-b-build.aAIRgk8e/pbuilderrc_GLOw --distribution trixie --hookdir /etc/pbuilder/rebuild-hooks --debbuildopts -b --basetgz /var/cache/pbuilder/trixie-reproducible-base.tgz --buildresult /srv/reproducible-results/rbuild-debian/r-b-build.aAIRgk8e/b2 --logfile b2/build.log prometheus-alertmanager_0.28.1+ds-1.dsc'
  SUDO_GID=110
  SUDO_UID=105
  SUDO_USER=jenkins
  TERM=unknown
  TZ=/usr/share/zoneinfo/Etc/GMT-14
  UID=0
  USER=root
  _='I: set'
  http_proxy=http://46.16.76.132:3128
I: uname -a
  Linux i-capture-the-hostname 6.1.0-31-amd64 #1 SMP PREEMPT_DYNAMIC Debian 6.1.128-1 (2025-02-07) x86_64 GNU/Linux
I: ls -l /bin
  lrwxrwxrwx 1 root root 7 Mar  4 11:20 /bin -> usr/bin
I: user script /srv/workspace/pbuilder/2508373/tmp/hooks/D02_print_environment finished
 -> Attempting to satisfy build-dependencies
 -> Creating pbuilder-satisfydepends-dummy package
Package: pbuilder-satisfydepends-dummy
Version: 0.invalid.0
Architecture: amd64
Maintainer: Debian Pbuilder Team <pbuilder-maint@lists.alioth.debian.org>
Description: Dummy package to satisfy dependencies with aptitude - created by pbuilder
 This package was created automatically by pbuilder to satisfy the
 build-dependencies of the package being currently built.
Depends: debhelper-compat (= 13), dh-sequence-bash-completion, dh-sequence-golang, golang-any, golang-github-alecthomas-units-dev, golang-github-aws-aws-sdk-go-dev, golang-github-cenkalti-backoff-dev (>= 4.0.0~), golang-github-cespare-xxhash-dev, golang-github-coder-quartz-dev, golang-github-emersion-go-sasl-dev, golang-github-emersion-go-smtp-dev, golang-github-go-openapi-analysis-dev, golang-github-go-openapi-errors-dev (>= 0.19.5~), golang-github-go-openapi-loads-dev, golang-github-go-openapi-runtime-dev (>= 0.25.0~), golang-github-go-openapi-spec-dev, golang-github-go-openapi-strfmt-dev (>= 0.19.0~), golang-github-go-openapi-swag-dev, golang-github-go-openapi-validate-dev (>= 0.20.3~), golang-github-gofrs-uuid-dev, golang-github-gogo-protobuf-dev, golang-github-hashicorp-go-sockaddr-dev, golang-github-hashicorp-golang-lru-v2-dev, golang-github-hashicorp-memberlist-dev, golang-github-jessevdk-go-flags-dev, golang-github-kimmachinegun-automemlimit-dev, golang-github-kylelemons-godebug-dev, golang-github-oklog-run-dev, golang-github-oklog-ulid-dev, golang-github-pkg-errors-dev, golang-github-prometheus-client-golang-dev (>= 1.19.0), golang-github-prometheus-common-dev (>= 0.33.0~), golang-github-prometheus-exporter-toolkit-dev (>= 0.13.0), golang-github-prometheus-sigv4-dev, golang-github-rs-cors-dev, golang-github-stretchr-testify-dev, golang-github-xlab-treeprint-dev (>= 0.0~git20180615), golang-go.uber-atomic-dev, golang-golang-x-mod-dev, golang-golang-x-net-dev, golang-golang-x-text-dev, golang-gopkg-alecthomas-kingpin.v2-dev, golang-gopkg-telebot.v3-dev, golang-gopkg-yaml.v2-dev, golang-protobuf-extensions-dev, golang-uber-automaxprocs-dev, tzdata
dpkg-deb: building package 'pbuilder-satisfydepends-dummy' in '/tmp/satisfydepends-aptitude/pbuilder-satisfydepends-dummy.deb'.
Selecting previously unselected package pbuilder-satisfydepends-dummy.
(Reading database ... 19800 files and directories currently installed.)
Preparing to unpack .../pbuilder-satisfydepends-dummy.deb ...
Unpacking pbuilder-satisfydepends-dummy (0.invalid.0) ...
dpkg: pbuilder-satisfydepends-dummy: dependency problems, but configuring anyway as you requested:
 pbuilder-satisfydepends-dummy depends on debhelper-compat (= 13); however:
  Package debhelper-compat is not installed.
 pbuilder-satisfydepends-dummy depends on dh-sequence-bash-completion; however:
  Package dh-sequence-bash-completion is not installed.
 pbuilder-satisfydepends-dummy depends on dh-sequence-golang; however:
  Package dh-sequence-golang is not installed.
 pbuilder-satisfydepends-dummy depends on golang-any; however:
  Package golang-any is not installed.
 pbuilder-satisfydepends-dummy depends on golang-github-alecthomas-units-dev; however:
  Package golang-github-alecthomas-units-dev is not installed.
 pbuilder-satisfydepends-dummy depends on golang-github-aws-aws-sdk-go-dev; however:
  Package golang-github-aws-aws-sdk-go-dev is not installed.
 pbuilder-satisfydepends-dummy depends on golang-github-cenkalti-backoff-dev (>= 4.0.0~); however:
  Package golang-github-cenkalti-backoff-dev is not installed.
 pbuilder-satisfydepends-dummy depends on golang-github-cespare-xxhash-dev; however:
  Package golang-github-cespare-xxhash-dev is not installed.
 pbuilder-satisfydepends-dummy depends on golang-github-coder-quartz-dev; however:
  Package golang-github-coder-quartz-dev is not installed.
 pbuilder-satisfydepends-dummy depends on golang-github-emersion-go-sasl-dev; however:
  Package golang-github-emersion-go-sasl-dev is not installed.
 pbuilder-satisfydepends-dummy depends on golang-github-emersion-go-smtp-dev; however:
  Package golang-github-emersion-go-smtp-dev is not installed.
 pbuilder-satisfydepends-dummy depends on golang-github-go-openapi-analysis-dev; however:
  Package golang-github-go-openapi-analysis-dev is not installed.
 pbuilder-satisfydepends-dummy depends on golang-github-go-openapi-errors-dev (>= 0.19.5~); however:
  Package golang-github-go-openapi-errors-dev is not installed.
 pbuilder-satisfydepends-dummy depends on golang-github-go-openapi-loads-dev; however:
  Package golang-github-go-openapi-loads-dev is not installed.
 pbuilder-satisfydepends-dummy depends on golang-github-go-openapi-runtime-dev (>= 0.25.0~); however:
  Package golang-github-go-openapi-runtime-dev is not installed.
 pbuilder-satisfydepends-dummy depends on golang-github-go-openapi-spec-dev; however:
  Package golang-github-go-openapi-spec-dev is not installed.
 pbuilder-satisfydepends-dummy depends on golang-github-go-openapi-strfmt-dev (>= 0.19.0~); however:
  Package golang-github-go-openapi-strfmt-dev is not installed.
 pbuilder-satisfydepends-dummy depends on golang-github-go-openapi-swag-dev; however:
  Package golang-github-go-openapi-swag-dev is not installed.
 pbuilder-satisfydepends-dummy depends on golang-github-go-openapi-validate-dev (>= 0.20.3~); however:
  Package golang-github-go-openapi-validate-dev is not installed.
 pbuilder-satisfydepends-dummy depends on golang-github-gofrs-uuid-dev; however:
  Package golang-github-gofrs-uuid-dev is not installed.
 pbuilder-satisfydepends-dummy depends on golang-github-gogo-protobuf-dev; however:
  Package golang-github-gogo-protobuf-dev is not installed.
 pbuilder-satisfydepends-dummy depends on golang-github-hashicorp-go-sockaddr-dev; however:
  Package golang-github-hashicorp-go-sockaddr-dev is not installed.
 pbuilder-satisfydepends-dummy depends on golang-github-hashicorp-golang-lru-v2-dev; however:
  Package golang-github-hashicorp-golang-lru-v2-dev is not installed.
 pbuilder-satisfydepends-dummy depends on golang-github-hashicorp-memberlist-dev; however:
  Package golang-github-hashicorp-memberlist-dev is not installed.
 pbuilder-satisfydepends-dummy depends on golang-github-jessevdk-go-flags-dev; however:
  Package golang-github-jessevdk-go-flags-dev is not installed.
 pbuilder-satisfydepends-dummy depends on golang-github-kimmachinegun-automemlimit-dev; however:
  Package golang-github-kimmachinegun-automemlimit-dev is not installed.
 pbuilder-satisfydepends-dummy depends on golang-github-kylelemons-godebug-dev; however:
  Package golang-github-kylelemons-godebug-dev is not installed.
 pbuilder-satisfydepends-dummy depends on golang-github-oklog-run-dev; however:
  Package golang-github-oklog-run-dev is not installed.
 pbuilder-satisfydepends-dummy depends on golang-github-oklog-ulid-dev; however:
  Package golang-github-oklog-ulid-dev is not installed.
 pbuilder-satisfydepends-dummy depends on golang-github-pkg-errors-dev; however:
  Package golang-github-pkg-errors-dev is not installed.
 pbuilder-satisfydepends-dummy depends on golang-github-prometheus-client-golang-dev (>= 1.19.0); however:
  Package golang-github-prometheus-client-golang-dev is not installed.
 pbuilder-satisfydepends-dummy depends on golang-github-prometheus-common-dev (>= 0.33.0~); however:
  Package golang-github-prometheus-common-dev is not installed.
 pbuilder-satisfydepends-dummy depends on golang-github-prometheus-exporter-toolkit-dev (>= 0.13.0); however:
  Package golang-github-prometheus-exporter-toolkit-dev is not installed.
 pbuilder-satisfydepends-dummy depends on golang-github-prometheus-sigv4-dev; however:
  Package golang-github-prometheus-sigv4-dev is not installed.
 pbuilder-satisfydepends-dummy depends on golang-github-rs-cors-dev; however:
  Package golang-github-rs-cors-dev is not installed.
 pbuilder-satisfydepends-dummy depends on golang-github-stretchr-testify-dev; however:
  Package golang-github-stretchr-testify-dev is not installed.
 pbuilder-satisfydepends-dummy depends on golang-github-xlab-treeprint-dev (>= 0.0~git20180615); however:
  Package golang-github-xlab-treeprint-dev is not installed.
 pbuilder-satisfydepends-dummy depends on golang-go.uber-atomic-dev; however:
  Package golang-go.uber-atomic-dev is not installed.
 pbuilder-satisfydepends-dummy depends on golang-golang-x-mod-dev; however:
  Package golang-golang-x-mod-dev is not installed.
 pbuilder-satisfydepends-dummy depends on golang-golang-x-net-dev; however:
  Package golang-golang-x-net-dev is not installed.
 pbuilder-satisfydepends-dummy depends on golang-golang-x-text-dev; however:
  Package golang-golang-x-text-dev is not installed.
 pbuilder-satisfydepends-dummy depends on golang-gopkg-alecthomas-kingpin.v2-dev; however:
  Package golang-gopkg-alecthomas-kingpin.v2-dev is not installed.
 pbuilder-satisfydepends-dummy depends on golang-gopkg-telebot.v3-dev; however:
  Package golang-gopkg-telebot.v3-dev is not installed.
 pbuilder-satisfydepends-dummy depends on golang-gopkg-yaml.v2-dev; however:
  Package golang-gopkg-yaml.v2-dev is not installed.
 pbuilder-satisfydepends-dummy depends on golang-protobuf-extensions-dev; however:
  Package golang-protobuf-extensions-dev is not installed.
 pbuilder-satisfydepends-dummy depends on golang-uber-automaxprocs-dev; however:
  Package golang-uber-automaxprocs-dev is not installed.
 pbuilder-satisfydepends-dummy depends on tzdata; however:
  Package tzdata is not installed.

Setting up pbuilder-satisfydepends-dummy (0.invalid.0) ...
Reading package lists...
Building dependency tree...
Reading state information...
Initializing package states...
Writing extended state information...
Building tag database...
pbuilder-satisfydepends-dummy is already installed at the requested version (0.invalid.0)
pbuilder-satisfydepends-dummy is already installed at the requested version (0.invalid.0)
The following NEW packages will be installed:
  autoconf{a} automake{a} autopoint{a} autotools-dev{a} bash-completion{a} bsdextrautils{a} debhelper{a} dh-autoreconf{a} dh-golang{a} dh-strip-nondeterminism{a} dwz{a} file{a} gettext{a} gettext-base{a} golang-1.24-go{a} golang-1.24-src{a} golang-any{a} golang-dbus-dev{a} golang-github-alecthomas-units-dev{a} golang-github-antlr-antlr4-dev{a} golang-github-armon-go-metrics-dev{a} golang-github-asaskevich-govalidator-dev{a} golang-github-aws-aws-sdk-go-dev{a} golang-github-beorn7-perks-dev{a} golang-github-burntsushi-toml-dev{a} golang-github-cenkalti-backoff-dev{a} golang-github-cespare-xxhash-dev{a} golang-github-chzyer-readline-dev{a} golang-github-circonus-labs-circonus-gometrics-dev{a} golang-github-circonus-labs-circonusllhist-dev{a} golang-github-coder-quartz-dev{a} golang-github-coreos-go-systemd-dev{a} golang-github-creack-pty-dev{a} golang-github-datadog-datadog-go-dev{a} golang-github-davecgh-go-spew-dev{a} golang-github-docker-go-units-dev{a} golang-github-emersion-go-sasl-dev{a} golang-github-emersion-go-smtp-dev{a} golang-github-fatih-color-dev{a} golang-github-fsnotify-fsnotify-dev{a} golang-github-gin-contrib-sse-dev{a} golang-github-gin-gonic-gin-dev{a} golang-github-go-kit-log-dev{a} golang-github-go-logfmt-logfmt-dev{a} golang-github-go-logr-logr-dev{a} golang-github-go-logr-stdr-dev{a} golang-github-go-openapi-analysis-dev{a} golang-github-go-openapi-errors-dev{a} golang-github-go-openapi-jsonpointer-dev{a} golang-github-go-openapi-jsonreference-dev{a} golang-github-go-openapi-loads-dev{a} golang-github-go-openapi-runtime-dev{a} golang-github-go-openapi-spec-dev{a} golang-github-go-openapi-strfmt-dev{a} golang-github-go-openapi-swag-dev{a} golang-github-go-openapi-validate-dev{a} golang-github-go-playground-locales-dev{a} golang-github-go-playground-universal-translator-dev{a} golang-github-go-playground-validator-v10-dev{a} golang-github-goccy-go-yaml-dev{a} golang-github-gofrs-uuid-dev{a} golang-github-gogo-protobuf-dev{a} golang-github-golang-groupcache-dev{a} golang-github-golang-mock-dev{a} golang-github-golang-protobuf-1-5-dev{a} golang-github-golang-snappy-dev{a} golang-github-google-btree-dev{a} golang-github-google-cel-go-dev{a} golang-github-google-go-cmp-dev{a} golang-github-google-martian-dev{a} golang-github-google-pprof-dev{a} golang-github-google-uuid-dev{a} golang-github-googleapis-gax-go-dev{a} golang-github-grpc-ecosystem-grpc-gateway-dev{a} golang-github-hashicorp-errwrap-dev{a} golang-github-hashicorp-go-cleanhttp-dev{a} golang-github-hashicorp-go-hclog-dev{a} golang-github-hashicorp-go-immutable-radix-dev{a} golang-github-hashicorp-go-msgpack-dev{a} golang-github-hashicorp-go-multierror-dev{a} golang-github-hashicorp-go-retryablehttp-dev{a} golang-github-hashicorp-go-sockaddr-dev{a} golang-github-hashicorp-go-uuid-dev{a} golang-github-hashicorp-golang-lru-dev{a} golang-github-hashicorp-golang-lru-v2-dev{a} golang-github-hashicorp-hcl-dev{a} golang-github-hashicorp-memberlist-dev{a} golang-github-ianlancetaylor-demangle-dev{a} golang-github-jessevdk-go-flags-dev{a} golang-github-jmespath-go-jmespath-dev{a} golang-github-josharian-intern-dev{a} golang-github-jpillora-backoff-dev{a} golang-github-json-iterator-go-dev{a} golang-github-julienschmidt-httprouter-dev{a} golang-github-kimmachinegun-automemlimit-dev{a} golang-github-klauspost-compress-dev{a} golang-github-kr-fs-dev{a} golang-github-kr-pretty-dev{a} golang-github-kr-text-dev{a} golang-github-kylelemons-godebug-dev{a} golang-github-leodido-go-urn-dev{a} golang-github-magiconair-properties-dev{a} golang-github-mailru-easyjson-dev{a} golang-github-masterminds-semver-dev{a} golang-github-mattn-go-colorable-dev{a} golang-github-mattn-go-isatty-dev{a} golang-github-mdlayher-socket-dev{a} golang-github-mdlayher-vsock-dev{a} golang-github-miekg-dns-dev{a} golang-github-mitchellh-mapstructure-dev{a} golang-github-modern-go-concurrent-dev{a} golang-github-modern-go-reflect2-dev{a} golang-github-montanaflynn-stats-dev{a} golang-github-munnerz-goautoneg-dev{a} golang-github-mwitkow-go-conntrack-dev{a} golang-github-oklog-run-dev{a} golang-github-oklog-ulid-dev{a} golang-github-opentracing-opentracing-go-dev{a} golang-github-pascaldekloe-goe-dev{a} golang-github-pbnjay-memory-dev{a} golang-github-pelletier-go-toml-dev{a} golang-github-pelletier-go-toml.v2-dev{a} golang-github-pkg-errors-dev{a} golang-github-pkg-sftp-dev{a} golang-github-pmezard-go-difflib-dev{a} golang-github-prometheus-client-golang-dev{a} golang-github-prometheus-client-model-dev{a} golang-github-prometheus-common-dev{a} golang-github-prometheus-exporter-toolkit-dev{a} golang-github-prometheus-procfs-dev{a} golang-github-prometheus-sigv4-dev{a} golang-github-rogpeppe-fastuuid-dev{a} golang-github-rogpeppe-go-internal-dev{a} golang-github-rs-cors-dev{a} golang-github-spf13-afero-dev{a} golang-github-spf13-cast-dev{a} golang-github-spf13-jwalterweatherman-dev{a} golang-github-spf13-pflag-dev{a} golang-github-spf13-viper-dev{a} golang-github-stoewer-go-strcase-dev{a} golang-github-stretchr-objx-dev{a} golang-github-stretchr-testify-dev{a} golang-github-subosito-gotenv-dev{a} golang-github-tv42-httpunix-dev{a} golang-github-ugorji-go-codec-dev{a} golang-github-vmihailenco-tagparser-dev{a} golang-github-xdg-go-pbkdf2-dev{a} golang-github-xdg-go-scram-dev{a} golang-github-xdg-go-stringprep-dev{a} golang-github-xlab-treeprint-dev{a} golang-github-youmark-pkcs8-dev{a} golang-github-yuin-goldmark-dev{a} golang-glog-dev{a} golang-go{a} golang-go.opencensus-dev{a} golang-go.uber-atomic-dev{a} golang-golang-x-crypto-dev{a} golang-golang-x-exp-dev{a} golang-golang-x-mod-dev{a} golang-golang-x-net-dev{a} golang-golang-x-oauth2-dev{a} golang-golang-x-oauth2-google-dev{a} golang-golang-x-sync-dev{a} golang-golang-x-sys-dev{a} golang-golang-x-term-dev{a} golang-golang-x-text-dev{a} golang-golang-x-time-dev{a} golang-golang-x-tools-dev{a} golang-golang-x-xerrors-dev{a} golang-google-api-dev{a} golang-google-cloud-compute-metadata-dev{a} golang-google-cloud-dev{a} golang-google-genproto-dev{a} golang-google-grpc-dev{a} golang-google-protobuf-dev{a} golang-gopkg-alecthomas-kingpin.v2-dev{a} golang-gopkg-check.v1-dev{a} golang-gopkg-ini.v1-dev{a} golang-gopkg-mgo.v2-dev{a} golang-gopkg-telebot.v3-dev{a} golang-gopkg-tomb.v2-dev{a} golang-gopkg-vmihailenco-msgpack.v2-dev{a} golang-gopkg-yaml.v2-dev{a} golang-gopkg-yaml.v3-dev{a} golang-mongodb-mongo-driver-dev{a} golang-opentelemetry-otel-dev{a} golang-opentelemetry-proto-dev{a} golang-protobuf-extensions-dev{a} golang-rsc-binaryregexp-dev{a} golang-src{a} golang-uber-automaxprocs-dev{a} groff-base{a} intltool-debian{a} libarchive-zip-perl{a} libcap-dev{a} libdebhelper-perl{a} libelf1t64{a} libfile-stripnondeterminism-perl{a} libicu72{a} libmagic-mgc{a} libmagic1t64{a} libpipeline1{a} libprotobuf-dev{a} libprotobuf-lite32t64{a} libprotobuf32t64{a} libsasl2-2{a} libsasl2-dev{a} libsasl2-modules-db{a} libssl-dev{a} libsystemd-dev{a} libtool{a} libuchardet0{a} libunistring5{a} libxml2{a} m4{a} man-db{a} media-types{a} po-debconf{a} sensible-utils{a} tzdata{a} tzdata-legacy{a} zlib1g-dev{a} 
The following packages are RECOMMENDED but will NOT be installed:
  curl gogoprotobuf libarchive-cpio-perl libltdl-dev libmail-sendmail-perl libsasl2-modules lynx pkgconf wget 
0 packages upgraded, 222 newly installed, 0 to remove and 0 not upgraded.
Need to get 163 MB of archives. After unpacking 1131 MB will be used.
Writing extended state information...
Get: 1 http://deb.debian.org/debian trixie/main amd64 tzdata all 2025a-2 [259 kB]
Get: 2 http://deb.debian.org/debian trixie/main amd64 sensible-utils all 0.0.24 [24.8 kB]
Get: 3 http://deb.debian.org/debian trixie/main amd64 bash-completion all 1:2.16.0-7 [319 kB]
Get: 4 http://deb.debian.org/debian trixie/main amd64 libmagic-mgc amd64 1:5.45-3+b1 [314 kB]
Get: 5 http://deb.debian.org/debian trixie/main amd64 libmagic1t64 amd64 1:5.45-3+b1 [108 kB]
Get: 6 http://deb.debian.org/debian trixie/main amd64 file amd64 1:5.45-3+b1 [43.3 kB]
Get: 7 http://deb.debian.org/debian trixie/main amd64 gettext-base amd64 0.23.1-1 [243 kB]
Get: 8 http://deb.debian.org/debian trixie/main amd64 libuchardet0 amd64 0.0.8-1+b2 [68.9 kB]
Get: 9 http://deb.debian.org/debian trixie/main amd64 groff-base amd64 1.23.0-7 [1185 kB]
Get: 10 http://deb.debian.org/debian trixie/main amd64 bsdextrautils amd64 2.40.4-5 [92.4 kB]
Get: 11 http://deb.debian.org/debian trixie/main amd64 libpipeline1 amd64 1.5.8-1 [42.0 kB]
Get: 12 http://deb.debian.org/debian trixie/main amd64 man-db amd64 2.13.0-1 [1420 kB]
Get: 13 http://deb.debian.org/debian trixie/main amd64 media-types all 13.0.0 [29.3 kB]
Get: 14 http://deb.debian.org/debian trixie/main amd64 m4 amd64 1.4.19-7 [294 kB]
Get: 15 http://deb.debian.org/debian trixie/main amd64 autoconf all 2.72-3 [493 kB]
Get: 16 http://deb.debian.org/debian trixie/main amd64 autotools-dev all 20220109.1 [51.6 kB]
Get: 17 http://deb.debian.org/debian trixie/main amd64 automake all 1:1.17-3 [862 kB]
Get: 18 http://deb.debian.org/debian trixie/main amd64 autopoint all 0.23.1-1 [770 kB]
Get: 19 http://deb.debian.org/debian trixie/main amd64 libdebhelper-perl all 13.24.1 [90.9 kB]
Get: 20 http://deb.debian.org/debian trixie/main amd64 libtool all 2.5.4-4 [539 kB]
Get: 21 http://deb.debian.org/debian trixie/main amd64 dh-autoreconf all 20 [17.1 kB]
Get: 22 http://deb.debian.org/debian trixie/main amd64 libarchive-zip-perl all 1.68-1 [104 kB]
Get: 23 http://deb.debian.org/debian trixie/main amd64 libfile-stripnondeterminism-perl all 1.14.1-2 [19.7 kB]
Get: 24 http://deb.debian.org/debian trixie/main amd64 dh-strip-nondeterminism all 1.14.1-2 [8620 B]
Get: 25 http://deb.debian.org/debian trixie/main amd64 libelf1t64 amd64 0.192-4 [189 kB]
Get: 26 http://deb.debian.org/debian trixie/main amd64 dwz amd64 0.15-1+b1 [110 kB]
Get: 27 http://deb.debian.org/debian trixie/main amd64 libunistring5 amd64 1.3-1 [476 kB]
Get: 28 http://deb.debian.org/debian trixie/main amd64 libicu72 amd64 72.1-6 [9421 kB]
Get: 29 http://deb.debian.org/debian trixie/main amd64 libxml2 amd64 2.12.7+dfsg+really2.9.14-0.2+b2 [699 kB]
Get: 30 http://deb.debian.org/debian trixie/main amd64 gettext amd64 0.23.1-1 [1680 kB]
Get: 31 http://deb.debian.org/debian trixie/main amd64 intltool-debian all 0.35.0+20060710.6 [22.9 kB]
Get: 32 http://deb.debian.org/debian trixie/main amd64 po-debconf all 1.0.21+nmu1 [248 kB]
Get: 33 http://deb.debian.org/debian trixie/main amd64 debhelper all 13.24.1 [920 kB]
Get: 34 http://deb.debian.org/debian trixie/main amd64 dh-golang all 1.63 [24.4 kB]
Get: 35 http://deb.debian.org/debian trixie/main amd64 golang-1.24-src all 1.24.1-1 [21.2 MB]
Get: 36 http://deb.debian.org/debian trixie/main amd64 golang-1.24-go amd64 1.24.1-1 [28.6 MB]
Get: 37 http://deb.debian.org/debian trixie/main amd64 golang-src all 2:1.24~2 [5136 B]
Get: 38 http://deb.debian.org/debian trixie/main amd64 golang-go amd64 2:1.24~2 [44.3 kB]
Get: 39 http://deb.debian.org/debian trixie/main amd64 golang-any amd64 2:1.24~2 [5216 B]
Get: 40 http://deb.debian.org/debian trixie/main amd64 golang-dbus-dev all 5.1.0-1 [63.9 kB]
Get: 41 http://deb.debian.org/debian trixie/main amd64 golang-github-alecthomas-units-dev all 0.0~git20240626.61d1e34-1 [9032 B]
Get: 42 http://deb.debian.org/debian trixie/main amd64 golang-golang-x-exp-dev all 0.0~git20231006.7918f67-2 [105 kB]
Get: 43 http://deb.debian.org/debian trixie/main amd64 golang-github-antlr-antlr4-dev all 4.11.1+ds-2 [98.2 kB]
Get: 44 http://deb.debian.org/debian trixie/main amd64 golang-github-circonus-labs-circonusllhist-dev all 0.0~git20191022.ec08cde-1 [11.1 kB]
Get: 45 http://deb.debian.org/debian trixie/main amd64 golang-github-hashicorp-go-cleanhttp-dev all 0.5.2-1 [10.8 kB]
Get: 46 http://deb.debian.org/debian trixie/main amd64 golang-golang-x-sys-dev all 0.22.0-1 [431 kB]
Get: 47 http://deb.debian.org/debian trixie/main amd64 golang-github-mattn-go-isatty-dev all 0.0.20-1 [6080 B]
Get: 48 http://deb.debian.org/debian trixie/main amd64 golang-github-mattn-go-colorable-dev all 0.1.13-1 [10.3 kB]
Get: 49 http://deb.debian.org/debian trixie/main amd64 golang-github-fatih-color-dev all 1.17.0-1 [13.9 kB]
Get: 50 http://deb.debian.org/debian trixie/main amd64 golang-github-davecgh-go-spew-dev all 1.1.1-3 [30.1 kB]
Get: 51 http://deb.debian.org/debian trixie/main amd64 golang-github-pmezard-go-difflib-dev all 1.0.0-3 [12.3 kB]
Get: 52 http://deb.debian.org/debian trixie/main amd64 golang-github-stretchr-objx-dev all 0.5.2-1 [25.5 kB]
Get: 53 http://deb.debian.org/debian trixie/main amd64 golang-gopkg-yaml.v3-dev all 3.0.1-3 [74.3 kB]
Get: 54 http://deb.debian.org/debian trixie/main amd64 golang-github-stretchr-testify-dev all 1.10.0-1 [78.4 kB]
Get: 55 http://deb.debian.org/debian trixie/main amd64 golang-github-hashicorp-go-hclog-dev all 0.11.0-1 [17.9 kB]
Get: 56 http://deb.debian.org/debian trixie/main amd64 golang-github-hashicorp-go-retryablehttp-dev all 0.7.1-1 [21.3 kB]
Get: 57 http://deb.debian.org/debian trixie/main amd64 golang-github-pkg-errors-dev all 0.9.1-3 [12.9 kB]
Get: 58 http://deb.debian.org/debian trixie/main amd64 golang-github-tv42-httpunix-dev all 0.0~git20150427.b75d861-3 [3956 B]
Get: 59 http://deb.debian.org/debian trixie/main amd64 golang-github-circonus-labs-circonus-gometrics-dev all 2.3.1-4 [65.7 kB]
Get: 60 http://deb.debian.org/debian trixie/main amd64 golang-github-datadog-datadog-go-dev all 2.1.0-3 [14.9 kB]
Get: 61 http://deb.debian.org/debian trixie/main amd64 golang-github-google-go-cmp-dev all 0.6.0-1 [86.6 kB]
Get: 62 http://deb.debian.org/debian trixie/main amd64 golang-google-protobuf-dev all 1.36.5-1 [796 kB]
Get: 63 http://deb.debian.org/debian trixie/main amd64 golang-github-golang-protobuf-1-5-dev all 1.5.4-1 [136 kB]
Get: 64 http://deb.debian.org/debian trixie/main amd64 golang-github-hashicorp-go-uuid-dev all 1.0.3-1 [8636 B]
Get: 65 http://deb.debian.org/debian trixie/main amd64 golang-github-hashicorp-golang-lru-dev all 0.5.4-2 [14.7 kB]
Get: 66 http://deb.debian.org/debian trixie/main amd64 golang-github-hashicorp-go-immutable-radix-dev all 1.3.1-3 [26.2 kB]
Get: 67 http://deb.debian.org/debian trixie/main amd64 golang-github-pascaldekloe-goe-dev all 0.1.0-4 [10.9 kB]
Get: 68 http://deb.debian.org/debian trixie/main amd64 golang-github-beorn7-perks-dev all 1.0.1-3 [12.2 kB]
Get: 69 http://deb.debian.org/debian trixie/main amd64 golang-github-cespare-xxhash-dev all 2.3.0-1 [10.8 kB]
Get: 70 http://deb.debian.org/debian trixie/main amd64 golang-github-modern-go-concurrent-dev all 1.0.3-1.1 [4668 B]
Get: 71 http://deb.debian.org/debian trixie/main amd64 golang-github-modern-go-reflect2-dev all 1.0.2-2 [10.9 kB]
Get: 72 http://deb.debian.org/debian trixie/main amd64 golang-github-json-iterator-go-dev all 1.1.12-2 [62.2 kB]
Get: 73 http://deb.debian.org/debian trixie/main amd64 golang-github-klauspost-compress-dev all 1.18.0+ds1-1 [33.3 MB]
Get: 74 http://deb.debian.org/debian trixie/main amd64 golang-github-kylelemons-godebug-dev all 1.1.0-2 [14.8 kB]
Get: 75 http://deb.debian.org/debian trixie/main amd64 golang-github-prometheus-client-model-dev all 0.6.0-1 [11.2 kB]
Get: 76 http://deb.debian.org/debian trixie/main amd64 golang-gopkg-yaml.v2-dev all 2.4.0-4 [61.5 kB]
Get: 77 http://deb.debian.org/debian trixie/main amd64 golang-github-jmespath-go-jmespath-dev all 0.4.0-2 [91.6 kB]
Get: 78 http://deb.debian.org/debian trixie/main amd64 golang-golang-x-term-dev all 0.22.0-1 [14.8 kB]
Get: 79 http://deb.debian.org/debian trixie/main amd64 golang-golang-x-text-dev all 0.22.0-1 [3995 kB]
Get: 80 http://deb.debian.org/debian trixie/main amd64 golang-golang-x-crypto-dev all 1:0.25.0-1 [1682 kB]
Get: 81 http://deb.debian.org/debian trixie/main amd64 golang-golang-x-net-dev all 1:0.27.0-1 [898 kB]
Get: 82 http://deb.debian.org/debian trixie/main amd64 golang-github-aws-aws-sdk-go-dev all 1.49.0-2 [12.9 MB]
Get: 83 http://deb.debian.org/debian trixie/main amd64 golang-github-go-logfmt-logfmt-dev all 0.5.0-2 [13.4 kB]
Get: 84 http://deb.debian.org/debian trixie/main amd64 golang-github-go-kit-log-dev all 0.2.1-1 [26.9 kB]
Get: 85 http://deb.debian.org/debian trixie/main amd64 golang-github-julienschmidt-httprouter-dev all 1.3.0-2 [19.3 kB]
Get: 86 http://deb.debian.org/debian trixie/main amd64 golang-github-munnerz-goautoneg-dev all 0.0~git20191010.a7dc8b6-2 [4308 B]
Get: 87 http://deb.debian.org/debian trixie/main amd64 golang-github-jpillora-backoff-dev all 1.0.0-1.1 [3712 B]
Get: 88 http://deb.debian.org/debian trixie/main amd64 golang-github-mwitkow-go-conntrack-dev all 0.0~git20190716.2f06839-4 [14.6 kB]
Get: 89 http://deb.debian.org/debian trixie/main amd64 golang-github-prometheus-sigv4-dev all 0.1.2-2 [8484 B]
Get: 90 http://deb.debian.org/debian trixie/main amd64 golang-golang-x-oauth2-dev all 0.27.0-1 [37.2 kB]
Get: 91 http://deb.debian.org/debian trixie/main amd64 golang-gopkg-alecthomas-kingpin.v2-dev all 2.2.6-4 [42.8 kB]
Get: 92 http://deb.debian.org/debian trixie/main amd64 golang-github-prometheus-common-dev all 0.62.0-3 [118 kB]
Get: 93 http://deb.debian.org/debian trixie/main amd64 golang-golang-x-sync-dev all 0.7.0-1 [19.0 kB]
Get: 94 http://deb.debian.org/debian trixie/main amd64 golang-github-prometheus-procfs-dev all 0.15.1-1 [184 kB]
Get: 95 http://deb.debian.org/debian trixie/main amd64 golang-github-prometheus-client-golang-dev all 1.21.1-1 [194 kB]
Get: 96 http://deb.debian.org/debian trixie/main amd64 golang-github-armon-go-metrics-dev all 0.4.1-1 [35.1 kB]
Get: 97 http://deb.debian.org/debian trixie/main amd64 golang-github-asaskevich-govalidator-dev all 11.0.1-1 [47.1 kB]
Get: 98 http://deb.debian.org/debian trixie/main amd64 golang-github-burntsushi-toml-dev all 1.4.0-1 [116 kB]
Get: 99 http://deb.debian.org/debian trixie/main amd64 golang-github-cenkalti-backoff-dev all 4.3.0-1 [11.9 kB]
Get: 100 http://deb.debian.org/debian trixie/main amd64 golang-github-coder-quartz-dev all 0.1.3-2 [12.5 kB]
Get: 101 http://deb.debian.org/debian trixie/main amd64 libcap-dev amd64 1:2.66-5+b1 [535 kB]
Get: 102 http://deb.debian.org/debian trixie/main amd64 libsystemd-dev amd64 257.3-1 [1349 kB]
Get: 103 http://deb.debian.org/debian trixie/main amd64 golang-github-coreos-go-systemd-dev all 22.5.0-1 [57.4 kB]
Get: 104 http://deb.debian.org/debian trixie/main amd64 golang-github-creack-pty-dev all 1.1.21-1 [13.0 kB]
Get: 105 http://deb.debian.org/debian trixie/main amd64 golang-github-docker-go-units-dev all 0.4.0-4 [7908 B]
Get: 106 http://deb.debian.org/debian trixie/main amd64 golang-github-emersion-go-sasl-dev all 0.0~git20230613.1d333a0-1 [8280 B]
Get: 107 http://deb.debian.org/debian trixie/main amd64 golang-github-emersion-go-smtp-dev all 0.21.2-1 [36.7 kB]
Get: 108 http://deb.debian.org/debian trixie/main amd64 golang-github-fsnotify-fsnotify-dev all 1.8.0-1 [61.8 kB]
Get: 109 http://deb.debian.org/debian trixie/main amd64 golang-github-go-logr-logr-dev all 1.4.2-2 [35.4 kB]
Get: 110 http://deb.debian.org/debian trixie/main amd64 golang-github-go-logr-stdr-dev all 1.2.2-4 [5068 B]
Get: 111 http://deb.debian.org/debian trixie/main amd64 golang-github-josharian-intern-dev all 1.0.0-3 [3440 B]
Get: 112 http://deb.debian.org/debian trixie/main amd64 golang-github-mailru-easyjson-dev all 0.7.7-1 [82.5 kB]
Get: 113 http://deb.debian.org/debian trixie/main amd64 golang-github-go-openapi-swag-dev all 1:0.23.0-1 [32.4 kB]
Get: 114 http://deb.debian.org/debian trixie/main amd64 golang-github-go-openapi-jsonpointer-dev all 1:0.21.0-1 [10.6 kB]
Get: 115 http://deb.debian.org/debian trixie/main amd64 golang-github-go-openapi-jsonreference-dev all 1:0.21.0-1 [7664 B]
Get: 116 http://deb.debian.org/debian trixie/main amd64 golang-github-go-openapi-spec-dev all 1:0.21.0-1 [214 kB]
Get: 117 http://deb.debian.org/debian trixie/main amd64 golang-github-go-openapi-errors-dev all 0.22.0-1 [12.2 kB]
Get: 118 http://deb.debian.org/debian trixie/main amd64 golang-github-google-uuid-dev all 1.6.0-1 [20.6 kB]
Get: 119 http://deb.debian.org/debian trixie/main amd64 golang-github-mitchellh-mapstructure-dev all 1.5.0+git20231216.8508981-1 [29.3 kB]
Get: 120 http://deb.debian.org/debian trixie/main amd64 golang-github-oklog-ulid-dev all 2.0.2+ds-2 [12.2 kB]
Get: 121 http://deb.debian.org/debian trixie/main amd64 golang-github-golang-snappy-dev all 0.0.2-3 [53.9 kB]
Get: 122 http://deb.debian.org/debian trixie/main amd64 golang-github-montanaflynn-stats-dev all 0.7.1-1 [37.3 kB]
Get: 123 http://deb.debian.org/debian trixie/main amd64 golang-github-xdg-go-pbkdf2-dev all 1.0.0-3 [5084 B]
Get: 124 http://deb.debian.org/debian trixie/main amd64 golang-github-xdg-go-stringprep-dev all 1.0.4-1 [15.5 kB]
Get: 125 http://deb.debian.org/debian trixie/main amd64 golang-github-xdg-go-scram-dev all 1.1.2-1 [15.6 kB]
Get: 126 http://deb.debian.org/debian trixie/main amd64 golang-github-youmark-pkcs8-dev all 1.1-3 [10.7 kB]
Get: 127 http://deb.debian.org/debian trixie/main amd64 golang-mongodb-mongo-driver-dev all 1.17.1+ds1-1 [3084 kB]
Get: 128 http://deb.debian.org/debian trixie/main amd64 golang-github-go-openapi-strfmt-dev all 0.23.0-1 [27.8 kB]
Get: 129 http://deb.debian.org/debian trixie/main amd64 golang-github-go-openapi-validate-dev all 0.24.0-2 [338 kB]
Get: 130 http://deb.debian.org/debian trixie/main amd64 golang-github-go-openapi-loads-dev all 0.22.0-1 [36.4 kB]
Get: 131 http://deb.debian.org/debian trixie/main amd64 golang-github-go-openapi-analysis-dev all 0.23.0-1 [167 kB]
Get: 132 http://deb.debian.org/debian trixie/main amd64 golang-github-opentracing-opentracing-go-dev all 1.2.0-2 [29.5 kB]
Get: 133 http://deb.debian.org/debian trixie/main amd64 golang-github-masterminds-semver-dev all 3.2.0-1 [22.2 kB]
Get: 134 http://deb.debian.org/debian trixie/main amd64 golang-github-stoewer-go-strcase-dev all 1.2.0-4 [5556 B]
Get: 135 http://deb.debian.org/debian trixie/main amd64 golang-google-genproto-dev all 0.0~git20210726.e7812ac-4 [5301 kB]
Get: 136 http://deb.debian.org/debian trixie/main amd64 golang-github-google-cel-go-dev all 0.18.2+ds-5 [400 kB]
Get: 137 http://deb.debian.org/debian trixie/main amd64 golang-glog-dev all 1.2.4-1 [32.2 kB]
Get: 138 http://deb.debian.org/debian trixie/main amd64 golang-github-golang-groupcache-dev all 0.0~git20210331.41bb18b-1 [23.2 kB]
Get: 139 http://deb.debian.org/debian trixie/main amd64 golang-go.opencensus-dev all 0.24.0-2 [134 kB]
Get: 140 http://deb.debian.org/debian trixie/main amd64 golang-google-cloud-compute-metadata-dev all 0.56.0-5 [32.4 kB]
Get: 141 http://deb.debian.org/debian trixie/main amd64 golang-golang-x-oauth2-google-dev all 0.27.0-1 [49.9 kB]
Get: 142 http://deb.debian.org/debian trixie/main amd64 golang-github-golang-mock-dev all 1.6.0-2 [48.0 kB]
Get: 143 http://deb.debian.org/debian trixie/main amd64 golang-github-google-btree-dev all 1.0.1-1 [13.5 kB]
Get: 144 http://deb.debian.org/debian trixie/main amd64 golang-github-google-martian-dev all 3.3.2-3 [110 kB]
Get: 145 http://deb.debian.org/debian trixie/main amd64 golang-github-chzyer-readline-dev all 1.4.39.g2972be2-3 [30.8 kB]
Get: 146 http://deb.debian.org/debian trixie/main amd64 golang-github-ianlancetaylor-demangle-dev all 0.0~git20200824.28f6c0f-2 [49.1 kB]
Get: 147 http://deb.debian.org/debian trixie/main amd64 golang-github-google-pprof-dev all 0.0~git20211008.947d60d-1 [977 kB]
Get: 148 http://deb.debian.org/debian trixie/main amd64 golang-github-googleapis-gax-go-dev all 2.14.1-1 [34.7 kB]
Get: 149 http://deb.debian.org/debian trixie/main amd64 golang-golang-x-time-dev all 0.5.0-1 [12.9 kB]
Get: 150 http://deb.debian.org/debian trixie/main amd64 golang-google-api-dev all 0.61.0-5 [5343 kB]
Get: 151 http://deb.debian.org/debian trixie/main amd64 golang-rsc-binaryregexp-dev all 0.2.0-3 [419 kB]
Get: 152 http://deb.debian.org/debian trixie/main amd64 golang-google-cloud-dev all 0.56.0-5 [816 kB]
Get: 153 http://deb.debian.org/debian trixie/main amd64 golang-google-grpc-dev all 1.64.0-6 [1232 kB]
Get: 154 http://deb.debian.org/debian trixie/main amd64 golang-github-rogpeppe-fastuuid-dev all 0.0~git20150106.0.6724a57-2.1 [4292 B]
Get: 155 http://deb.debian.org/debian trixie/main amd64 golang-github-grpc-ecosystem-grpc-gateway-dev all 2.20.0-2 [377 kB]
Get: 156 http://deb.debian.org/debian trixie/main amd64 golang-opentelemetry-proto-dev all 1.3.1-2 [48.3 kB]
Get: 157 http://deb.debian.org/debian trixie/main amd64 golang-opentelemetry-otel-dev all 1.31.0-3 [519 kB]
Get: 158 http://deb.debian.org/debian trixie/main amd64 golang-github-go-openapi-runtime-dev all 0.28.0-1 [116 kB]
Get: 159 http://deb.debian.org/debian trixie/main amd64 golang-github-go-playground-locales-dev all 0.14.0-3 [459 kB]
Get: 160 http://deb.debian.org/debian trixie/main amd64 golang-github-go-playground-universal-translator-dev all 0.17.0-2 [14.4 kB]
Get: 161 http://deb.debian.org/debian trixie/main amd64 golang-github-leodido-go-urn-dev all 1.2.1-3 [9720 B]
Get: 162 http://deb.debian.org/debian trixie/main amd64 golang-github-go-playground-validator-v10-dev all 10.4.1-4 [94.3 kB]
Get: 163 http://deb.debian.org/debian trixie/main amd64 golang-golang-x-xerrors-dev all 0.0~git20231012.104605a-1 [14.6 kB]
Get: 164 http://deb.debian.org/debian trixie/main amd64 golang-github-goccy-go-yaml-dev all 1.9.5-2 [69.9 kB]
Get: 165 http://deb.debian.org/debian trixie/main amd64 golang-github-gofrs-uuid-dev all 5.3.1-1 [22.6 kB]
Get: 166 http://deb.debian.org/debian trixie/main amd64 zlib1g-dev amd64 1:1.3.dfsg+really1.3.1-1+b1 [920 kB]
Get: 167 http://deb.debian.org/debian trixie/main amd64 libprotobuf32t64 amd64 3.21.12-10+b6 [981 kB]
Get: 168 http://deb.debian.org/debian trixie/main amd64 libprotobuf-lite32t64 amd64 3.21.12-10+b6 [274 kB]
Get: 169 http://deb.debian.org/debian trixie/main amd64 libprotobuf-dev amd64 3.21.12-10+b6 [1328 kB]
Get: 170 http://deb.debian.org/debian trixie/main amd64 golang-github-gogo-protobuf-dev all 1.3.2-3 [849 kB]
Get: 171 http://deb.debian.org/debian trixie/main amd64 golang-github-hashicorp-errwrap-dev all 1.1.0-1 [6168 B]
Get: 172 http://deb.debian.org/debian trixie/main amd64 golang-github-vmihailenco-tagparser-dev all 0.1.1-4 [4684 B]
Get: 173 http://deb.debian.org/debian trixie/main amd64 golang-gopkg-vmihailenco-msgpack.v2-dev all 4.3.1-2 [27.5 kB]
Get: 174 http://deb.debian.org/debian trixie/main amd64 golang-gopkg-tomb.v2-dev all 0.0~git20161208.d5d1b58-3 [6840 B]
Get: 175 http://deb.debian.org/debian trixie/main amd64 libsasl2-modules-db amd64 2.1.28+dfsg1-9 [19.8 kB]
Get: 176 http://deb.debian.org/debian trixie/main amd64 libsasl2-2 amd64 2.1.28+dfsg1-9 [57.5 kB]
Get: 177 http://deb.debian.org/debian trixie/main amd64 libssl-dev amd64 3.4.1-1 [2787 kB]
Get: 178 http://deb.debian.org/debian trixie/main amd64 libsasl2-dev amd64 2.1.28+dfsg1-9 [234 kB]
Get: 179 http://deb.debian.org/debian trixie/main amd64 golang-github-kr-text-dev all 0.2.0-2 [10.2 kB]
Get: 180 http://deb.debian.org/debian trixie/main amd64 golang-golang-x-mod-dev all 0.19.0-1 [104 kB]
Get: 181 http://deb.debian.org/debian trixie/main amd64 golang-github-yuin-goldmark-dev all 1.7.4-1 [113 kB]
Get: 182 http://deb.debian.org/debian trixie/main amd64 golang-golang-x-tools-dev all 1:0.25.0+ds-1 [1608 kB]
Get: 183 http://deb.debian.org/debian trixie/main amd64 golang-github-rogpeppe-go-internal-dev all 1.12.0-3 [103 kB]
Get: 184 http://deb.debian.org/debian trixie/main amd64 golang-github-kr-pretty-dev all 0.3.1-1 [11.9 kB]
Get: 185 http://deb.debian.org/debian trixie/main amd64 golang-gopkg-check.v1-dev all 0.0+git20200902.038fdea-2 [31.2 kB]
Get: 186 http://deb.debian.org/debian trixie/main amd64 golang-gopkg-mgo.v2-dev all 2016.08.01-7 [316 kB]
Get: 187 http://deb.debian.org/debian trixie/main amd64 golang-github-hashicorp-go-msgpack-dev all 0.5.5-1 [43.3 kB]
Get: 188 http://deb.debian.org/debian trixie/main amd64 golang-github-hashicorp-go-multierror-dev all 1.1.1-2 [7804 B]
Get: 189 http://deb.debian.org/debian trixie/main amd64 golang-github-hashicorp-go-sockaddr-dev all 1.0.2-2 [54.4 kB]
Get: 190 http://deb.debian.org/debian trixie/main amd64 golang-github-hashicorp-golang-lru-v2-dev all 2.0.7-2 [20.8 kB]
Get: 191 http://deb.debian.org/debian trixie/main amd64 golang-github-hashicorp-hcl-dev all 1.0.0-1.1 [58.8 kB]
Get: 192 http://deb.debian.org/debian trixie/main amd64 golang-github-miekg-dns-dev all 1.1.63-1 [180 kB]
Get: 193 http://deb.debian.org/debian trixie/main amd64 golang-github-hashicorp-memberlist-dev all 0.5.0-1 [86.8 kB]
Get: 194 http://deb.debian.org/debian trixie/main amd64 golang-github-jessevdk-go-flags-dev all 1.4.0-6 [48.2 kB]
Get: 195 http://deb.debian.org/debian trixie/main amd64 golang-github-pbnjay-memory-dev all 0.0~git20210728.7b4eea6-2 [4480 B]
Get: 196 http://deb.debian.org/debian trixie/main amd64 golang-github-kimmachinegun-automemlimit-dev all 0.7.1-1 [12.6 kB]
Get: 197 http://deb.debian.org/debian trixie/main amd64 golang-github-kr-fs-dev all 0.1.0-2 [6412 B]
Get: 198 http://deb.debian.org/debian trixie/main amd64 golang-github-magiconair-properties-dev all 1.8.7-1 [29.5 kB]
Get: 199 http://deb.debian.org/debian trixie/main amd64 golang-github-mdlayher-socket-dev all 0.5.1-1 [22.6 kB]
Get: 200 http://deb.debian.org/debian trixie/main amd64 golang-github-mdlayher-vsock-dev all 1.2.1-2 [16.5 kB]
Get: 201 http://deb.debian.org/debian trixie/main amd64 golang-github-oklog-run-dev all 1.1.0-2 [5804 B]
Get: 202 http://deb.debian.org/debian trixie/main amd64 golang-github-pelletier-go-toml-dev all 1.9.5-1 [77.6 kB]
Get: 203 http://deb.debian.org/debian trixie/main amd64 golang-github-pelletier-go-toml.v2-dev all 2.2.1-1 [876 kB]
Get: 204 http://deb.debian.org/debian trixie/main amd64 golang-github-pkg-sftp-dev all 1.13.6-1 [102 kB]
Get: 205 http://deb.debian.org/debian trixie/main amd64 golang-github-prometheus-exporter-toolkit-dev all 0.14.0-1 [34.3 kB]
Get: 206 http://deb.debian.org/debian trixie/main amd64 golang-github-gin-contrib-sse-dev all 0.1.0-2 [6872 B]
Get: 207 http://deb.debian.org/debian trixie/main amd64 golang-github-ugorji-go-codec-dev all 1.2.8-1 [234 kB]
Get: 208 http://deb.debian.org/debian trixie/main amd64 golang-github-gin-gonic-gin-dev all 1.8.1-2 [107 kB]
Get: 209 http://deb.debian.org/debian trixie/main amd64 golang-github-rs-cors-dev all 1.7.0-4 [14.0 kB]
Get: 210 http://deb.debian.org/debian trixie/main amd64 golang-github-spf13-afero-dev all 1.11.0-1 [58.3 kB]
Get: 211 http://deb.debian.org/debian trixie/main amd64 tzdata-legacy all 2025a-2 [178 kB]
Get: 212 http://deb.debian.org/debian trixie/main amd64 golang-github-spf13-cast-dev all 1.6.0-2 [14.0 kB]
Get: 213 http://deb.debian.org/debian trixie/main amd64 golang-github-spf13-jwalterweatherman-dev all 1.1.0+really1.1.0-2 [8084 B]
Get: 214 http://deb.debian.org/debian trixie/main amd64 golang-github-spf13-pflag-dev all 1.0.6~git20210604-d5e0c0615ace-1 [43.0 kB]
Get: 215 http://deb.debian.org/debian trixie/main amd64 golang-github-subosito-gotenv-dev all 1.3.0-1 [9340 B]
Get: 216 http://deb.debian.org/debian trixie/main amd64 golang-gopkg-ini.v1-dev all 1.67.0-1 [39.9 kB]
Get: 217 http://deb.debian.org/debian trixie/main amd64 golang-github-spf13-viper-dev all 1.12.0-1 [68.9 kB]
Get: 218 http://deb.debian.org/debian trixie/main amd64 golang-github-xlab-treeprint-dev all 1.2.0-2 [8632 B]
Get: 219 http://deb.debian.org/debian trixie/main amd64 golang-gopkg-telebot.v3-dev all 3.3.8-1 [103 kB]
Get: 220 http://deb.debian.org/debian trixie/main amd64 golang-protobuf-extensions-dev all 1.0.4-2 [29.7 kB]
Get: 221 http://deb.debian.org/debian trixie/main amd64 golang-uber-automaxprocs-dev all 1.5.3-1 [22.3 kB]
Get: 222 http://deb.debian.org/debian trixie/main amd64 golang-go.uber-atomic-dev all 1.11.0-1 [17.7 kB]
Fetched 163 MB in 12s (13.8 MB/s)
Preconfiguring packages ...
Selecting previously unselected package tzdata.
(Reading database ... 
(Reading database ... 5%
(Reading database ... 10%
(Reading database ... 15%
(Reading database ... 20%
(Reading database ... 25%
(Reading database ... 30%
(Reading database ... 35%
(Reading database ... 40%
(Reading database ... 45%
(Reading database ... 50%
(Reading database ... 55%
(Reading database ... 60%
(Reading database ... 65%
(Reading database ... 70%
(Reading database ... 75%
(Reading database ... 80%
(Reading database ... 85%
(Reading database ... 90%
(Reading database ... 95%
(Reading database ... 100%
(Reading database ... 19800 files and directories currently installed.)
Preparing to unpack .../000-tzdata_2025a-2_all.deb ...
Unpacking tzdata (2025a-2) ...
Selecting previously unselected package sensible-utils.
Preparing to unpack .../001-sensible-utils_0.0.24_all.deb ...
Unpacking sensible-utils (0.0.24) ...
Selecting previously unselected package bash-completion.
Preparing to unpack .../002-bash-completion_1%3a2.16.0-7_all.deb ...
Unpacking bash-completion (1:2.16.0-7) ...
Selecting previously unselected package libmagic-mgc.
Preparing to unpack .../003-libmagic-mgc_1%3a5.45-3+b1_amd64.deb ...
Unpacking libmagic-mgc (1:5.45-3+b1) ...
Selecting previously unselected package libmagic1t64:amd64.
Preparing to unpack .../004-libmagic1t64_1%3a5.45-3+b1_amd64.deb ...
Unpacking libmagic1t64:amd64 (1:5.45-3+b1) ...
Selecting previously unselected package file.
Preparing to unpack .../005-file_1%3a5.45-3+b1_amd64.deb ...
Unpacking file (1:5.45-3+b1) ...
Selecting previously unselected package gettext-base.
Preparing to unpack .../006-gettext-base_0.23.1-1_amd64.deb ...
Unpacking gettext-base (0.23.1-1) ...
Selecting previously unselected package libuchardet0:amd64.
Preparing to unpack .../007-libuchardet0_0.0.8-1+b2_amd64.deb ...
Unpacking libuchardet0:amd64 (0.0.8-1+b2) ...
Selecting previously unselected package groff-base.
Preparing to unpack .../008-groff-base_1.23.0-7_amd64.deb ...
Unpacking groff-base (1.23.0-7) ...
Selecting previously unselected package bsdextrautils.
Preparing to unpack .../009-bsdextrautils_2.40.4-5_amd64.deb ...
Unpacking bsdextrautils (2.40.4-5) ...
Selecting previously unselected package libpipeline1:amd64.
Preparing to unpack .../010-libpipeline1_1.5.8-1_amd64.deb ...
Unpacking libpipeline1:amd64 (1.5.8-1) ...
Selecting previously unselected package man-db.
Preparing to unpack .../011-man-db_2.13.0-1_amd64.deb ...
Unpacking man-db (2.13.0-1) ...
Selecting previously unselected package media-types.
Preparing to unpack .../012-media-types_13.0.0_all.deb ...
Unpacking media-types (13.0.0) ...
Selecting previously unselected package m4.
Preparing to unpack .../013-m4_1.4.19-7_amd64.deb ...
Unpacking m4 (1.4.19-7) ...
Selecting previously unselected package autoconf.
Preparing to unpack .../014-autoconf_2.72-3_all.deb ...
Unpacking autoconf (2.72-3) ...
Selecting previously unselected package autotools-dev.
Preparing to unpack .../015-autotools-dev_20220109.1_all.deb ...
Unpacking autotools-dev (20220109.1) ...
Selecting previously unselected package automake.
Preparing to unpack .../016-automake_1%3a1.17-3_all.deb ...
Unpacking automake (1:1.17-3) ...
Selecting previously unselected package autopoint.
Preparing to unpack .../017-autopoint_0.23.1-1_all.deb ...
Unpacking autopoint (0.23.1-1) ...
Selecting previously unselected package libdebhelper-perl.
Preparing to unpack .../018-libdebhelper-perl_13.24.1_all.deb ...
Unpacking libdebhelper-perl (13.24.1) ...
Selecting previously unselected package libtool.
Preparing to unpack .../019-libtool_2.5.4-4_all.deb ...
Unpacking libtool (2.5.4-4) ...
Selecting previously unselected package dh-autoreconf.
Preparing to unpack .../020-dh-autoreconf_20_all.deb ...
Unpacking dh-autoreconf (20) ...
Selecting previously unselected package libarchive-zip-perl.
Preparing to unpack .../021-libarchive-zip-perl_1.68-1_all.deb ...
Unpacking libarchive-zip-perl (1.68-1) ...
Selecting previously unselected package libfile-stripnondeterminism-perl.
Preparing to unpack .../022-libfile-stripnondeterminism-perl_1.14.1-2_all.deb ...
Unpacking libfile-stripnondeterminism-perl (1.14.1-2) ...
Selecting previously unselected package dh-strip-nondeterminism.
Preparing to unpack .../023-dh-strip-nondeterminism_1.14.1-2_all.deb ...
Unpacking dh-strip-nondeterminism (1.14.1-2) ...
Selecting previously unselected package libelf1t64:amd64.
Preparing to unpack .../024-libelf1t64_0.192-4_amd64.deb ...
Unpacking libelf1t64:amd64 (0.192-4) ...
Selecting previously unselected package dwz.
Preparing to unpack .../025-dwz_0.15-1+b1_amd64.deb ...
Unpacking dwz (0.15-1+b1) ...
Selecting previously unselected package libunistring5:amd64.
Preparing to unpack .../026-libunistring5_1.3-1_amd64.deb ...
Unpacking libunistring5:amd64 (1.3-1) ...
Selecting previously unselected package libicu72:amd64.
Preparing to unpack .../027-libicu72_72.1-6_amd64.deb ...
Unpacking libicu72:amd64 (72.1-6) ...
Selecting previously unselected package libxml2:amd64.
Preparing to unpack .../028-libxml2_2.12.7+dfsg+really2.9.14-0.2+b2_amd64.deb ...
Unpacking libxml2:amd64 (2.12.7+dfsg+really2.9.14-0.2+b2) ...
Selecting previously unselected package gettext.
Preparing to unpack .../029-gettext_0.23.1-1_amd64.deb ...
Unpacking gettext (0.23.1-1) ...
Selecting previously unselected package intltool-debian.
Preparing to unpack .../030-intltool-debian_0.35.0+20060710.6_all.deb ...
Unpacking intltool-debian (0.35.0+20060710.6) ...
Selecting previously unselected package po-debconf.
Preparing to unpack .../031-po-debconf_1.0.21+nmu1_all.deb ...
Unpacking po-debconf (1.0.21+nmu1) ...
Selecting previously unselected package debhelper.
Preparing to unpack .../032-debhelper_13.24.1_all.deb ...
Unpacking debhelper (13.24.1) ...
Selecting previously unselected package dh-golang.
Preparing to unpack .../033-dh-golang_1.63_all.deb ...
Unpacking dh-golang (1.63) ...
Selecting previously unselected package golang-1.24-src.
Preparing to unpack .../034-golang-1.24-src_1.24.1-1_all.deb ...
Unpacking golang-1.24-src (1.24.1-1) ...
Selecting previously unselected package golang-1.24-go.
Preparing to unpack .../035-golang-1.24-go_1.24.1-1_amd64.deb ...
Unpacking golang-1.24-go (1.24.1-1) ...
Selecting previously unselected package golang-src.
Preparing to unpack .../036-golang-src_2%3a1.24~2_all.deb ...
Unpacking golang-src (2:1.24~2) ...
Selecting previously unselected package golang-go:amd64.
Preparing to unpack .../037-golang-go_2%3a1.24~2_amd64.deb ...
Unpacking golang-go:amd64 (2:1.24~2) ...
Selecting previously unselected package golang-any:amd64.
Preparing to unpack .../038-golang-any_2%3a1.24~2_amd64.deb ...
Unpacking golang-any:amd64 (2:1.24~2) ...
Selecting previously unselected package golang-dbus-dev.
Preparing to unpack .../039-golang-dbus-dev_5.1.0-1_all.deb ...
Unpacking golang-dbus-dev (5.1.0-1) ...
Selecting previously unselected package golang-github-alecthomas-units-dev.
Preparing to unpack .../040-golang-github-alecthomas-units-dev_0.0~git20240626.61d1e34-1_all.deb ...
Unpacking golang-github-alecthomas-units-dev (0.0~git20240626.61d1e34-1) ...
Selecting previously unselected package golang-golang-x-exp-dev.
Preparing to unpack .../041-golang-golang-x-exp-dev_0.0~git20231006.7918f67-2_all.deb ...
Unpacking golang-golang-x-exp-dev (0.0~git20231006.7918f67-2) ...
Selecting previously unselected package golang-github-antlr-antlr4-dev.
Preparing to unpack .../042-golang-github-antlr-antlr4-dev_4.11.1+ds-2_all.deb ...
Unpacking golang-github-antlr-antlr4-dev (4.11.1+ds-2) ...
Selecting previously unselected package golang-github-circonus-labs-circonusllhist-dev.
Preparing to unpack .../043-golang-github-circonus-labs-circonusllhist-dev_0.0~git20191022.ec08cde-1_all.deb ...
Unpacking golang-github-circonus-labs-circonusllhist-dev (0.0~git20191022.ec08cde-1) ...
Selecting previously unselected package golang-github-hashicorp-go-cleanhttp-dev.
Preparing to unpack .../044-golang-github-hashicorp-go-cleanhttp-dev_0.5.2-1_all.deb ...
Unpacking golang-github-hashicorp-go-cleanhttp-dev (0.5.2-1) ...
Selecting previously unselected package golang-golang-x-sys-dev.
Preparing to unpack .../045-golang-golang-x-sys-dev_0.22.0-1_all.deb ...
Unpacking golang-golang-x-sys-dev (0.22.0-1) ...
Selecting previously unselected package golang-github-mattn-go-isatty-dev.
Preparing to unpack .../046-golang-github-mattn-go-isatty-dev_0.0.20-1_all.deb ...
Unpacking golang-github-mattn-go-isatty-dev (0.0.20-1) ...
Selecting previously unselected package golang-github-mattn-go-colorable-dev.
Preparing to unpack .../047-golang-github-mattn-go-colorable-dev_0.1.13-1_all.deb ...
Unpacking golang-github-mattn-go-colorable-dev (0.1.13-1) ...
Selecting previously unselected package golang-github-fatih-color-dev.
Preparing to unpack .../048-golang-github-fatih-color-dev_1.17.0-1_all.deb ...
Unpacking golang-github-fatih-color-dev (1.17.0-1) ...
Selecting previously unselected package golang-github-davecgh-go-spew-dev.
Preparing to unpack .../049-golang-github-davecgh-go-spew-dev_1.1.1-3_all.deb ...
Unpacking golang-github-davecgh-go-spew-dev (1.1.1-3) ...
Selecting previously unselected package golang-github-pmezard-go-difflib-dev.
Preparing to unpack .../050-golang-github-pmezard-go-difflib-dev_1.0.0-3_all.deb ...
Unpacking golang-github-pmezard-go-difflib-dev (1.0.0-3) ...
Selecting previously unselected package golang-github-stretchr-objx-dev.
Preparing to unpack .../051-golang-github-stretchr-objx-dev_0.5.2-1_all.deb ...
Unpacking golang-github-stretchr-objx-dev (0.5.2-1) ...
Selecting previously unselected package golang-gopkg-yaml.v3-dev.
Preparing to unpack .../052-golang-gopkg-yaml.v3-dev_3.0.1-3_all.deb ...
Unpacking golang-gopkg-yaml.v3-dev (3.0.1-3) ...
Selecting previously unselected package golang-github-stretchr-testify-dev.
Preparing to unpack .../053-golang-github-stretchr-testify-dev_1.10.0-1_all.deb ...
Unpacking golang-github-stretchr-testify-dev (1.10.0-1) ...
Selecting previously unselected package golang-github-hashicorp-go-hclog-dev.
Preparing to unpack .../054-golang-github-hashicorp-go-hclog-dev_0.11.0-1_all.deb ...
Unpacking golang-github-hashicorp-go-hclog-dev (0.11.0-1) ...
Selecting previously unselected package golang-github-hashicorp-go-retryablehttp-dev.
Preparing to unpack .../055-golang-github-hashicorp-go-retryablehttp-dev_0.7.1-1_all.deb ...
Unpacking golang-github-hashicorp-go-retryablehttp-dev (0.7.1-1) ...
Selecting previously unselected package golang-github-pkg-errors-dev.
Preparing to unpack .../056-golang-github-pkg-errors-dev_0.9.1-3_all.deb ...
Unpacking golang-github-pkg-errors-dev (0.9.1-3) ...
Selecting previously unselected package golang-github-tv42-httpunix-dev.
Preparing to unpack .../057-golang-github-tv42-httpunix-dev_0.0~git20150427.b75d861-3_all.deb ...
Unpacking golang-github-tv42-httpunix-dev (0.0~git20150427.b75d861-3) ...
Selecting previously unselected package golang-github-circonus-labs-circonus-gometrics-dev.
Preparing to unpack .../058-golang-github-circonus-labs-circonus-gometrics-dev_2.3.1-4_all.deb ...
Unpacking golang-github-circonus-labs-circonus-gometrics-dev (2.3.1-4) ...
Selecting previously unselected package golang-github-datadog-datadog-go-dev.
Preparing to unpack .../059-golang-github-datadog-datadog-go-dev_2.1.0-3_all.deb ...
Unpacking golang-github-datadog-datadog-go-dev (2.1.0-3) ...
Selecting previously unselected package golang-github-google-go-cmp-dev.
Preparing to unpack .../060-golang-github-google-go-cmp-dev_0.6.0-1_all.deb ...
Unpacking golang-github-google-go-cmp-dev (0.6.0-1) ...
Selecting previously unselected package golang-google-protobuf-dev.
Preparing to unpack .../061-golang-google-protobuf-dev_1.36.5-1_all.deb ...
Unpacking golang-google-protobuf-dev (1.36.5-1) ...
Selecting previously unselected package golang-github-golang-protobuf-1-5-dev.
Preparing to unpack .../062-golang-github-golang-protobuf-1-5-dev_1.5.4-1_all.deb ...
Unpacking golang-github-golang-protobuf-1-5-dev (1.5.4-1) ...
Selecting previously unselected package golang-github-hashicorp-go-uuid-dev.
Preparing to unpack .../063-golang-github-hashicorp-go-uuid-dev_1.0.3-1_all.deb ...
Unpacking golang-github-hashicorp-go-uuid-dev (1.0.3-1) ...
Selecting previously unselected package golang-github-hashicorp-golang-lru-dev.
Preparing to unpack .../064-golang-github-hashicorp-golang-lru-dev_0.5.4-2_all.deb ...
Unpacking golang-github-hashicorp-golang-lru-dev (0.5.4-2) ...
Selecting previously unselected package golang-github-hashicorp-go-immutable-radix-dev.
Preparing to unpack .../065-golang-github-hashicorp-go-immutable-radix-dev_1.3.1-3_all.deb ...
Unpacking golang-github-hashicorp-go-immutable-radix-dev (1.3.1-3) ...
Selecting previously unselected package golang-github-pascaldekloe-goe-dev.
Preparing to unpack .../066-golang-github-pascaldekloe-goe-dev_0.1.0-4_all.deb ...
Unpacking golang-github-pascaldekloe-goe-dev (0.1.0-4) ...
Selecting previously unselected package golang-github-beorn7-perks-dev.
Preparing to unpack .../067-golang-github-beorn7-perks-dev_1.0.1-3_all.deb ...
Unpacking golang-github-beorn7-perks-dev (1.0.1-3) ...
Selecting previously unselected package golang-github-cespare-xxhash-dev.
Preparing to unpack .../068-golang-github-cespare-xxhash-dev_2.3.0-1_all.deb ...
Unpacking golang-github-cespare-xxhash-dev (2.3.0-1) ...
Selecting previously unselected package golang-github-modern-go-concurrent-dev.
Preparing to unpack .../069-golang-github-modern-go-concurrent-dev_1.0.3-1.1_all.deb ...
Unpacking golang-github-modern-go-concurrent-dev (1.0.3-1.1) ...
Selecting previously unselected package golang-github-modern-go-reflect2-dev.
Preparing to unpack .../070-golang-github-modern-go-reflect2-dev_1.0.2-2_all.deb ...
Unpacking golang-github-modern-go-reflect2-dev (1.0.2-2) ...
Selecting previously unselected package golang-github-json-iterator-go-dev.
Preparing to unpack .../071-golang-github-json-iterator-go-dev_1.1.12-2_all.deb ...
Unpacking golang-github-json-iterator-go-dev (1.1.12-2) ...
Selecting previously unselected package golang-github-klauspost-compress-dev.
Preparing to unpack .../072-golang-github-klauspost-compress-dev_1.18.0+ds1-1_all.deb ...
Unpacking golang-github-klauspost-compress-dev (1.18.0+ds1-1) ...
Selecting previously unselected package golang-github-kylelemons-godebug-dev.
Preparing to unpack .../073-golang-github-kylelemons-godebug-dev_1.1.0-2_all.deb ...
Unpacking golang-github-kylelemons-godebug-dev (1.1.0-2) ...
Selecting previously unselected package golang-github-prometheus-client-model-dev.
Preparing to unpack .../074-golang-github-prometheus-client-model-dev_0.6.0-1_all.deb ...
Unpacking golang-github-prometheus-client-model-dev (0.6.0-1) ...
Selecting previously unselected package golang-gopkg-yaml.v2-dev.
Preparing to unpack .../075-golang-gopkg-yaml.v2-dev_2.4.0-4_all.deb ...
Unpacking golang-gopkg-yaml.v2-dev (2.4.0-4) ...
Selecting previously unselected package golang-github-jmespath-go-jmespath-dev.
Preparing to unpack .../076-golang-github-jmespath-go-jmespath-dev_0.4.0-2_all.deb ...
Unpacking golang-github-jmespath-go-jmespath-dev (0.4.0-2) ...
Selecting previously unselected package golang-golang-x-term-dev.
Preparing to unpack .../077-golang-golang-x-term-dev_0.22.0-1_all.deb ...
Unpacking golang-golang-x-term-dev (0.22.0-1) ...
Selecting previously unselected package golang-golang-x-text-dev.
Preparing to unpack .../078-golang-golang-x-text-dev_0.22.0-1_all.deb ...
Unpacking golang-golang-x-text-dev (0.22.0-1) ...
Selecting previously unselected package golang-golang-x-crypto-dev.
Preparing to unpack .../079-golang-golang-x-crypto-dev_1%3a0.25.0-1_all.deb ...
Unpacking golang-golang-x-crypto-dev (1:0.25.0-1) ...
Selecting previously unselected package golang-golang-x-net-dev.
Preparing to unpack .../080-golang-golang-x-net-dev_1%3a0.27.0-1_all.deb ...
Unpacking golang-golang-x-net-dev (1:0.27.0-1) ...
Selecting previously unselected package golang-github-aws-aws-sdk-go-dev.
Preparing to unpack .../081-golang-github-aws-aws-sdk-go-dev_1.49.0-2_all.deb ...
Unpacking golang-github-aws-aws-sdk-go-dev (1.49.0-2) ...
Selecting previously unselected package golang-github-go-logfmt-logfmt-dev.
Preparing to unpack .../082-golang-github-go-logfmt-logfmt-dev_0.5.0-2_all.deb ...
Unpacking golang-github-go-logfmt-logfmt-dev (0.5.0-2) ...
Selecting previously unselected package golang-github-go-kit-log-dev.
Preparing to unpack .../083-golang-github-go-kit-log-dev_0.2.1-1_all.deb ...
Unpacking golang-github-go-kit-log-dev (0.2.1-1) ...
Selecting previously unselected package golang-github-julienschmidt-httprouter-dev.
Preparing to unpack .../084-golang-github-julienschmidt-httprouter-dev_1.3.0-2_all.deb ...
Unpacking golang-github-julienschmidt-httprouter-dev (1.3.0-2) ...
Selecting previously unselected package golang-github-munnerz-goautoneg-dev.
Preparing to unpack .../085-golang-github-munnerz-goautoneg-dev_0.0~git20191010.a7dc8b6-2_all.deb ...
Unpacking golang-github-munnerz-goautoneg-dev (0.0~git20191010.a7dc8b6-2) ...
Selecting previously unselected package golang-github-jpillora-backoff-dev.
Preparing to unpack .../086-golang-github-jpillora-backoff-dev_1.0.0-1.1_all.deb ...
Unpacking golang-github-jpillora-backoff-dev (1.0.0-1.1) ...
Selecting previously unselected package golang-github-mwitkow-go-conntrack-dev.
Preparing to unpack .../087-golang-github-mwitkow-go-conntrack-dev_0.0~git20190716.2f06839-4_all.deb ...
Unpacking golang-github-mwitkow-go-conntrack-dev (0.0~git20190716.2f06839-4) ...
Selecting previously unselected package golang-github-prometheus-sigv4-dev.
Preparing to unpack .../088-golang-github-prometheus-sigv4-dev_0.1.2-2_all.deb ...
Unpacking golang-github-prometheus-sigv4-dev (0.1.2-2) ...
Selecting previously unselected package golang-golang-x-oauth2-dev.
Preparing to unpack .../089-golang-golang-x-oauth2-dev_0.27.0-1_all.deb ...
Unpacking golang-golang-x-oauth2-dev (0.27.0-1) ...
Selecting previously unselected package golang-gopkg-alecthomas-kingpin.v2-dev.
Preparing to unpack .../090-golang-gopkg-alecthomas-kingpin.v2-dev_2.2.6-4_all.deb ...
Unpacking golang-gopkg-alecthomas-kingpin.v2-dev (2.2.6-4) ...
Selecting previously unselected package golang-github-prometheus-common-dev.
Preparing to unpack .../091-golang-github-prometheus-common-dev_0.62.0-3_all.deb ...
Unpacking golang-github-prometheus-common-dev (0.62.0-3) ...
Selecting previously unselected package golang-golang-x-sync-dev.
Preparing to unpack .../092-golang-golang-x-sync-dev_0.7.0-1_all.deb ...
Unpacking golang-golang-x-sync-dev (0.7.0-1) ...
Selecting previously unselected package golang-github-prometheus-procfs-dev.
Preparing to unpack .../093-golang-github-prometheus-procfs-dev_0.15.1-1_all.deb ...
Unpacking golang-github-prometheus-procfs-dev (0.15.1-1) ...
Selecting previously unselected package golang-github-prometheus-client-golang-dev.
Preparing to unpack .../094-golang-github-prometheus-client-golang-dev_1.21.1-1_all.deb ...
Unpacking golang-github-prometheus-client-golang-dev (1.21.1-1) ...
Selecting previously unselected package golang-github-armon-go-metrics-dev.
Preparing to unpack .../095-golang-github-armon-go-metrics-dev_0.4.1-1_all.deb ...
Unpacking golang-github-armon-go-metrics-dev (0.4.1-1) ...
Selecting previously unselected package golang-github-asaskevich-govalidator-dev.
Preparing to unpack .../096-golang-github-asaskevich-govalidator-dev_11.0.1-1_all.deb ...
Unpacking golang-github-asaskevich-govalidator-dev (11.0.1-1) ...
Selecting previously unselected package golang-github-burntsushi-toml-dev.
Preparing to unpack .../097-golang-github-burntsushi-toml-dev_1.4.0-1_all.deb ...
Unpacking golang-github-burntsushi-toml-dev (1.4.0-1) ...
Selecting previously unselected package golang-github-cenkalti-backoff-dev.
Preparing to unpack .../098-golang-github-cenkalti-backoff-dev_4.3.0-1_all.deb ...
Unpacking golang-github-cenkalti-backoff-dev (4.3.0-1) ...
Selecting previously unselected package golang-github-coder-quartz-dev.
Preparing to unpack .../099-golang-github-coder-quartz-dev_0.1.3-2_all.deb ...
Unpacking golang-github-coder-quartz-dev (0.1.3-2) ...
Selecting previously unselected package libcap-dev:amd64.
Preparing to unpack .../100-libcap-dev_1%3a2.66-5+b1_amd64.deb ...
Unpacking libcap-dev:amd64 (1:2.66-5+b1) ...
Selecting previously unselected package libsystemd-dev:amd64.
Preparing to unpack .../101-libsystemd-dev_257.3-1_amd64.deb ...
Unpacking libsystemd-dev:amd64 (257.3-1) ...
Selecting previously unselected package golang-github-coreos-go-systemd-dev.
Preparing to unpack .../102-golang-github-coreos-go-systemd-dev_22.5.0-1_all.deb ...
Unpacking golang-github-coreos-go-systemd-dev (22.5.0-1) ...
Selecting previously unselected package golang-github-creack-pty-dev.
Preparing to unpack .../103-golang-github-creack-pty-dev_1.1.21-1_all.deb ...
Unpacking golang-github-creack-pty-dev (1.1.21-1) ...
Selecting previously unselected package golang-github-docker-go-units-dev.
Preparing to unpack .../104-golang-github-docker-go-units-dev_0.4.0-4_all.deb ...
Unpacking golang-github-docker-go-units-dev (0.4.0-4) ...
Selecting previously unselected package golang-github-emersion-go-sasl-dev.
Preparing to unpack .../105-golang-github-emersion-go-sasl-dev_0.0~git20230613.1d333a0-1_all.deb ...
Unpacking golang-github-emersion-go-sasl-dev (0.0~git20230613.1d333a0-1) ...
Selecting previously unselected package golang-github-emersion-go-smtp-dev.
Preparing to unpack .../106-golang-github-emersion-go-smtp-dev_0.21.2-1_all.deb ...
Unpacking golang-github-emersion-go-smtp-dev (0.21.2-1) ...
Selecting previously unselected package golang-github-fsnotify-fsnotify-dev.
Preparing to unpack .../107-golang-github-fsnotify-fsnotify-dev_1.8.0-1_all.deb ...
Unpacking golang-github-fsnotify-fsnotify-dev (1.8.0-1) ...
Selecting previously unselected package golang-github-go-logr-logr-dev.
Preparing to unpack .../108-golang-github-go-logr-logr-dev_1.4.2-2_all.deb ...
Unpacking golang-github-go-logr-logr-dev (1.4.2-2) ...
Selecting previously unselected package golang-github-go-logr-stdr-dev.
Preparing to unpack .../109-golang-github-go-logr-stdr-dev_1.2.2-4_all.deb ...
Unpacking golang-github-go-logr-stdr-dev (1.2.2-4) ...
Selecting previously unselected package golang-github-josharian-intern-dev.
Preparing to unpack .../110-golang-github-josharian-intern-dev_1.0.0-3_all.deb ...
Unpacking golang-github-josharian-intern-dev (1.0.0-3) ...
Selecting previously unselected package golang-github-mailru-easyjson-dev.
Preparing to unpack .../111-golang-github-mailru-easyjson-dev_0.7.7-1_all.deb ...
Unpacking golang-github-mailru-easyjson-dev (0.7.7-1) ...
Selecting previously unselected package golang-github-go-openapi-swag-dev.
Preparing to unpack .../112-golang-github-go-openapi-swag-dev_1%3a0.23.0-1_all.deb ...
Unpacking golang-github-go-openapi-swag-dev (1:0.23.0-1) ...
Selecting previously unselected package golang-github-go-openapi-jsonpointer-dev.
Preparing to unpack .../113-golang-github-go-openapi-jsonpointer-dev_1%3a0.21.0-1_all.deb ...
Unpacking golang-github-go-openapi-jsonpointer-dev (1:0.21.0-1) ...
Selecting previously unselected package golang-github-go-openapi-jsonreference-dev.
Preparing to unpack .../114-golang-github-go-openapi-jsonreference-dev_1%3a0.21.0-1_all.deb ...
Unpacking golang-github-go-openapi-jsonreference-dev (1:0.21.0-1) ...
Selecting previously unselected package golang-github-go-openapi-spec-dev.
Preparing to unpack .../115-golang-github-go-openapi-spec-dev_1%3a0.21.0-1_all.deb ...
Unpacking golang-github-go-openapi-spec-dev (1:0.21.0-1) ...
Selecting previously unselected package golang-github-go-openapi-errors-dev.
Preparing to unpack .../116-golang-github-go-openapi-errors-dev_0.22.0-1_all.deb ...
Unpacking golang-github-go-openapi-errors-dev (0.22.0-1) ...
Selecting previously unselected package golang-github-google-uuid-dev.
Preparing to unpack .../117-golang-github-google-uuid-dev_1.6.0-1_all.deb ...
Unpacking golang-github-google-uuid-dev (1.6.0-1) ...
Selecting previously unselected package golang-github-mitchellh-mapstructure-dev.
Preparing to unpack .../118-golang-github-mitchellh-mapstructure-dev_1.5.0+git20231216.8508981-1_all.deb ...
Unpacking golang-github-mitchellh-mapstructure-dev (1.5.0+git20231216.8508981-1) ...
Selecting previously unselected package golang-github-oklog-ulid-dev.
Preparing to unpack .../119-golang-github-oklog-ulid-dev_2.0.2+ds-2_all.deb ...
Unpacking golang-github-oklog-ulid-dev (2.0.2+ds-2) ...
Selecting previously unselected package golang-github-golang-snappy-dev.
Preparing to unpack .../120-golang-github-golang-snappy-dev_0.0.2-3_all.deb ...
Unpacking golang-github-golang-snappy-dev (0.0.2-3) ...
Selecting previously unselected package golang-github-montanaflynn-stats-dev.
Preparing to unpack .../121-golang-github-montanaflynn-stats-dev_0.7.1-1_all.deb ...
Unpacking golang-github-montanaflynn-stats-dev (0.7.1-1) ...
Selecting previously unselected package golang-github-xdg-go-pbkdf2-dev.
Preparing to unpack .../122-golang-github-xdg-go-pbkdf2-dev_1.0.0-3_all.deb ...
Unpacking golang-github-xdg-go-pbkdf2-dev (1.0.0-3) ...
Selecting previously unselected package golang-github-xdg-go-stringprep-dev.
Preparing to unpack .../123-golang-github-xdg-go-stringprep-dev_1.0.4-1_all.deb ...
Unpacking golang-github-xdg-go-stringprep-dev (1.0.4-1) ...
Selecting previously unselected package golang-github-xdg-go-scram-dev.
Preparing to unpack .../124-golang-github-xdg-go-scram-dev_1.1.2-1_all.deb ...
Unpacking golang-github-xdg-go-scram-dev (1.1.2-1) ...
Selecting previously unselected package golang-github-youmark-pkcs8-dev.
Preparing to unpack .../125-golang-github-youmark-pkcs8-dev_1.1-3_all.deb ...
Unpacking golang-github-youmark-pkcs8-dev (1.1-3) ...
Selecting previously unselected package golang-mongodb-mongo-driver-dev.
Preparing to unpack .../126-golang-mongodb-mongo-driver-dev_1.17.1+ds1-1_all.deb ...
Unpacking golang-mongodb-mongo-driver-dev (1.17.1+ds1-1) ...
Selecting previously unselected package golang-github-go-openapi-strfmt-dev.
Preparing to unpack .../127-golang-github-go-openapi-strfmt-dev_0.23.0-1_all.deb ...
Unpacking golang-github-go-openapi-strfmt-dev (0.23.0-1) ...
Selecting previously unselected package golang-github-go-openapi-validate-dev.
Preparing to unpack .../128-golang-github-go-openapi-validate-dev_0.24.0-2_all.deb ...
Unpacking golang-github-go-openapi-validate-dev (0.24.0-2) ...
Selecting previously unselected package golang-github-go-openapi-loads-dev.
Preparing to unpack .../129-golang-github-go-openapi-loads-dev_0.22.0-1_all.deb ...
Unpacking golang-github-go-openapi-loads-dev (0.22.0-1) ...
Selecting previously unselected package golang-github-go-openapi-analysis-dev.
Preparing to unpack .../130-golang-github-go-openapi-analysis-dev_0.23.0-1_all.deb ...
Unpacking golang-github-go-openapi-analysis-dev (0.23.0-1) ...
Selecting previously unselected package golang-github-opentracing-opentracing-go-dev.
Preparing to unpack .../131-golang-github-opentracing-opentracing-go-dev_1.2.0-2_all.deb ...
Unpacking golang-github-opentracing-opentracing-go-dev (1.2.0-2) ...
Selecting previously unselected package golang-github-masterminds-semver-dev.
Preparing to unpack .../132-golang-github-masterminds-semver-dev_3.2.0-1_all.deb ...
Unpacking golang-github-masterminds-semver-dev (3.2.0-1) ...
Selecting previously unselected package golang-github-stoewer-go-strcase-dev.
Preparing to unpack .../133-golang-github-stoewer-go-strcase-dev_1.2.0-4_all.deb ...
Unpacking golang-github-stoewer-go-strcase-dev (1.2.0-4) ...
Selecting previously unselected package golang-google-genproto-dev.
Preparing to unpack .../134-golang-google-genproto-dev_0.0~git20210726.e7812ac-4_all.deb ...
Unpacking golang-google-genproto-dev (0.0~git20210726.e7812ac-4) ...
Selecting previously unselected package golang-github-google-cel-go-dev.
Preparing to unpack .../135-golang-github-google-cel-go-dev_0.18.2+ds-5_all.deb ...
Unpacking golang-github-google-cel-go-dev (0.18.2+ds-5) ...
Selecting previously unselected package golang-glog-dev.
Preparing to unpack .../136-golang-glog-dev_1.2.4-1_all.deb ...
Unpacking golang-glog-dev (1.2.4-1) ...
Selecting previously unselected package golang-github-golang-groupcache-dev.
Preparing to unpack .../137-golang-github-golang-groupcache-dev_0.0~git20210331.41bb18b-1_all.deb ...
Unpacking golang-github-golang-groupcache-dev (0.0~git20210331.41bb18b-1) ...
Selecting previously unselected package golang-go.opencensus-dev.
Preparing to unpack .../138-golang-go.opencensus-dev_0.24.0-2_all.deb ...
Unpacking golang-go.opencensus-dev (0.24.0-2) ...
Selecting previously unselected package golang-google-cloud-compute-metadata-dev.
Preparing to unpack .../139-golang-google-cloud-compute-metadata-dev_0.56.0-5_all.deb ...
Unpacking golang-google-cloud-compute-metadata-dev (0.56.0-5) ...
Selecting previously unselected package golang-golang-x-oauth2-google-dev.
Preparing to unpack .../140-golang-golang-x-oauth2-google-dev_0.27.0-1_all.deb ...
Unpacking golang-golang-x-oauth2-google-dev (0.27.0-1) ...
Selecting previously unselected package golang-github-golang-mock-dev.
Preparing to unpack .../141-golang-github-golang-mock-dev_1.6.0-2_all.deb ...
Unpacking golang-github-golang-mock-dev (1.6.0-2) ...
Selecting previously unselected package golang-github-google-btree-dev.
Preparing to unpack .../142-golang-github-google-btree-dev_1.0.1-1_all.deb ...
Unpacking golang-github-google-btree-dev (1.0.1-1) ...
Selecting previously unselected package golang-github-google-martian-dev.
Preparing to unpack .../143-golang-github-google-martian-dev_3.3.2-3_all.deb ...
Unpacking golang-github-google-martian-dev (3.3.2-3) ...
Selecting previously unselected package golang-github-chzyer-readline-dev.
Preparing to unpack .../144-golang-github-chzyer-readline-dev_1.4.39.g2972be2-3_all.deb ...
Unpacking golang-github-chzyer-readline-dev (1.4.39.g2972be2-3) ...
Selecting previously unselected package golang-github-ianlancetaylor-demangle-dev.
Preparing to unpack .../145-golang-github-ianlancetaylor-demangle-dev_0.0~git20200824.28f6c0f-2_all.deb ...
Unpacking golang-github-ianlancetaylor-demangle-dev (0.0~git20200824.28f6c0f-2) ...
Selecting previously unselected package golang-github-google-pprof-dev.
Preparing to unpack .../146-golang-github-google-pprof-dev_0.0~git20211008.947d60d-1_all.deb ...
Unpacking golang-github-google-pprof-dev (0.0~git20211008.947d60d-1) ...
Selecting previously unselected package golang-github-googleapis-gax-go-dev.
Preparing to unpack .../147-golang-github-googleapis-gax-go-dev_2.14.1-1_all.deb ...
Unpacking golang-github-googleapis-gax-go-dev (2.14.1-1) ...
Selecting previously unselected package golang-golang-x-time-dev.
Preparing to unpack .../148-golang-golang-x-time-dev_0.5.0-1_all.deb ...
Unpacking golang-golang-x-time-dev (0.5.0-1) ...
Selecting previously unselected package golang-google-api-dev.
Preparing to unpack .../149-golang-google-api-dev_0.61.0-5_all.deb ...
Unpacking golang-google-api-dev (0.61.0-5) ...
Selecting previously unselected package golang-rsc-binaryregexp-dev.
Preparing to unpack .../150-golang-rsc-binaryregexp-dev_0.2.0-3_all.deb ...
Unpacking golang-rsc-binaryregexp-dev (0.2.0-3) ...
Selecting previously unselected package golang-google-cloud-dev.
Preparing to unpack .../151-golang-google-cloud-dev_0.56.0-5_all.deb ...
Unpacking golang-google-cloud-dev (0.56.0-5) ...
Selecting previously unselected package golang-google-grpc-dev.
Preparing to unpack .../152-golang-google-grpc-dev_1.64.0-6_all.deb ...
Unpacking golang-google-grpc-dev (1.64.0-6) ...
Selecting previously unselected package golang-github-rogpeppe-fastuuid-dev.
Preparing to unpack .../153-golang-github-rogpeppe-fastuuid-dev_0.0~git20150106.0.6724a57-2.1_all.deb ...
Unpacking golang-github-rogpeppe-fastuuid-dev (0.0~git20150106.0.6724a57-2.1) ...
Selecting previously unselected package golang-github-grpc-ecosystem-grpc-gateway-dev.
Preparing to unpack .../154-golang-github-grpc-ecosystem-grpc-gateway-dev_2.20.0-2_all.deb ...
Unpacking golang-github-grpc-ecosystem-grpc-gateway-dev (2.20.0-2) ...
Selecting previously unselected package golang-opentelemetry-proto-dev.
Preparing to unpack .../155-golang-opentelemetry-proto-dev_1.3.1-2_all.deb ...
Unpacking golang-opentelemetry-proto-dev (1.3.1-2) ...
Selecting previously unselected package golang-opentelemetry-otel-dev.
Preparing to unpack .../156-golang-opentelemetry-otel-dev_1.31.0-3_all.deb ...
Unpacking golang-opentelemetry-otel-dev (1.31.0-3) ...
Selecting previously unselected package golang-github-go-openapi-runtime-dev.
Preparing to unpack .../157-golang-github-go-openapi-runtime-dev_0.28.0-1_all.deb ...
Unpacking golang-github-go-openapi-runtime-dev (0.28.0-1) ...
Selecting previously unselected package golang-github-go-playground-locales-dev.
Preparing to unpack .../158-golang-github-go-playground-locales-dev_0.14.0-3_all.deb ...
Unpacking golang-github-go-playground-locales-dev (0.14.0-3) ...
Selecting previously unselected package golang-github-go-playground-universal-translator-dev.
Preparing to unpack .../159-golang-github-go-playground-universal-translator-dev_0.17.0-2_all.deb ...
Unpacking golang-github-go-playground-universal-translator-dev (0.17.0-2) ...
Selecting previously unselected package golang-github-leodido-go-urn-dev.
Preparing to unpack .../160-golang-github-leodido-go-urn-dev_1.2.1-3_all.deb ...
Unpacking golang-github-leodido-go-urn-dev (1.2.1-3) ...
Selecting previously unselected package golang-github-go-playground-validator-v10-dev.
Preparing to unpack .../161-golang-github-go-playground-validator-v10-dev_10.4.1-4_all.deb ...
Unpacking golang-github-go-playground-validator-v10-dev (10.4.1-4) ...
Selecting previously unselected package golang-golang-x-xerrors-dev.
Preparing to unpack .../162-golang-golang-x-xerrors-dev_0.0~git20231012.104605a-1_all.deb ...
Unpacking golang-golang-x-xerrors-dev (0.0~git20231012.104605a-1) ...
Selecting previously unselected package golang-github-goccy-go-yaml-dev.
Preparing to unpack .../163-golang-github-goccy-go-yaml-dev_1.9.5-2_all.deb ...
Unpacking golang-github-goccy-go-yaml-dev (1.9.5-2) ...
Selecting previously unselected package golang-github-gofrs-uuid-dev.
Preparing to unpack .../164-golang-github-gofrs-uuid-dev_5.3.1-1_all.deb ...
Unpacking golang-github-gofrs-uuid-dev (5.3.1-1) ...
Selecting previously unselected package zlib1g-dev:amd64.
Preparing to unpack .../165-zlib1g-dev_1%3a1.3.dfsg+really1.3.1-1+b1_amd64.deb ...
Unpacking zlib1g-dev:amd64 (1:1.3.dfsg+really1.3.1-1+b1) ...
Selecting previously unselected package libprotobuf32t64:amd64.
Preparing to unpack .../166-libprotobuf32t64_3.21.12-10+b6_amd64.deb ...
Unpacking libprotobuf32t64:amd64 (3.21.12-10+b6) ...
Selecting previously unselected package libprotobuf-lite32t64:amd64.
Preparing to unpack .../167-libprotobuf-lite32t64_3.21.12-10+b6_amd64.deb ...
Unpacking libprotobuf-lite32t64:amd64 (3.21.12-10+b6) ...
Selecting previously unselected package libprotobuf-dev:amd64.
Preparing to unpack .../168-libprotobuf-dev_3.21.12-10+b6_amd64.deb ...
Unpacking libprotobuf-dev:amd64 (3.21.12-10+b6) ...
Selecting previously unselected package golang-github-gogo-protobuf-dev.
Preparing to unpack .../169-golang-github-gogo-protobuf-dev_1.3.2-3_all.deb ...
Unpacking golang-github-gogo-protobuf-dev (1.3.2-3) ...
Selecting previously unselected package golang-github-hashicorp-errwrap-dev.
Preparing to unpack .../170-golang-github-hashicorp-errwrap-dev_1.1.0-1_all.deb ...
Unpacking golang-github-hashicorp-errwrap-dev (1.1.0-1) ...
Selecting previously unselected package golang-github-vmihailenco-tagparser-dev.
Preparing to unpack .../171-golang-github-vmihailenco-tagparser-dev_0.1.1-4_all.deb ...
Unpacking golang-github-vmihailenco-tagparser-dev (0.1.1-4) ...
Selecting previously unselected package golang-gopkg-vmihailenco-msgpack.v2-dev.
Preparing to unpack .../172-golang-gopkg-vmihailenco-msgpack.v2-dev_4.3.1-2_all.deb ...
Unpacking golang-gopkg-vmihailenco-msgpack.v2-dev (4.3.1-2) ...
Selecting previously unselected package golang-gopkg-tomb.v2-dev.
Preparing to unpack .../173-golang-gopkg-tomb.v2-dev_0.0~git20161208.d5d1b58-3_all.deb ...
Unpacking golang-gopkg-tomb.v2-dev (0.0~git20161208.d5d1b58-3) ...
Selecting previously unselected package libsasl2-modules-db:amd64.
Preparing to unpack .../174-libsasl2-modules-db_2.1.28+dfsg1-9_amd64.deb ...
Unpacking libsasl2-modules-db:amd64 (2.1.28+dfsg1-9) ...
Selecting previously unselected package libsasl2-2:amd64.
Preparing to unpack .../175-libsasl2-2_2.1.28+dfsg1-9_amd64.deb ...
Unpacking libsasl2-2:amd64 (2.1.28+dfsg1-9) ...
Selecting previously unselected package libssl-dev:amd64.
Preparing to unpack .../176-libssl-dev_3.4.1-1_amd64.deb ...
Unpacking libssl-dev:amd64 (3.4.1-1) ...
Selecting previously unselected package libsasl2-dev.
Preparing to unpack .../177-libsasl2-dev_2.1.28+dfsg1-9_amd64.deb ...
Unpacking libsasl2-dev (2.1.28+dfsg1-9) ...
Selecting previously unselected package golang-github-kr-text-dev.
Preparing to unpack .../178-golang-github-kr-text-dev_0.2.0-2_all.deb ...
Unpacking golang-github-kr-text-dev (0.2.0-2) ...
Selecting previously unselected package golang-golang-x-mod-dev.
Preparing to unpack .../179-golang-golang-x-mod-dev_0.19.0-1_all.deb ...
Unpacking golang-golang-x-mod-dev (0.19.0-1) ...
Selecting previously unselected package golang-github-yuin-goldmark-dev.
Preparing to unpack .../180-golang-github-yuin-goldmark-dev_1.7.4-1_all.deb ...
Unpacking golang-github-yuin-goldmark-dev (1.7.4-1) ...
Selecting previously unselected package golang-golang-x-tools-dev.
Preparing to unpack .../181-golang-golang-x-tools-dev_1%3a0.25.0+ds-1_all.deb ...
Unpacking golang-golang-x-tools-dev (1:0.25.0+ds-1) ...
Selecting previously unselected package golang-github-rogpeppe-go-internal-dev.
Preparing to unpack .../182-golang-github-rogpeppe-go-internal-dev_1.12.0-3_all.deb ...
Unpacking golang-github-rogpeppe-go-internal-dev (1.12.0-3) ...
Selecting previously unselected package golang-github-kr-pretty-dev.
Preparing to unpack .../183-golang-github-kr-pretty-dev_0.3.1-1_all.deb ...
Unpacking golang-github-kr-pretty-dev (0.3.1-1) ...
Selecting previously unselected package golang-gopkg-check.v1-dev.
Preparing to unpack .../184-golang-gopkg-check.v1-dev_0.0+git20200902.038fdea-2_all.deb ...
Unpacking golang-gopkg-check.v1-dev (0.0+git20200902.038fdea-2) ...
Selecting previously unselected package golang-gopkg-mgo.v2-dev.
Preparing to unpack .../185-golang-gopkg-mgo.v2-dev_2016.08.01-7_all.deb ...
Unpacking golang-gopkg-mgo.v2-dev (2016.08.01-7) ...
Selecting previously unselected package golang-github-hashicorp-go-msgpack-dev.
Preparing to unpack .../186-golang-github-hashicorp-go-msgpack-dev_0.5.5-1_all.deb ...
Unpacking golang-github-hashicorp-go-msgpack-dev (0.5.5-1) ...
Selecting previously unselected package golang-github-hashicorp-go-multierror-dev.
Preparing to unpack .../187-golang-github-hashicorp-go-multierror-dev_1.1.1-2_all.deb ...
Unpacking golang-github-hashicorp-go-multierror-dev (1.1.1-2) ...
Selecting previously unselected package golang-github-hashicorp-go-sockaddr-dev.
Preparing to unpack .../188-golang-github-hashicorp-go-sockaddr-dev_1.0.2-2_all.deb ...
Unpacking golang-github-hashicorp-go-sockaddr-dev (1.0.2-2) ...
Selecting previously unselected package golang-github-hashicorp-golang-lru-v2-dev.
Preparing to unpack .../189-golang-github-hashicorp-golang-lru-v2-dev_2.0.7-2_all.deb ...
Unpacking golang-github-hashicorp-golang-lru-v2-dev (2.0.7-2) ...
Selecting previously unselected package golang-github-hashicorp-hcl-dev.
Preparing to unpack .../190-golang-github-hashicorp-hcl-dev_1.0.0-1.1_all.deb ...
Unpacking golang-github-hashicorp-hcl-dev (1.0.0-1.1) ...
Selecting previously unselected package golang-github-miekg-dns-dev.
Preparing to unpack .../191-golang-github-miekg-dns-dev_1.1.63-1_all.deb ...
Unpacking golang-github-miekg-dns-dev (1.1.63-1) ...
Selecting previously unselected package golang-github-hashicorp-memberlist-dev.
Preparing to unpack .../192-golang-github-hashicorp-memberlist-dev_0.5.0-1_all.deb ...
Unpacking golang-github-hashicorp-memberlist-dev (0.5.0-1) ...
Selecting previously unselected package golang-github-jessevdk-go-flags-dev.
Preparing to unpack .../193-golang-github-jessevdk-go-flags-dev_1.4.0-6_all.deb ...
Unpacking golang-github-jessevdk-go-flags-dev (1.4.0-6) ...
Selecting previously unselected package golang-github-pbnjay-memory-dev.
Preparing to unpack .../194-golang-github-pbnjay-memory-dev_0.0~git20210728.7b4eea6-2_all.deb ...
Unpacking golang-github-pbnjay-memory-dev (0.0~git20210728.7b4eea6-2) ...
Selecting previously unselected package golang-github-kimmachinegun-automemlimit-dev.
Preparing to unpack .../195-golang-github-kimmachinegun-automemlimit-dev_0.7.1-1_all.deb ...
Unpacking golang-github-kimmachinegun-automemlimit-dev (0.7.1-1) ...
Selecting previously unselected package golang-github-kr-fs-dev.
Preparing to unpack .../196-golang-github-kr-fs-dev_0.1.0-2_all.deb ...
Unpacking golang-github-kr-fs-dev (0.1.0-2) ...
Selecting previously unselected package golang-github-magiconair-properties-dev.
Preparing to unpack .../197-golang-github-magiconair-properties-dev_1.8.7-1_all.deb ...
Unpacking golang-github-magiconair-properties-dev (1.8.7-1) ...
Selecting previously unselected package golang-github-mdlayher-socket-dev.
Preparing to unpack .../198-golang-github-mdlayher-socket-dev_0.5.1-1_all.deb ...
Unpacking golang-github-mdlayher-socket-dev (0.5.1-1) ...
Selecting previously unselected package golang-github-mdlayher-vsock-dev.
Preparing to unpack .../199-golang-github-mdlayher-vsock-dev_1.2.1-2_all.deb ...
Unpacking golang-github-mdlayher-vsock-dev (1.2.1-2) ...
Selecting previously unselected package golang-github-oklog-run-dev.
Preparing to unpack .../200-golang-github-oklog-run-dev_1.1.0-2_all.deb ...
Unpacking golang-github-oklog-run-dev (1.1.0-2) ...
Selecting previously unselected package golang-github-pelletier-go-toml-dev.
Preparing to unpack .../201-golang-github-pelletier-go-toml-dev_1.9.5-1_all.deb ...
Unpacking golang-github-pelletier-go-toml-dev (1.9.5-1) ...
Selecting previously unselected package golang-github-pelletier-go-toml.v2-dev.
Preparing to unpack .../202-golang-github-pelletier-go-toml.v2-dev_2.2.1-1_all.deb ...
Unpacking golang-github-pelletier-go-toml.v2-dev (2.2.1-1) ...
Selecting previously unselected package golang-github-pkg-sftp-dev.
Preparing to unpack .../203-golang-github-pkg-sftp-dev_1.13.6-1_all.deb ...
Unpacking golang-github-pkg-sftp-dev (1.13.6-1) ...
Selecting previously unselected package golang-github-prometheus-exporter-toolkit-dev.
Preparing to unpack .../204-golang-github-prometheus-exporter-toolkit-dev_0.14.0-1_all.deb ...
Unpacking golang-github-prometheus-exporter-toolkit-dev (0.14.0-1) ...
Selecting previously unselected package golang-github-gin-contrib-sse-dev.
Preparing to unpack .../205-golang-github-gin-contrib-sse-dev_0.1.0-2_all.deb ...
Unpacking golang-github-gin-contrib-sse-dev (0.1.0-2) ...
Selecting previously unselected package golang-github-ugorji-go-codec-dev.
Preparing to unpack .../206-golang-github-ugorji-go-codec-dev_1.2.8-1_all.deb ...
Unpacking golang-github-ugorji-go-codec-dev (1.2.8-1) ...
Selecting previously unselected package golang-github-gin-gonic-gin-dev.
Preparing to unpack .../207-golang-github-gin-gonic-gin-dev_1.8.1-2_all.deb ...
Unpacking golang-github-gin-gonic-gin-dev (1.8.1-2) ...
Selecting previously unselected package golang-github-rs-cors-dev.
Preparing to unpack .../208-golang-github-rs-cors-dev_1.7.0-4_all.deb ...
Unpacking golang-github-rs-cors-dev (1.7.0-4) ...
Selecting previously unselected package golang-github-spf13-afero-dev.
Preparing to unpack .../209-golang-github-spf13-afero-dev_1.11.0-1_all.deb ...
Unpacking golang-github-spf13-afero-dev (1.11.0-1) ...
Selecting previously unselected package tzdata-legacy.
Preparing to unpack .../210-tzdata-legacy_2025a-2_all.deb ...
Unpacking tzdata-legacy (2025a-2) ...
Selecting previously unselected package golang-github-spf13-cast-dev.
Preparing to unpack .../211-golang-github-spf13-cast-dev_1.6.0-2_all.deb ...
Unpacking golang-github-spf13-cast-dev (1.6.0-2) ...
Selecting previously unselected package golang-github-spf13-jwalterweatherman-dev.
Preparing to unpack .../212-golang-github-spf13-jwalterweatherman-dev_1.1.0+really1.1.0-2_all.deb ...
Unpacking golang-github-spf13-jwalterweatherman-dev (1.1.0+really1.1.0-2) ...
Selecting previously unselected package golang-github-spf13-pflag-dev.
Preparing to unpack .../213-golang-github-spf13-pflag-dev_1.0.6~git20210604-d5e0c0615ace-1_all.deb ...
Unpacking golang-github-spf13-pflag-dev (1.0.6~git20210604-d5e0c0615ace-1) ...
Selecting previously unselected package golang-github-subosito-gotenv-dev.
Preparing to unpack .../214-golang-github-subosito-gotenv-dev_1.3.0-1_all.deb ...
Unpacking golang-github-subosito-gotenv-dev (1.3.0-1) ...
Selecting previously unselected package golang-gopkg-ini.v1-dev.
Preparing to unpack .../215-golang-gopkg-ini.v1-dev_1.67.0-1_all.deb ...
Unpacking golang-gopkg-ini.v1-dev (1.67.0-1) ...
Selecting previously unselected package golang-github-spf13-viper-dev.
Preparing to unpack .../216-golang-github-spf13-viper-dev_1.12.0-1_all.deb ...
Unpacking golang-github-spf13-viper-dev (1.12.0-1) ...
Selecting previously unselected package golang-github-xlab-treeprint-dev.
Preparing to unpack .../217-golang-github-xlab-treeprint-dev_1.2.0-2_all.deb ...
Unpacking golang-github-xlab-treeprint-dev (1.2.0-2) ...
Selecting previously unselected package golang-gopkg-telebot.v3-dev.
Preparing to unpack .../218-golang-gopkg-telebot.v3-dev_3.3.8-1_all.deb ...
Unpacking golang-gopkg-telebot.v3-dev (3.3.8-1) ...
Selecting previously unselected package golang-protobuf-extensions-dev.
Preparing to unpack .../219-golang-protobuf-extensions-dev_1.0.4-2_all.deb ...
Unpacking golang-protobuf-extensions-dev (1.0.4-2) ...
Selecting previously unselected package golang-uber-automaxprocs-dev.
Preparing to unpack .../220-golang-uber-automaxprocs-dev_1.5.3-1_all.deb ...
Unpacking golang-uber-automaxprocs-dev (1.5.3-1) ...
Selecting previously unselected package golang-go.uber-atomic-dev.
Preparing to unpack .../221-golang-go.uber-atomic-dev_1.11.0-1_all.deb ...
Unpacking golang-go.uber-atomic-dev (1.11.0-1) ...
Setting up libprotobuf-lite32t64:amd64 (3.21.12-10+b6) ...
Setting up golang-golang-x-time-dev (0.5.0-1) ...
Setting up golang-1.24-src (1.24.1-1) ...
Setting up golang-github-pelletier-go-toml.v2-dev (2.2.1-1) ...
Setting up media-types (13.0.0) ...
Setting up libpipeline1:amd64 (1.5.8-1) ...
Setting up golang-github-google-go-cmp-dev (0.6.0-1) ...
Setting up golang-github-oklog-run-dev (1.1.0-2) ...
Setting up golang-github-opentracing-opentracing-go-dev (1.2.0-2) ...
Setting up golang-gopkg-yaml.v2-dev (2.4.0-4) ...
Setting up libprotobuf32t64:amd64 (3.21.12-10+b6) ...
Setting up golang-github-hashicorp-go-uuid-dev (1.0.3-1) ...
Setting up golang-github-ianlancetaylor-demangle-dev (0.0~git20200824.28f6c0f-2) ...
Setting up libicu72:amd64 (72.1-6) ...
Setting up golang-github-mitchellh-mapstructure-dev (1.5.0+git20231216.8508981-1) ...
Setting up bsdextrautils (2.40.4-5) ...
Setting up golang-github-gin-contrib-sse-dev (0.1.0-2) ...
Setting up golang-dbus-dev (5.1.0-1) ...
Setting up golang-github-creack-pty-dev (1.1.21-1) ...
Setting up golang-github-golang-mock-dev (1.6.0-2) ...
Setting up golang-github-stretchr-objx-dev (0.5.2-1) ...
Setting up libmagic-mgc (1:5.45-3+b1) ...
Setting up golang-github-pkg-errors-dev (0.9.1-3) ...
Setting up golang-github-hashicorp-golang-lru-dev (0.5.4-2) ...
Setting up libarchive-zip-perl (1.68-1) ...
Setting up golang-rsc-binaryregexp-dev (0.2.0-3) ...
Setting up golang-github-kylelemons-godebug-dev (1.1.0-2) ...
Setting up golang-gopkg-yaml.v3-dev (3.0.1-3) ...
Setting up libdebhelper-perl (13.24.1) ...
Setting up golang-github-docker-go-units-dev (0.4.0-4) ...
Setting up golang-github-burntsushi-toml-dev (1.4.0-1) ...
Setting up golang-golang-x-sys-dev (0.22.0-1) ...
Setting up golang-github-kr-fs-dev (0.1.0-2) ...
Setting up golang-github-pbnjay-memory-dev (0.0~git20210728.7b4eea6-2) ...
Setting up libmagic1t64:amd64 (1:5.45-3+b1) ...
Setting up golang-github-subosito-gotenv-dev (1.3.0-1) ...
Setting up golang-github-golang-snappy-dev (0.0.2-3) ...
Setting up golang-github-pmezard-go-difflib-dev (1.0.0-3) ...
Setting up golang-github-modern-go-concurrent-dev (1.0.3-1.1) ...
Setting up gettext-base (0.23.1-1) ...
Setting up m4 (1.4.19-7) ...
Setting up golang-github-circonus-labs-circonusllhist-dev (0.0~git20191022.ec08cde-1) ...
Setting up golang-golang-x-term-dev (0.22.0-1) ...
Setting up file (1:5.45-3+b1) ...
Setting up golang-github-masterminds-semver-dev (3.2.0-1) ...
Setting up golang-github-asaskevich-govalidator-dev (11.0.1-1) ...
Setting up golang-github-google-btree-dev (1.0.1-1) ...
Setting up golang-github-stoewer-go-strcase-dev (1.2.0-4) ...
Setting up golang-go.uber-atomic-dev (1.11.0-1) ...
Setting up golang-github-beorn7-perks-dev (1.0.1-3) ...
Setting up libelf1t64:amd64 (0.192-4) ...
Setting up golang-github-hashicorp-go-cleanhttp-dev (0.5.2-1) ...
Setting up golang-github-hashicorp-errwrap-dev (1.1.0-1) ...
Setting up libsasl2-modules-db:amd64 (2.1.28+dfsg1-9) ...
Setting up tzdata (2025a-2) ...

Current default time zone: 'Etc/UTC'
Local time is now:      Wed Mar 12 12:34:20 UTC 2025.
Universal Time is now:  Wed Mar 12 12:34:20 UTC 2025.
Run 'dpkg-reconfigure tzdata' if you wish to change it.

Setting up golang-github-cespare-xxhash-dev (2.3.0-1) ...
Setting up golang-github-spf13-pflag-dev (1.0.6~git20210604-d5e0c0615ace-1) ...
Setting up golang-github-emersion-go-smtp-dev (0.21.2-1) ...
Setting up golang-gopkg-tomb.v2-dev (0.0~git20161208.d5d1b58-3) ...
Setting up golang-github-jpillora-backoff-dev (1.0.0-1.1) ...
Setting up golang-github-davecgh-go-spew-dev (1.1.1-3) ...
Setting up autotools-dev (20220109.1) ...
Setting up golang-github-pascaldekloe-goe-dev (0.1.0-4) ...
Setting up golang-github-xdg-go-pbkdf2-dev (1.0.0-3) ...
Setting up golang-github-go-logfmt-logfmt-dev (0.5.0-2) ...
Setting up golang-github-oklog-ulid-dev (2.0.2+ds-2) ...
Setting up golang-github-emersion-go-sasl-dev (0.0~git20230613.1d333a0-1) ...
Setting up golang-google-protobuf-dev (1.36.5-1) ...
Setting up golang-github-kr-text-dev (0.2.0-2) ...
Setting up golang-github-stretchr-testify-dev (1.10.0-1) ...
Setting up golang-github-kimmachinegun-automemlimit-dev (0.7.1-1) ...
Setting up bash-completion (1:2.16.0-7) ...
Setting up golang-github-hashicorp-go-immutable-radix-dev (1.3.1-3) ...
Setting up golang-github-yuin-goldmark-dev (1.7.4-1) ...
Setting up golang-github-chzyer-readline-dev (1.4.39.g2972be2-3) ...
Setting up libunistring5:amd64 (1.3-1) ...
Setting up libssl-dev:amd64 (3.4.1-1) ...
Setting up golang-gopkg-ini.v1-dev (1.67.0-1) ...
Setting up golang-golang-x-sync-dev (0.7.0-1) ...
Setting up golang-golang-x-mod-dev (0.19.0-1) ...
Setting up autopoint (0.23.1-1) ...
Setting up golang-github-magiconair-properties-dev (1.8.7-1) ...
Setting up golang-1.24-go (1.24.1-1) ...
Setting up golang-github-hashicorp-hcl-dev (1.0.0-1.1) ...
Setting up golang-github-xlab-treeprint-dev (1.2.0-2) ...
Setting up golang-github-klauspost-compress-dev (1.18.0+ds1-1) ...
Setting up golang-glog-dev (1.2.4-1) ...
Setting up libsasl2-2:amd64 (2.1.28+dfsg1-9) ...
Setting up golang-github-julienschmidt-httprouter-dev (1.3.0-2) ...
Setting up golang-github-hashicorp-go-multierror-dev (1.1.1-2) ...
Setting up golang-github-rogpeppe-fastuuid-dev (0.0~git20150106.0.6724a57-2.1) ...
Setting up autoconf (2.72-3) ...
Setting up zlib1g-dev:amd64 (1:1.3.dfsg+really1.3.1-1+b1) ...
Setting up golang-github-jessevdk-go-flags-dev (1.4.0-6) ...
Setting up golang-github-tv42-httpunix-dev (0.0~git20150427.b75d861-3) ...
Setting up dwz (0.15-1+b1) ...
Setting up golang-github-munnerz-goautoneg-dev (0.0~git20191010.a7dc8b6-2) ...
Setting up sensible-utils (0.0.24) ...
Setting up golang-golang-x-text-dev (0.22.0-1) ...
Setting up golang-github-go-logr-logr-dev (1.4.2-2) ...
Setting up golang-github-google-uuid-dev (1.6.0-1) ...
Setting up libuchardet0:amd64 (0.0.8-1+b2) ...
Setting up golang-github-fsnotify-fsnotify-dev (1.8.0-1) ...
Setting up golang-github-prometheus-procfs-dev (0.15.1-1) ...
Setting up golang-github-cenkalti-backoff-dev (4.3.0-1) ...
Setting up golang-github-alecthomas-units-dev (0.0~git20240626.61d1e34-1) ...
Setting up golang-github-modern-go-reflect2-dev (1.0.2-2) ...
Setting up golang-github-josharian-intern-dev (1.0.0-3) ...
Setting up golang-golang-x-crypto-dev (1:0.25.0-1) ...
Setting up golang-golang-x-exp-dev (0.0~git20231006.7918f67-2) ...
Setting up golang-github-coder-quartz-dev (0.1.3-2) ...
Setting up golang-github-prometheus-client-model-dev (0.6.0-1) ...
Setting up golang-github-go-logr-stdr-dev (1.2.2-4) ...
Setting up golang-github-gofrs-uuid-dev (5.3.1-1) ...
Setting up golang-github-pelletier-go-toml-dev (1.9.5-1) ...
Setting up golang-github-spf13-jwalterweatherman-dev (1.1.0+really1.1.0-2) ...
Setting up golang-github-datadog-datadog-go-dev (2.1.0-3) ...
Setting up golang-uber-automaxprocs-dev (1.5.3-1) ...
Setting up golang-golang-x-oauth2-dev (0.27.0-1) ...
Setting up golang-golang-x-xerrors-dev (0.0~git20231012.104605a-1) ...
Setting up golang-github-hashicorp-golang-lru-v2-dev (2.0.7-2) ...
Setting up golang-src (2:1.24~2) ...
Setting up libcap-dev:amd64 (1:2.66-5+b1) ...
Setting up golang-github-montanaflynn-stats-dev (0.7.1-1) ...
Setting up golang-github-vmihailenco-tagparser-dev (0.1.1-4) ...
Setting up golang-github-ugorji-go-codec-dev (1.2.8-1) ...
Setting up libxml2:amd64 (2.12.7+dfsg+really2.9.14-0.2+b2) ...
Setting up libsystemd-dev:amd64 (257.3-1) ...
Setting up golang-github-jmespath-go-jmespath-dev (0.4.0-2) ...
Setting up automake (1:1.17-3) ...
update-alternatives: using /usr/bin/automake-1.17 to provide /usr/bin/automake (automake) in auto mode
Setting up libfile-stripnondeterminism-perl (1.14.1-2) ...
Setting up golang-github-mattn-go-isatty-dev (0.0.20-1) ...
Setting up golang-github-go-kit-log-dev (0.2.1-1) ...
Setting up golang-github-golang-protobuf-1-5-dev (1.5.4-1) ...
Setting up gettext (0.23.1-1) ...
Setting up golang-gopkg-vmihailenco-msgpack.v2-dev (4.3.1-2) ...
Setting up golang-gopkg-alecthomas-kingpin.v2-dev (2.2.6-4) ...
Setting up libtool (2.5.4-4) ...
Setting up golang-go:amd64 (2:1.24~2) ...
Setting up golang-github-mattn-go-colorable-dev (0.1.13-1) ...
Setting up golang-github-antlr-antlr4-dev (4.11.1+ds-2) ...
Setting up golang-github-hashicorp-go-sockaddr-dev (1.0.2-2) ...
Setting up golang-github-golang-groupcache-dev (0.0~git20210331.41bb18b-1) ...
Setting up golang-github-pkg-sftp-dev (1.13.6-1) ...
Setting up golang-protobuf-extensions-dev (1.0.4-2) ...
Setting up golang-github-go-openapi-errors-dev (0.22.0-1) ...
Setting up golang-github-json-iterator-go-dev (1.1.12-2) ...
Setting up golang-github-google-pprof-dev (0.0~git20211008.947d60d-1) ...
Setting up golang-github-xdg-go-stringprep-dev (1.0.4-1) ...
Setting up golang-github-go-playground-locales-dev (0.14.0-3) ...
Setting up tzdata-legacy (2025a-2) ...
Setting up golang-any:amd64 (2:1.24~2) ...
Setting up intltool-debian (0.35.0+20060710.6) ...
Setting up libprotobuf-dev:amd64 (3.21.12-10+b6) ...
Setting up dh-autoreconf (20) ...
Setting up golang-github-youmark-pkcs8-dev (1.1-3) ...
Setting up libsasl2-dev (2.1.28+dfsg1-9) ...
Setting up golang-github-leodido-go-urn-dev (1.2.1-3) ...
Setting up golang-github-coreos-go-systemd-dev (22.5.0-1) ...
Setting up golang-github-mailru-easyjson-dev (0.7.7-1) ...
Setting up golang-golang-x-net-dev (1:0.27.0-1) ...
Setting up dh-strip-nondeterminism (1.14.1-2) ...
Setting up groff-base (1.23.0-7) ...
Setting up golang-github-spf13-cast-dev (1.6.0-2) ...
Setting up golang-github-spf13-afero-dev (1.11.0-1) ...
Setting up golang-github-mdlayher-socket-dev (0.5.1-1) ...
Setting up golang-github-aws-aws-sdk-go-dev (1.49.0-2) ...
Setting up golang-github-google-martian-dev (3.3.2-3) ...
Setting up golang-github-gogo-protobuf-dev (1.3.2-3) ...
Setting up golang-github-fatih-color-dev (1.17.0-1) ...
Setting up golang-github-miekg-dns-dev (1.1.63-1) ...
Setting up golang-github-mdlayher-vsock-dev (1.2.1-2) ...
Setting up po-debconf (1.0.21+nmu1) ...
Setting up golang-github-go-playground-universal-translator-dev (0.17.0-2) ...
Setting up golang-github-goccy-go-yaml-dev (1.9.5-2) ...
Setting up golang-google-cloud-compute-metadata-dev (0.56.0-5) ...
Setting up golang-golang-x-tools-dev (1:0.25.0+ds-1) ...
Setting up man-db (2.13.0-1) ...
Not building database; man-db/auto-update is not 'true'.
Setting up golang-github-xdg-go-scram-dev (1.1.2-1) ...
Setting up golang-github-go-openapi-swag-dev (1:0.23.0-1) ...
Setting up golang-golang-x-oauth2-google-dev (0.27.0-1) ...
Setting up golang-github-go-openapi-jsonpointer-dev (1:0.21.0-1) ...
Setting up golang-github-go-playground-validator-v10-dev (10.4.1-4) ...
Setting up golang-github-spf13-viper-dev (1.12.0-1) ...
Setting up golang-github-rogpeppe-go-internal-dev (1.12.0-3) ...
Setting up golang-github-go-openapi-jsonreference-dev (1:0.21.0-1) ...
Setting up golang-mongodb-mongo-driver-dev (1.17.1+ds1-1) ...
Setting up golang-github-gin-gonic-gin-dev (1.8.1-2) ...
Setting up golang-github-go-openapi-strfmt-dev (0.23.0-1) ...
Setting up golang-github-hashicorp-go-hclog-dev (0.11.0-1) ...
Setting up golang-github-kr-pretty-dev (0.3.1-1) ...
Setting up golang-github-go-openapi-spec-dev (1:0.21.0-1) ...
Setting up debhelper (13.24.1) ...
Setting up golang-gopkg-check.v1-dev (0.0+git20200902.038fdea-2) ...
Setting up golang-gopkg-mgo.v2-dev (2016.08.01-7) ...
Setting up golang-github-rs-cors-dev (1.7.0-4) ...
Setting up golang-gopkg-telebot.v3-dev (3.3.8-1) ...
Setting up golang-github-hashicorp-go-retryablehttp-dev (0.7.1-1) ...
Setting up dh-golang (1.63) ...
Setting up golang-github-hashicorp-go-msgpack-dev (0.5.5-1) ...
Setting up golang-github-circonus-labs-circonus-gometrics-dev (2.3.1-4) ...
Setting up golang-github-go-openapi-analysis-dev (0.23.0-1) ...
Setting up golang-go.opencensus-dev (0.24.0-2) ...
Setting up golang-github-mwitkow-go-conntrack-dev (0.0~git20190716.2f06839-4) ...
Setting up golang-google-genproto-dev (0.0~git20210726.e7812ac-4) ...
Setting up golang-github-googleapis-gax-go-dev (2.14.1-1) ...
Setting up golang-github-prometheus-sigv4-dev (0.1.2-2) ...
Setting up golang-github-go-openapi-loads-dev (0.22.0-1) ...
Setting up golang-github-prometheus-common-dev (0.62.0-3) ...
Setting up golang-google-api-dev (0.61.0-5) ...
Setting up golang-github-go-openapi-validate-dev (0.24.0-2) ...
Setting up golang-github-google-cel-go-dev (0.18.2+ds-5) ...
Setting up golang-github-prometheus-exporter-toolkit-dev (0.14.0-1) ...
Setting up golang-github-prometheus-client-golang-dev (1.21.1-1) ...
Setting up golang-google-cloud-dev (0.56.0-5) ...
Setting up golang-github-armon-go-metrics-dev (0.4.1-1) ...
Setting up golang-google-grpc-dev (1.64.0-6) ...
Setting up golang-github-grpc-ecosystem-grpc-gateway-dev (2.20.0-2) ...
Setting up golang-github-hashicorp-memberlist-dev (0.5.0-1) ...
Setting up golang-opentelemetry-proto-dev (1.3.1-2) ...
Setting up golang-opentelemetry-otel-dev (1.31.0-3) ...
Setting up golang-github-go-openapi-runtime-dev (0.28.0-1) ...
Processing triggers for libc-bin (2.40-7) ...
Reading package lists...
Building dependency tree...
Reading state information...
Reading extended state information...
Initializing package states...
Writing extended state information...
Building tag database...
 -> Finished parsing the build-deps
I: Building the package
I: user script /srv/workspace/pbuilder/2508373/tmp/hooks/A99_set_merged_usr starting
Not re-configuring usrmerge for trixie
I: user script /srv/workspace/pbuilder/2508373/tmp/hooks/A99_set_merged_usr finished
hostname: Name or service not known
I: Running cd /build/reproducible-path/prometheus-alertmanager-0.28.1+ds/ && env PATH="/usr/sbin:/usr/bin:/sbin:/bin:/usr/games:/i/capture/the/path" HOME="/nonexistent/second-build" dpkg-buildpackage -us -uc -b && env PATH="/usr/sbin:/usr/bin:/sbin:/bin:/usr/games:/i/capture/the/path" HOME="/nonexistent/second-build" dpkg-genchanges -S  > ../prometheus-alertmanager_0.28.1+ds-1_source.changes
dpkg-buildpackage: info: source package prometheus-alertmanager
dpkg-buildpackage: info: source version 0.28.1+ds-1
dpkg-buildpackage: info: source distribution unstable
dpkg-buildpackage: info: source changed by Daniel Swarbrick <dswarbrick@debian.org>
 dpkg-source --before-build .
dpkg-buildpackage: info: host architecture amd64
 debian/rules clean
dh clean --builddir=_build --buildsystem=golang
   dh_auto_clean -O--builddir=_build -O--buildsystem=golang
   dh_autoreconf_clean -O--builddir=_build -O--buildsystem=golang
   dh_clean -O--builddir=_build -O--buildsystem=golang
 debian/rules binary
dh binary --builddir=_build --buildsystem=golang
   dh_update_autotools_config -O--builddir=_build -O--buildsystem=golang
   dh_autoreconf -O--builddir=_build -O--buildsystem=golang
   dh_auto_configure -O--builddir=_build -O--buildsystem=golang
   debian/rules override_dh_auto_build
make[1]: Entering directory '/build/reproducible-path/prometheus-alertmanager-0.28.1+ds'
dh_auto_build -- -ldflags " -X github.com/prometheus/common/version.Version=0.28.1+ds -X github.com/prometheus/common/version.Revision=0.28.1+ds-1 -X github.com/prometheus/common/version.Branch=debian/sid -X github.com/prometheus/common/version.BuildUser=team+pkg-go@tracker.debian.org -X github.com/prometheus/common/version.BuildDate=20250309-13:50:43 -X github.com/prometheus/common/version.GoVersion=go1.24.1"
dh_auto_build: warning: github.com/prometheus/alertmanager/matcher/compliance contains no non-test Go files, removing it from build
	cd _build && go install -trimpath -v -p 20 -ldflags " -X github.com/prometheus/common/version.Version=0.28.1+ds -X github.com/prometheus/common/version.Revision=0.28.1+ds-1 -X github.com/prometheus/common/version.Branch=debian/sid -X github.com/prometheus/common/version.BuildUser=team+pkg-go@tracker.debian.org -X github.com/prometheus/common/version.BuildDate=20250309-13:50:43 -X github.com/prometheus/common/version.GoVersion=go1.24.1" github.com/prometheus/alertmanager/api github.com/prometheus/alertmanager/api/metrics github.com/prometheus/alertmanager/api/v2 github.com/prometheus/alertmanager/api/v2/client github.com/prometheus/alertmanager/api/v2/client/alert github.com/prometheus/alertmanager/api/v2/client/alertgroup github.com/prometheus/alertmanager/api/v2/client/general github.com/prometheus/alertmanager/api/v2/client/receiver github.com/prometheus/alertmanager/api/v2/client/silence github.com/prometheus/alertmanager/api/v2/models github.com/prometheus/alertmanager/api/v2/restapi github.com/prometheus/alertmanager/api/v2/restapi/operations github.com/prometheus/alertmanager/api/v2/restapi/operations/alert github.com/prometheus/alertmanager/api/v2/restapi/operations/alertgroup github.com/prometheus/alertmanager/api/v2/restapi/operations/general github.com/prometheus/alertmanager/api/v2/restapi/operations/receiver github.com/prometheus/alertmanager/api/v2/restapi/operations/silence github.com/prometheus/alertmanager/cli github.com/prometheus/alertmanager/cli/config github.com/prometheus/alertmanager/cli/format github.com/prometheus/alertmanager/cluster github.com/prometheus/alertmanager/cluster/clusterpb github.com/prometheus/alertmanager/cmd/alertmanager github.com/prometheus/alertmanager/cmd/amtool github.com/prometheus/alertmanager/config github.com/prometheus/alertmanager/config/receiver github.com/prometheus/alertmanager/dispatch github.com/prometheus/alertmanager/featurecontrol github.com/prometheus/alertmanager/inhibit github.com/prometheus/alertmanager/matcher/compat github.com/prometheus/alertmanager/matcher/parse github.com/prometheus/alertmanager/nflog github.com/prometheus/alertmanager/nflog/nflogpb github.com/prometheus/alertmanager/notify github.com/prometheus/alertmanager/notify/discord github.com/prometheus/alertmanager/notify/email github.com/prometheus/alertmanager/notify/msteams github.com/prometheus/alertmanager/notify/msteamsv2 github.com/prometheus/alertmanager/notify/opsgenie github.com/prometheus/alertmanager/notify/pagerduty github.com/prometheus/alertmanager/notify/pushover github.com/prometheus/alertmanager/notify/rocketchat github.com/prometheus/alertmanager/notify/slack github.com/prometheus/alertmanager/notify/sns github.com/prometheus/alertmanager/notify/telegram github.com/prometheus/alertmanager/notify/test github.com/prometheus/alertmanager/notify/victorops github.com/prometheus/alertmanager/notify/webex github.com/prometheus/alertmanager/notify/webhook github.com/prometheus/alertmanager/notify/wechat github.com/prometheus/alertmanager/pkg/labels github.com/prometheus/alertmanager/pkg/modtimevfs github.com/prometheus/alertmanager/provider github.com/prometheus/alertmanager/provider/mem github.com/prometheus/alertmanager/silence github.com/prometheus/alertmanager/silence/silencepb github.com/prometheus/alertmanager/store github.com/prometheus/alertmanager/template github.com/prometheus/alertmanager/test/cli github.com/prometheus/alertmanager/test/with_api_v2 github.com/prometheus/alertmanager/timeinterval github.com/prometheus/alertmanager/types github.com/prometheus/alertmanager/ui
internal/goos
unicode
internal/byteorder
math/bits
unicode/utf8
internal/goarch
internal/unsafeheader
internal/godebugs
internal/asan
internal/coverage/rtcov
cmp
internal/runtime/syscall
internal/msan
internal/goexperiment
internal/profilerecord
internal/cpu
encoding
sync/atomic
internal/itoa
internal/runtime/atomic
unicode/utf16
log/internal
internal/nettrace
crypto/internal/fips140/alias
crypto/internal/boring/sig
container/list
vendor/golang.org/x/crypto/cryptobyte/asn1
vendor/golang.org/x/crypto/internal/alias
go.mongodb.org/mongo-driver/bson/bsonoptions
crypto/internal/fips140deps/byteorder
internal/abi
internal/chacha8rand
internal/runtime/math
internal/runtime/sys
go.mongodb.org/mongo-driver/bson/bsontype
crypto/internal/fips140/subtle
golang.org/x/net/internal/iana
log/slog/internal
github.com/aws/aws-sdk-go/aws/client/metadata
google.golang.org/protobuf/internal/flags
go.opentelemetry.io/otel/metric/embedded
google.golang.org/protobuf/internal/set
go.opentelemetry.io/otel/trace/embedded
github.com/klauspost/compress/internal/cpuinfo
github.com/klauspost/compress/internal/le
internal/runtime/exithook
internal/bytealg
crypto/internal/fips140deps/cpu
math
internal/stringslite
internal/race
internal/sync
internal/runtime/maps
github.com/aws/aws-sdk-go/internal/sdkmath
go.opentelemetry.io/otel/internal
github.com/klauspost/compress
runtime
internal/reflectlite
iter
sync
weak
crypto/subtle
runtime/metrics
slices
maps
internal/bisect
internal/testlog
github.com/josharian/intern
internal/singleflight
unique
google.golang.org/protobuf/internal/pragma
log/slog/internal/buffer
github.com/aws/aws-sdk-go/internal/sync/singleflight
runtime/cgo
errors
internal/godebug
sort
github.com/hashicorp/golang-lru/simplelru
internal/oserror
io
strconv
vendor/golang.org/x/net/dns/dnsmessage
path
math/rand/v2
syscall
bytes
internal/saferio
strings
hash
crypto/internal/randutil
github.com/aws/aws-sdk-go/internal/sdkio
crypto/internal/fips140deps/godebug
math/rand
hash/fnv
hash/crc32
github.com/beorn7/perks/quantile
github.com/gogo/protobuf/sortkeys
golang.org/x/text/internal/tag
golang.org/x/mod/semver
vendor/golang.org/x/text/transform
golang.org/x/text/transform
net/netip
crypto
encoding/base32
golang.org/x/crypto/blowfish
reflect
regexp/syntax
crypto/internal/impl
crypto/internal/fips140
bufio
net/http/internal/ascii
github.com/munnerz/goautoneg
github.com/aws/aws-sdk-go/internal/strings
html
net/http/internal/testcert
github.com/aws/aws-sdk-go/internal/sdkuri
github.com/hashicorp/go-immutable-radix
crypto/internal/fips140/sha3
crypto/internal/fips140/sha512
crypto/tls/internal/fips140tls
crypto/internal/fips140/sha256
crypto/sha3
crypto/internal/fips140/hmac
crypto/internal/fips140/check
crypto/internal/fips140hash
crypto/internal/fips140/edwards25519/field
crypto/internal/fips140/bigmod
crypto/internal/fips140/hkdf
crypto/internal/fips140/tls12
crypto/internal/fips140/aes
internal/syscall/execenv
internal/syscall/unix
github.com/pbnjay/memory
crypto/internal/fips140/nistec/fiat
time
crypto/internal/fips140/tls13
crypto/internal/fips140/edwards25519
regexp
io/fs
github.com/hashicorp/golang-lru/v2/internal
context
github.com/jpillora/backoff
github.com/aws/aws-sdk-go/internal/sdkrand
internal/poll
github.com/hashicorp/golang-lru/v2/simplelru
github.com/hashicorp/golang-lru/v2
github.com/cenkalti/backoff
go.opentelemetry.io/otel/internal/baggage
internal/filepathlite
embed
crypto/internal/fips140/nistec
google.golang.org/protobuf/internal/editiondefaults
os
internal/fmtsort
go.opentelemetry.io/otel/internal/attribute
github.com/hashicorp/errwrap
encoding/binary
encoding/base64
github.com/cespare/xxhash
vendor/golang.org/x/crypto/internal/poly1305
github.com/klauspost/compress/internal/snapref
golang.org/x/sys/unix
encoding/pem
fmt
path/filepath
crypto/internal/sysrand
google.golang.org/protobuf/internal/detrand
io/ioutil
github.com/prometheus/procfs/internal/util
os/signal
internal/lazyregexp
internal/sysinfo
vendor/golang.org/x/sys/cpu
net
crypto/internal/entropy
crypto/internal/fips140/drbg
os/exec
crypto/internal/fips140only
crypto/internal/fips140/ecdh
crypto/internal/fips140/ecdsa
crypto/internal/fips140/ed25519
crypto/internal/fips140/aes/gcm
crypto/internal/fips140/mlkem
crypto/internal/fips140/rsa
crypto/md5
crypto/rc4
crypto/cipher
log
encoding/gob
encoding/json
mime
gopkg.in/yaml.v3
net/http/internal
compress/flate
golang.org/x/sync/errgroup
encoding/csv
database/sql/driver
encoding/hex
net/url
vendor/golang.org/x/net/http2/hpack
vendor/golang.org/x/text/unicode/norm
math/big
encoding/xml
mime/quotedprintable
crypto/internal/boring
crypto/des
vendor/golang.org/x/crypto/chacha20
github.com/go-openapi/runtime/logger
crypto/aes
github.com/go-openapi/analysis/internal/debug
crypto/ecdh
crypto/sha512
crypto/hmac
crypto/sha1
crypto/sha256
vendor/golang.org/x/text/unicode/bidi
text/template/parse
google.golang.org/protobuf/internal/errors
go/token
github.com/oklog/ulid
vendor/golang.org/x/crypto/chacha20poly1305
google.golang.org/protobuf/internal/version
google.golang.org/protobuf/encoding/protowire
github.com/go-openapi/jsonreference/internal
github.com/prometheus/procfs/internal/fs
compress/gzip
runtime/debug
github.com/docker/go-units
github.com/jessevdk/go-flags
compress/lzw
google.golang.org/protobuf/reflect/protoreflect
github.com/google/btree
github.com/hashicorp/go-multierror
golang.org/x/net/bpf
github.com/go-openapi/runtime/flagext
golang.org/x/net/internal/timeseries
text/tabwriter
golang.org/x/text/unicode/bidi
golang.org/x/text/unicode/norm
golang.org/x/net/http2/hpack
gopkg.in/yaml.v2
github.com/go-logfmt/logfmt
github.com/aws/aws-sdk-go/aws/awserr
vendor/golang.org/x/text/secure/bidirule
os/user
github.com/oklog/run
flag
github.com/aws/aws-sdk-go/internal/ini
runtime/trace
database/sql
golang.org/x/text/internal/language
github.com/opentracing/opentracing-go/log
vendor/golang.org/x/net/idna
go.opentelemetry.io/otel/baggage
text/template
github.com/mailru/easyjson/jlexer
golang.org/x/text/secure/bidirule
github.com/gogo/protobuf/proto
github.com/go-kit/log
github.com/mdlayher/socket
log/slog
github.com/jmespath/go-jmespath
github.com/aws/aws-sdk-go/aws/endpoints
google.golang.org/protobuf/internal/descfmt
google.golang.org/protobuf/internal/descopts
google.golang.org/protobuf/internal/strs
google.golang.org/protobuf/internal/encoding/messageset
google.golang.org/protobuf/internal/genid
google.golang.org/protobuf/internal/order
google.golang.org/protobuf/runtime/protoiface
google.golang.org/protobuf/internal/encoding/text
google.golang.org/protobuf/reflect/protoregistry
golang.org/x/net/idna
google.golang.org/protobuf/internal/protolazy
testing
crypto/rand
crypto/elliptic
crypto/internal/boring/bbig
encoding/asn1
crypto/ed25519
crypto/internal/hpke
crypto/rsa
crypto/dsa
go.mongodb.org/mongo-driver/bson/primitive
google.golang.org/protobuf/proto
github.com/hashicorp/memberlist/vendor/github.com/sean-/seed
golang.org/x/crypto/bcrypt
golang.org/x/text/internal/language/compact
github.com/aws/aws-sdk-go/aws/awsutil
go.opentelemetry.io/otel/attribute
google.golang.org/protobuf/internal/encoding/defval
html/template
github.com/prometheus/common/promslog
github.com/prometheus/alertmanager/featurecontrol
github.com/prometheus/common/version
github.com/go-logr/logr
golang.org/x/text/language
go.opentelemetry.io/otel/codes
github.com/alecthomas/units
go.mongodb.org/mongo-driver/x/bsonx/bsoncore
go/scanner
go/doc/comment
github.com/xlab/treeprint
github.com/KimMachineGun/automemlimit/memlimit
github.com/klauspost/compress/fse
internal/profile
runtime/pprof
github.com/prometheus/alertmanager/timeinterval
go/ast
github.com/go-logr/logr/funcr
vendor/golang.org/x/crypto/cryptobyte
go.opentelemetry.io/otel/metric
crypto/x509/pkix
google.golang.org/protobuf/internal/filedesc
google.golang.org/protobuf/encoding/prototext
google.golang.org/protobuf/encoding/protodelim
go.opentelemetry.io/otel/trace
go.opentelemetry.io/otel/semconv/v1.17.0
github.com/klauspost/compress/huff0
go.uber.org/automaxprocs/internal/cgroups
golang.org/x/text/internal
github.com/davecgh/go-spew/spew
github.com/aws/aws-sdk-go/internal/shareddefaults
github.com/pmezard/go-difflib/difflib
crypto/ecdsa
golang.org/x/text/cases
github.com/aws/aws-sdk-go/aws/credentials
github.com/go-logr/stdr
go.uber.org/automaxprocs/internal/runtime
github.com/stretchr/testify/assert/yaml
go.uber.org/automaxprocs/maxprocs
github.com/aws/aws-sdk-go/aws/credentials/processcreds
github.com/coder/quartz
go.mongodb.org/mongo-driver/bson/bsonrw
github.com/klauspost/compress/zstd
go/doc
google.golang.org/protobuf/internal/encoding/tag
google.golang.org/protobuf/internal/impl
go.mongodb.org/mongo-driver/bson/bsoncodec
github.com/mailru/easyjson/buffer
golang.org/x/net/netutil
net/textproto
golang.org/x/net/http/httpproxy
github.com/mdlayher/vsock
crypto/x509
gopkg.in/alecthomas/kingpin.v2
github.com/google/uuid
github.com/mitchellh/mapstructure
github.com/prometheus/procfs
golang.org/x/net/internal/socket
github.com/hashicorp/go-sockaddr
github.com/gofrs/uuid
vendor/golang.org/x/net/http/httpproxy
github.com/mailru/easyjson/jwriter
mime/multipart
vendor/golang.org/x/net/http/httpguts
net/mail
golang.org/x/net/http/httpguts
golang.org/x/net/ipv4
golang.org/x/net/ipv6
github.com/gogo/protobuf/protoc-gen-gogo/descriptor
github.com/gogo/protobuf/types
github.com/asaskevich/govalidator
crypto/tls
github.com/gogo/protobuf/gogoproto
github.com/prometheus/common/promslog/flag
go.mongodb.org/mongo-driver/bson
github.com/prometheus/alertmanager/cluster/clusterpb
github.com/prometheus/alertmanager/nflog/nflogpb
github.com/prometheus/alertmanager/silence/silencepb
google.golang.org/protobuf/internal/filetype
google.golang.org/protobuf/runtime/protoimpl
google.golang.org/protobuf/types/known/timestamppb
google.golang.org/protobuf/types/descriptorpb
github.com/prometheus/client_model/go
github.com/prometheus/common/model
google.golang.org/protobuf/internal/editionssupport
google.golang.org/protobuf/types/gofeaturespb
github.com/prometheus/client_golang/prometheus/internal
github.com/prometheus/alertmanager/pkg/labels
github.com/prometheus/common/helpers/templates
net/http/httptrace
github.com/coreos/go-systemd/activation
net/smtp
github.com/miekg/dns
google.golang.org/protobuf/reflect/protodesc
github.com/prometheus/alertmanager/matcher/parse
net/http
github.com/prometheus/alertmanager/matcher/compat
github.com/golang/protobuf/proto
github.com/matttproud/golang_protobuf_extensions/pbutil
github.com/go-openapi/swag
github.com/go-openapi/errors
github.com/go-openapi/runtime/middleware/denco
github.com/go-openapi/runtime/middleware/header
expvar
github.com/prometheus/common/expfmt
golang.org/x/net/http2
net/http/httputil
github.com/armon/go-metrics
github.com/rs/cors
gopkg.in/telebot.v3
github.com/prometheus/client_golang/internal/github.com/golang/gddo/httputil/header
golang.org/x/oauth2/internal
go.opentelemetry.io/otel/semconv/internal/v2
go.opentelemetry.io/otel/propagation
net/rpc
golang.org/x/net/trace
github.com/opentracing/opentracing-go
github.com/julienschmidt/httprouter
github.com/aws/aws-sdk-go/aws
github.com/prometheus/client_golang/internal/github.com/golang/gddo/httputil
net/http/pprof
net/http/httptest
github.com/prometheus/alertmanager/pkg/modtimevfs
go.opentelemetry.io/otel/internal/global
github.com/opentracing/opentracing-go/ext
golang.org/x/oauth2
github.com/go-openapi/strfmt
go.opentelemetry.io/otel/semconv/v1.17.0/httpconv
github.com/prometheus/common/route
golang.org/x/oauth2/clientcredentials
github.com/stretchr/testify/assert
github.com/aws/aws-sdk-go/aws/auth/bearer
github.com/aws/aws-sdk-go/aws/request
go.opentelemetry.io/otel
github.com/prometheus/client_golang/prometheus
github.com/hashicorp/go-msgpack/codec
github.com/aws/aws-sdk-go/aws/client
github.com/aws/aws-sdk-go/aws/corehandlers
github.com/aws/aws-sdk-go/private/protocol
github.com/aws/aws-sdk-go/aws/csm
github.com/go-openapi/jsonpointer
github.com/aws/aws-sdk-go/private/protocol/rest
github.com/aws/aws-sdk-go/private/protocol/query/queryutil
github.com/aws/aws-sdk-go/private/protocol/xml/xmlutil
github.com/aws/aws-sdk-go/aws/ec2metadata
github.com/aws/aws-sdk-go/private/protocol/json/jsonutil
github.com/go-openapi/jsonreference
github.com/go-openapi/spec
github.com/go-openapi/runtime
github.com/aws/aws-sdk-go/private/protocol/query
github.com/aws/aws-sdk-go/aws/credentials/endpointcreds
github.com/aws/aws-sdk-go/aws/credentials/ec2rolecreds
github.com/aws/aws-sdk-go/private/protocol/jsonrpc
github.com/aws/aws-sdk-go/aws/signer/v4
github.com/stretchr/testify/require
github.com/aws/aws-sdk-go/aws/defaults
github.com/aws/aws-sdk-go/private/protocol/restjson
github.com/go-openapi/runtime/security
github.com/go-openapi/runtime/yamlpc
github.com/hashicorp/memberlist
github.com/aws/aws-sdk-go/service/sns
github.com/aws/aws-sdk-go/service/sts
github.com/aws/aws-sdk-go/service/sso
github.com/aws/aws-sdk-go/service/ssooidc
github.com/aws/aws-sdk-go/service/sts/stsiface
github.com/aws/aws-sdk-go/service/sso/ssoiface
github.com/aws/aws-sdk-go/aws/credentials/stscreds
github.com/aws/aws-sdk-go/aws/credentials/ssocreds
github.com/prometheus/alertmanager/api/metrics
github.com/mwitkow/go-conntrack
github.com/prometheus/client_golang/prometheus/collectors/version
github.com/prometheus/alertmanager/types
github.com/prometheus/client_golang/prometheus/promhttp
github.com/aws/aws-sdk-go/aws/session
github.com/go-openapi/analysis/internal/flatten/normalize
github.com/go-openapi/analysis/internal/flatten/operations
github.com/go-openapi/analysis/internal/flatten/replace
github.com/go-openapi/analysis/internal/flatten/schutils
github.com/go-openapi/analysis/internal/flatten/sortref
github.com/prometheus/alertmanager/provider
github.com/prometheus/alertmanager/store
github.com/prometheus/alertmanager/template
github.com/prometheus/common/config
github.com/go-openapi/analysis
github.com/prometheus/alertmanager/provider/mem
github.com/prometheus/alertmanager/ui
github.com/prometheus/exporter-toolkit/web
github.com/prometheus/sigv4
github.com/prometheus/alertmanager/cli/config
github.com/go-openapi/loads
github.com/go-openapi/runtime/middleware/untyped
github.com/go-openapi/validate
github.com/prometheus/alertmanager/config
github.com/prometheus/alertmanager/cluster
github.com/prometheus/exporter-toolkit/web/kingpinflag
github.com/prometheus/alertmanager/inhibit
github.com/prometheus/alertmanager/nflog
github.com/prometheus/alertmanager/silence
github.com/prometheus/alertmanager/notify
github.com/go-openapi/runtime/middleware
github.com/prometheus/alertmanager/api/v2/models
github.com/prometheus/alertmanager/dispatch
github.com/prometheus/alertmanager/notify/discord
github.com/prometheus/alertmanager/notify/email
github.com/prometheus/alertmanager/notify/msteams
github.com/prometheus/alertmanager/notify/msteamsv2
github.com/prometheus/alertmanager/notify/opsgenie
github.com/prometheus/alertmanager/notify/pagerduty
github.com/prometheus/alertmanager/notify/pushover
github.com/prometheus/alertmanager/notify/rocketchat
github.com/prometheus/alertmanager/cli/format
github.com/prometheus/alertmanager/notify/slack
github.com/prometheus/alertmanager/notify/wechat
github.com/prometheus/alertmanager/notify/webex
github.com/prometheus/alertmanager/notify/webhook
github.com/prometheus/alertmanager/notify/test
github.com/prometheus/alertmanager/notify/sns
github.com/prometheus/alertmanager/notify/telegram
github.com/prometheus/alertmanager/notify/victorops
github.com/prometheus/alertmanager/config/receiver
github.com/prometheus/alertmanager/api/v2/restapi/operations/alertgroup
github.com/prometheus/alertmanager/api/v2/restapi/operations/alert
github.com/prometheus/alertmanager/api/v2/restapi/operations/general
github.com/prometheus/alertmanager/api/v2/restapi/operations/receiver
github.com/prometheus/alertmanager/api/v2/restapi/operations/silence
github.com/go-openapi/runtime/client
github.com/prometheus/alertmanager/api/v2/restapi/operations
github.com/prometheus/alertmanager/api/v2/restapi
github.com/prometheus/alertmanager/api/v2/client/alert
github.com/prometheus/alertmanager/api/v2/client/alertgroup
github.com/prometheus/alertmanager/api/v2/client/receiver
github.com/prometheus/alertmanager/api/v2/client/silence
github.com/prometheus/alertmanager/api/v2/client/general
github.com/prometheus/alertmanager/api/v2
github.com/prometheus/alertmanager/api/v2/client
github.com/prometheus/alertmanager/api
github.com/prometheus/alertmanager/cli
github.com/prometheus/alertmanager/test/cli
github.com/prometheus/alertmanager/test/with_api_v2
github.com/prometheus/alertmanager/cmd/alertmanager
github.com/prometheus/alertmanager/cmd/amtool
# Rename the binary to match the debian package.
mv -v _build/bin/alertmanager _build/bin/prometheus-alertmanager
renamed '_build/bin/alertmanager' -> '_build/bin/prometheus-alertmanager'
# Build bash completion scripts.
mkdir -vp _build/bash_completion.d
mkdir: created directory '_build/bash_completion.d'
_build/bin/amtool --completion-script-bash > _build/bash_completion.d/amtool
make[1]: Leaving directory '/build/reproducible-path/prometheus-alertmanager-0.28.1+ds'
   dh_auto_test -O--builddir=_build -O--buildsystem=golang
	cd _build && go test -vet=off -v -p 20 github.com/prometheus/alertmanager/api github.com/prometheus/alertmanager/api/metrics github.com/prometheus/alertmanager/api/v2 github.com/prometheus/alertmanager/api/v2/client github.com/prometheus/alertmanager/api/v2/client/alert github.com/prometheus/alertmanager/api/v2/client/alertgroup github.com/prometheus/alertmanager/api/v2/client/general github.com/prometheus/alertmanager/api/v2/client/receiver github.com/prometheus/alertmanager/api/v2/client/silence github.com/prometheus/alertmanager/api/v2/models github.com/prometheus/alertmanager/api/v2/restapi github.com/prometheus/alertmanager/api/v2/restapi/operations github.com/prometheus/alertmanager/api/v2/restapi/operations/alert github.com/prometheus/alertmanager/api/v2/restapi/operations/alertgroup github.com/prometheus/alertmanager/api/v2/restapi/operations/general github.com/prometheus/alertmanager/api/v2/restapi/operations/receiver github.com/prometheus/alertmanager/api/v2/restapi/operations/silence github.com/prometheus/alertmanager/cli github.com/prometheus/alertmanager/cli/config github.com/prometheus/alertmanager/cli/format github.com/prometheus/alertmanager/cluster github.com/prometheus/alertmanager/cluster/clusterpb github.com/prometheus/alertmanager/cmd/alertmanager github.com/prometheus/alertmanager/cmd/amtool github.com/prometheus/alertmanager/config github.com/prometheus/alertmanager/config/receiver github.com/prometheus/alertmanager/dispatch github.com/prometheus/alertmanager/featurecontrol github.com/prometheus/alertmanager/inhibit github.com/prometheus/alertmanager/matcher/compat github.com/prometheus/alertmanager/matcher/compliance github.com/prometheus/alertmanager/matcher/parse github.com/prometheus/alertmanager/nflog github.com/prometheus/alertmanager/nflog/nflogpb github.com/prometheus/alertmanager/notify github.com/prometheus/alertmanager/notify/discord github.com/prometheus/alertmanager/notify/email github.com/prometheus/alertmanager/notify/msteams github.com/prometheus/alertmanager/notify/msteamsv2 github.com/prometheus/alertmanager/notify/opsgenie github.com/prometheus/alertmanager/notify/pagerduty github.com/prometheus/alertmanager/notify/pushover github.com/prometheus/alertmanager/notify/rocketchat github.com/prometheus/alertmanager/notify/slack github.com/prometheus/alertmanager/notify/sns github.com/prometheus/alertmanager/notify/telegram github.com/prometheus/alertmanager/notify/test github.com/prometheus/alertmanager/notify/victorops github.com/prometheus/alertmanager/notify/webex github.com/prometheus/alertmanager/notify/webhook github.com/prometheus/alertmanager/notify/wechat github.com/prometheus/alertmanager/pkg/labels github.com/prometheus/alertmanager/pkg/modtimevfs github.com/prometheus/alertmanager/provider github.com/prometheus/alertmanager/provider/mem github.com/prometheus/alertmanager/silence github.com/prometheus/alertmanager/silence/silencepb github.com/prometheus/alertmanager/store github.com/prometheus/alertmanager/template github.com/prometheus/alertmanager/test/cli github.com/prometheus/alertmanager/test/with_api_v2 github.com/prometheus/alertmanager/timeinterval github.com/prometheus/alertmanager/types github.com/prometheus/alertmanager/ui
?   	github.com/prometheus/alertmanager/api	[no test files]
?   	github.com/prometheus/alertmanager/api/metrics	[no test files]
=== RUN   TestGetStatusHandlerWithNilPeer
--- PASS: TestGetStatusHandlerWithNilPeer (0.00s)
=== RUN   TestGetSilencesHandler
--- PASS: TestGetSilencesHandler (0.00s)
=== RUN   TestDeleteSilenceHandler
--- PASS: TestDeleteSilenceHandler (0.00s)
=== RUN   TestPostSilencesHandler
=== RUN   TestPostSilencesHandler/Silences_CRUD
=== RUN   TestPostSilencesHandler/Silences_CRUD/with_an_non-existent_silence_ID_-_it_returns_404
=== RUN   TestPostSilencesHandler/Silences_CRUD/with_no_silence_ID_-_it_creates_the_silence
=== RUN   TestPostSilencesHandler/Silences_CRUD/with_an_active_silence_ID_-_it_extends_the_silence
=== RUN   TestPostSilencesHandler/Silences_CRUD/with_an_expired_silence_ID_-_it_re-creates_the_silence
--- PASS: TestPostSilencesHandler (0.00s)
    --- PASS: TestPostSilencesHandler/Silences_CRUD (0.00s)
        --- PASS: TestPostSilencesHandler/Silences_CRUD/with_an_non-existent_silence_ID_-_it_returns_404 (0.00s)
        --- PASS: TestPostSilencesHandler/Silences_CRUD/with_no_silence_ID_-_it_creates_the_silence (0.00s)
        --- PASS: TestPostSilencesHandler/Silences_CRUD/with_an_active_silence_ID_-_it_extends_the_silence (0.00s)
        --- PASS: TestPostSilencesHandler/Silences_CRUD/with_an_expired_silence_ID_-_it_re-creates_the_silence (0.00s)
=== RUN   TestPostSilencesHandlerMissingIdCreatesSilence
--- PASS: TestPostSilencesHandlerMissingIdCreatesSilence (0.01s)
=== RUN   TestCheckSilenceMatchesFilterLabels
--- PASS: TestCheckSilenceMatchesFilterLabels (0.01s)
=== RUN   TestAlertToOpenAPIAlert
--- PASS: TestAlertToOpenAPIAlert (0.00s)
=== RUN   TestMatchFilterLabels
--- PASS: TestMatchFilterLabels (0.00s)
=== RUN   TestGetReceiversHandler
--- PASS: TestGetReceiversHandler (0.00s)
PASS
ok  	github.com/prometheus/alertmanager/api/v2	0.300s
?   	github.com/prometheus/alertmanager/api/v2/client	[no test files]
?   	github.com/prometheus/alertmanager/api/v2/client/alert	[no test files]
?   	github.com/prometheus/alertmanager/api/v2/client/alertgroup	[no test files]
?   	github.com/prometheus/alertmanager/api/v2/client/general	[no test files]
?   	github.com/prometheus/alertmanager/api/v2/client/receiver	[no test files]
?   	github.com/prometheus/alertmanager/api/v2/client/silence	[no test files]
?   	github.com/prometheus/alertmanager/api/v2/models	[no test files]
?   	github.com/prometheus/alertmanager/api/v2/restapi	[no test files]
?   	github.com/prometheus/alertmanager/api/v2/restapi/operations	[no test files]
?   	github.com/prometheus/alertmanager/api/v2/restapi/operations/alert	[no test files]
?   	github.com/prometheus/alertmanager/api/v2/restapi/operations/alertgroup	[no test files]
?   	github.com/prometheus/alertmanager/api/v2/restapi/operations/general	[no test files]
?   	github.com/prometheus/alertmanager/api/v2/restapi/operations/receiver	[no test files]
?   	github.com/prometheus/alertmanager/api/v2/restapi/operations/silence	[no test files]
=== RUN   TestCheckConfig
Checking 'testdata/conf.good.yml'  SUCCESS
Found:
 - global config
 - route
 - 0 inhibit rules
 - 1 receivers
 - 1 templates
  SUCCESS

Checking 'testdata/conf.bad.yml'  FAILED: yaml: unmarshal errors:
  line 1: cannot unmarshal !!str `BAD` into config.plain

--- PASS: TestCheckConfig (0.00s)
=== RUN   TestRoutingTest
  OK
  OK
  OK
  OK
--- PASS: TestRoutingTest (0.00s)
PASS
ok  	github.com/prometheus/alertmanager/cli	0.411s
=== RUN   TestNewConfigResolver
--- PASS: TestNewConfigResolver (0.00s)
=== RUN   TestConfigResolverBind
--- PASS: TestConfigResolverBind (0.00s)
PASS
ok  	github.com/prometheus/alertmanager/cli/config	0.101s
?   	github.com/prometheus/alertmanager/cli/format	[no test files]
=== RUN   TestCalculateAdvertiseAddress
=== RUN   TestCalculateAdvertiseAddress/use_provided_bind_address
=== RUN   TestCalculateAdvertiseAddress/use_provided_advertise_address
=== RUN   TestCalculateAdvertiseAddress/discover_private_ip_address
=== RUN   TestCalculateAdvertiseAddress/error_if_getPrivateAddress_errors
=== RUN   TestCalculateAdvertiseAddress/error_if_getPrivateAddress_returns_an_invalid_address
=== RUN   TestCalculateAdvertiseAddress/error_if_getPrivateAddress_returns_an_empty_address
=== RUN   TestCalculateAdvertiseAddress/discover_public_advertise_address
=== RUN   TestCalculateAdvertiseAddress/error_if_getPublicAddress_errors
=== RUN   TestCalculateAdvertiseAddress/error_if_getPublicAddress_returns_an_invalid_address
=== RUN   TestCalculateAdvertiseAddress/error_if_getPublicAddress_returns_an_empty_address
--- PASS: TestCalculateAdvertiseAddress (0.00s)
    --- PASS: TestCalculateAdvertiseAddress/use_provided_bind_address (0.00s)
    --- PASS: TestCalculateAdvertiseAddress/use_provided_advertise_address (0.00s)
    --- PASS: TestCalculateAdvertiseAddress/discover_private_ip_address (0.00s)
    --- PASS: TestCalculateAdvertiseAddress/error_if_getPrivateAddress_errors (0.00s)
    --- PASS: TestCalculateAdvertiseAddress/error_if_getPrivateAddress_returns_an_invalid_address (0.00s)
    --- PASS: TestCalculateAdvertiseAddress/error_if_getPrivateAddress_returns_an_empty_address (0.00s)
    --- PASS: TestCalculateAdvertiseAddress/discover_public_advertise_address (0.00s)
    --- PASS: TestCalculateAdvertiseAddress/error_if_getPublicAddress_errors (0.00s)
    --- PASS: TestCalculateAdvertiseAddress/error_if_getPublicAddress_returns_an_invalid_address (0.00s)
    --- PASS: TestCalculateAdvertiseAddress/error_if_getPublicAddress_returns_an_empty_address (0.00s)
=== RUN   TestNormalMessagesGossiped
--- PASS: TestNormalMessagesGossiped (0.00s)
=== RUN   TestOversizedMessagesGossiped
--- PASS: TestOversizedMessagesGossiped (0.00s)
=== RUN   TestClusterJoinAndReconnect
    cluster_test.go:31: skipping tests because no private IP address can be found
--- SKIP: TestClusterJoinAndReconnect (0.00s)
=== RUN   TestWriteStream
--- PASS: TestWriteStream (0.00s)
=== RUN   TestWritePacket
--- PASS: TestWritePacket (0.00s)
=== RUN   TestRead_Nil
--- PASS: TestRead_Nil (0.00s)
=== RUN   TestTLSConn_Close
--- PASS: TestTLSConn_Close (0.00s)
=== RUN   TestNewTLSTransport
=== RUN   TestNewTLSTransport/#00
=== RUN   TestNewTLSTransport/#01
=== RUN   TestNewTLSTransport/#02
=== RUN   TestNewTLSTransport/#03
=== RUN   TestNewTLSTransport/#04
=== RUN   TestNewTLSTransport/#05
=== RUN   TestNewTLSTransport/#06
=== RUN   TestNewTLSTransport/#07
--- PASS: TestNewTLSTransport (0.02s)
    --- PASS: TestNewTLSTransport/#00 (0.00s)
    --- PASS: TestNewTLSTransport/#01 (0.00s)
    --- PASS: TestNewTLSTransport/#02 (0.00s)
    --- PASS: TestNewTLSTransport/#03 (0.00s)
    --- PASS: TestNewTLSTransport/#04 (0.00s)
    --- PASS: TestNewTLSTransport/#05 (0.00s)
    --- PASS: TestNewTLSTransport/#06 (0.00s)
    --- PASS: TestNewTLSTransport/#07 (0.01s)
=== RUN   TestFinalAdvertiseAddr
--- PASS: TestFinalAdvertiseAddr (0.01s)
=== RUN   TestWriteTo
--- PASS: TestWriteTo (0.04s)
=== RUN   TestDialTimeout
--- PASS: TestDialTimeout (0.05s)
=== RUN   TestShutdown
--- PASS: TestShutdown (0.50s)
PASS
ok  	github.com/prometheus/alertmanager/cluster	0.944s
?   	github.com/prometheus/alertmanager/cluster/clusterpb	[no test files]
=== RUN   TestExternalURL
=== RUN   TestExternalURL/external="",listen=":9093"
=== RUN   TestExternalURL/external="",listen="localhost:9093"
=== RUN   TestExternalURL/external="",listen="localhost:"
=== RUN   TestExternalURL/external="https://host.example.com",listen=""
=== RUN   TestExternalURL/external="https://host.example.com/",listen=""
=== RUN   TestExternalURL/external="http://host.example.com/alertmanager",listen=""
=== RUN   TestExternalURL/external="http://host.example.com/alertmanager/",listen=""
=== RUN   TestExternalURL/external="http://host.example.com/////alertmanager//",listen=""
=== RUN   TestExternalURL/external="",listen=""
=== RUN   TestExternalURL/external="",listen=""#01
=== RUN   TestExternalURL/external="://broken_url_string",listen=""
=== RUN   TestExternalURL/external="host.example.com:8080",listen=""
--- PASS: TestExternalURL (0.00s)
    --- PASS: TestExternalURL/external="",listen=":9093" (0.00s)
    --- PASS: TestExternalURL/external="",listen="localhost:9093" (0.00s)
    --- PASS: TestExternalURL/external="",listen="localhost:" (0.00s)
    --- PASS: TestExternalURL/external="https://host.example.com",listen="" (0.00s)
    --- PASS: TestExternalURL/external="https://host.example.com/",listen="" (0.00s)
    --- PASS: TestExternalURL/external="http://host.example.com/alertmanager",listen="" (0.00s)
    --- PASS: TestExternalURL/external="http://host.example.com/alertmanager/",listen="" (0.00s)
    --- PASS: TestExternalURL/external="http://host.example.com/////alertmanager//",listen="" (0.00s)
    --- PASS: TestExternalURL/external="",listen="" (0.00s)
    --- PASS: TestExternalURL/external="",listen=""#01 (0.00s)
    --- PASS: TestExternalURL/external="://broken_url_string",listen="" (0.00s)
    --- PASS: TestExternalURL/external="host.example.com:8080",listen="" (0.00s)
PASS
ok  	github.com/prometheus/alertmanager/cmd/alertmanager	0.169s
?   	github.com/prometheus/alertmanager/cmd/amtool	[no test files]
=== RUN   TestLoadEmptyString
--- PASS: TestLoadEmptyString (0.00s)
=== RUN   TestDefaultReceiverExists
--- PASS: TestDefaultReceiverExists (0.00s)
=== RUN   TestReceiverNameIsUnique
--- PASS: TestReceiverNameIsUnique (0.00s)
=== RUN   TestReceiverExists
--- PASS: TestReceiverExists (0.00s)
=== RUN   TestReceiverExistsForDeepSubRoute
--- PASS: TestReceiverExistsForDeepSubRoute (0.00s)
=== RUN   TestReceiverHasName
--- PASS: TestReceiverHasName (0.00s)
=== RUN   TestMuteTimeExists
--- PASS: TestMuteTimeExists (0.00s)
=== RUN   TestActiveTimeExists
--- PASS: TestActiveTimeExists (0.00s)
=== RUN   TestTimeIntervalHasName
--- PASS: TestTimeIntervalHasName (0.00s)
=== RUN   TestMuteTimeNoDuplicates
--- PASS: TestMuteTimeNoDuplicates (0.00s)
=== RUN   TestGroupByHasNoDuplicatedLabels
--- PASS: TestGroupByHasNoDuplicatedLabels (0.00s)
=== RUN   TestWildcardGroupByWithOtherGroupByLabels
--- PASS: TestWildcardGroupByWithOtherGroupByLabels (0.00s)
=== RUN   TestGroupByInvalidLabel
--- PASS: TestGroupByInvalidLabel (0.00s)
=== RUN   TestRootRouteExists
--- PASS: TestRootRouteExists (0.00s)
=== RUN   TestRootRouteNoMuteTimes
--- PASS: TestRootRouteNoMuteTimes (0.00s)
=== RUN   TestRootRouteNoActiveTimes
--- PASS: TestRootRouteNoActiveTimes (0.00s)
=== RUN   TestRootRouteHasNoMatcher
=== RUN   TestRootRouteHasNoMatcher/Test_deprecated_matchers_on_root_route_not_allowed
=== RUN   TestRootRouteHasNoMatcher/Test_matchers_not_allowed_on_root_route
--- PASS: TestRootRouteHasNoMatcher (0.00s)
    --- PASS: TestRootRouteHasNoMatcher/Test_deprecated_matchers_on_root_route_not_allowed (0.00s)
    --- PASS: TestRootRouteHasNoMatcher/Test_matchers_not_allowed_on_root_route (0.00s)
=== RUN   TestContinueErrorInRouteRoot
--- PASS: TestContinueErrorInRouteRoot (0.00s)
=== RUN   TestGroupIntervalIsGreaterThanZero
--- PASS: TestGroupIntervalIsGreaterThanZero (0.00s)
=== RUN   TestRepeatIntervalIsGreaterThanZero
--- PASS: TestRepeatIntervalIsGreaterThanZero (0.00s)
=== RUN   TestHideConfigSecrets
--- PASS: TestHideConfigSecrets (0.02s)
=== RUN   TestShowMarshalSecretValues
--- PASS: TestShowMarshalSecretValues (0.01s)
=== RUN   TestJSONMarshal
--- PASS: TestJSONMarshal (0.00s)
=== RUN   TestJSONMarshalHideSecret
--- PASS: TestJSONMarshalHideSecret (0.00s)
=== RUN   TestJSONMarshalShowSecret
--- PASS: TestJSONMarshalShowSecret (0.00s)
=== RUN   TestJSONMarshalHideSecretURL
--- PASS: TestJSONMarshalHideSecretURL (0.00s)
=== RUN   TestJSONMarshalShowSecretURL
--- PASS: TestJSONMarshalShowSecretURL (0.00s)
=== RUN   TestUnmarshalSecretURL
--- PASS: TestUnmarshalSecretURL (0.00s)
=== RUN   TestHideSecretURL
--- PASS: TestHideSecretURL (0.00s)
=== RUN   TestShowMarshalSecretURL
--- PASS: TestShowMarshalSecretURL (0.00s)
=== RUN   TestMarshalURL
=== RUN   TestMarshalURL/url
=== RUN   TestMarshalURL/wrapped_nil_value
=== RUN   TestMarshalURL/wrapped_empty_URL
--- PASS: TestMarshalURL (0.00s)
    --- PASS: TestMarshalURL/url (0.00s)
    --- PASS: TestMarshalURL/wrapped_nil_value (0.00s)
    --- PASS: TestMarshalURL/wrapped_empty_URL (0.00s)
=== RUN   TestUnmarshalNilURL
--- PASS: TestUnmarshalNilURL (0.00s)
=== RUN   TestUnmarshalEmptyURL
--- PASS: TestUnmarshalEmptyURL (0.00s)
=== RUN   TestUnmarshalURL
--- PASS: TestUnmarshalURL (0.00s)
=== RUN   TestUnmarshalInvalidURL
    config_test.go:791: parse "://example.com": missing protocol scheme
    config_test.go:791: missing host for URL
    config_test.go:791: unsupported scheme "telnet" for URL
--- PASS: TestUnmarshalInvalidURL (0.00s)
=== RUN   TestUnmarshalRelativeURL
--- PASS: TestUnmarshalRelativeURL (0.00s)
=== RUN   TestMarshalRegexpWithNilValue
--- PASS: TestMarshalRegexpWithNilValue (0.00s)
=== RUN   TestUnmarshalEmptyRegexp
--- PASS: TestUnmarshalEmptyRegexp (0.00s)
=== RUN   TestUnmarshalNullRegexp
--- PASS: TestUnmarshalNullRegexp (0.00s)
=== RUN   TestMarshalEmptyMatchers
--- PASS: TestMarshalEmptyMatchers (0.00s)
=== RUN   TestJSONUnmarshal
--- PASS: TestJSONUnmarshal (0.00s)
=== RUN   TestMarshalIdempotency
--- PASS: TestMarshalIdempotency (0.01s)
=== RUN   TestGroupByAllNotMarshaled
--- PASS: TestGroupByAllNotMarshaled (0.00s)
=== RUN   TestEmptyFieldsAndRegex
--- PASS: TestEmptyFieldsAndRegex (0.01s)
=== RUN   TestGlobalAndLocalHTTPConfig
--- PASS: TestGlobalAndLocalHTTPConfig (0.00s)
=== RUN   TestSMTPHello
--- PASS: TestSMTPHello (0.00s)
=== RUN   TestSMTPBothPasswordAndFile
--- PASS: TestSMTPBothPasswordAndFile (0.00s)
=== RUN   TestSMTPNoUsernameOrPassword
--- PASS: TestSMTPNoUsernameOrPassword (0.00s)
=== RUN   TestGlobalAndLocalSMTPPassword
--- PASS: TestGlobalAndLocalSMTPPassword (0.00s)
=== RUN   TestGroupByAll
--- PASS: TestGroupByAll (0.00s)
=== RUN   TestVictorOpsDefaultAPIKey
--- PASS: TestVictorOpsDefaultAPIKey (0.01s)
=== RUN   TestVictorOpsDefaultAPIKeyFile
--- PASS: TestVictorOpsDefaultAPIKeyFile (0.48s)
=== RUN   TestVictorOpsBothAPIKeyAndFile
--- PASS: TestVictorOpsBothAPIKeyAndFile (0.00s)
=== RUN   TestVictorOpsNoAPIKey
--- PASS: TestVictorOpsNoAPIKey (0.01s)
=== RUN   TestOpsGenieDefaultAPIKey
--- PASS: TestOpsGenieDefaultAPIKey (0.00s)
=== RUN   TestOpsGenieDefaultAPIKeyFile
--- PASS: TestOpsGenieDefaultAPIKeyFile (0.00s)
=== RUN   TestOpsGenieBothAPIKeyAndFile
--- PASS: TestOpsGenieBothAPIKeyAndFile (0.00s)
=== RUN   TestOpsGenieNoAPIKey
--- PASS: TestOpsGenieNoAPIKey (0.00s)
=== RUN   TestOpsGenieDeprecatedTeamSpecified
--- PASS: TestOpsGenieDeprecatedTeamSpecified (0.00s)
=== RUN   TestSlackBothAPIURLAndFile
--- PASS: TestSlackBothAPIURLAndFile (0.00s)
=== RUN   TestSlackNoAPIURL
--- PASS: TestSlackNoAPIURL (0.00s)
=== RUN   TestSlackGlobalAPIURLFile
--- PASS: TestSlackGlobalAPIURLFile (0.00s)
=== RUN   TestValidSNSConfig
--- PASS: TestValidSNSConfig (0.00s)
=== RUN   TestInvalidSNSConfig
--- PASS: TestInvalidSNSConfig (0.00s)
=== RUN   TestRocketchatDefaultToken
--- PASS: TestRocketchatDefaultToken (0.00s)
=== RUN   TestRocketchatDefaultTokenID
--- PASS: TestRocketchatDefaultTokenID (0.00s)
=== RUN   TestRocketchatDefaultTokenFile
--- PASS: TestRocketchatDefaultTokenFile (0.00s)
=== RUN   TestRocketchatDefaultIDTokenFile
--- PASS: TestRocketchatDefaultIDTokenFile (0.00s)
=== RUN   TestRocketchatBothTokenAndTokenFile
--- PASS: TestRocketchatBothTokenAndTokenFile (0.00s)
=== RUN   TestRocketchatBothTokenIDAndTokenIDFile
--- PASS: TestRocketchatBothTokenIDAndTokenIDFile (0.00s)
=== RUN   TestRocketchatNoToken
--- PASS: TestRocketchatNoToken (0.00s)
=== RUN   TestUnmarshalHostPort
=== RUN   TestUnmarshalHostPort/""
=== RUN   TestUnmarshalHostPort/"localhost:25"
=== RUN   TestUnmarshalHostPort/":25"
=== RUN   TestUnmarshalHostPort/"localhost"
=== RUN   TestUnmarshalHostPort/"localhost:"
--- PASS: TestUnmarshalHostPort (0.00s)
    --- PASS: TestUnmarshalHostPort/"" (0.00s)
    --- PASS: TestUnmarshalHostPort/"localhost:25" (0.00s)
    --- PASS: TestUnmarshalHostPort/":25" (0.00s)
    --- PASS: TestUnmarshalHostPort/"localhost" (0.00s)
    --- PASS: TestUnmarshalHostPort/"localhost:" (0.00s)
=== RUN   TestNilRegexp
=== RUN   TestNilRegexp/testdata/conf.nil-match_re-route.yml
=== RUN   TestNilRegexp/testdata/conf.nil-source_match_re-inhibition.yml
=== RUN   TestNilRegexp/testdata/conf.nil-target_match_re-inhibition.yml
--- PASS: TestNilRegexp (0.00s)
    --- PASS: TestNilRegexp/testdata/conf.nil-match_re-route.yml (0.00s)
    --- PASS: TestNilRegexp/testdata/conf.nil-source_match_re-inhibition.yml (0.00s)
    --- PASS: TestNilRegexp/testdata/conf.nil-target_match_re-inhibition.yml (0.00s)
=== RUN   TestInhibitRuleEqual
--- PASS: TestInhibitRuleEqual (0.34s)
=== RUN   TestCoordinatorRegistersMetrics
--- PASS: TestCoordinatorRegistersMetrics (0.00s)
=== RUN   TestCoordinatorNotifiesSubscribers
--- PASS: TestCoordinatorNotifiesSubscribers (0.00s)
=== RUN   TestCoordinatorFailReloadWhenSubscriberFails
--- PASS: TestCoordinatorFailReloadWhenSubscriberFails (0.00s)
=== RUN   TestEmailToIsPresent
--- PASS: TestEmailToIsPresent (0.00s)
=== RUN   TestEmailHeadersCollision
--- PASS: TestEmailHeadersCollision (0.00s)
=== RUN   TestEmailToAllowsMultipleAdresses
--- PASS: TestEmailToAllowsMultipleAdresses (0.00s)
=== RUN   TestEmailDisallowMalformed
--- PASS: TestEmailDisallowMalformed (0.00s)
=== RUN   TestPagerdutyTestRoutingKey
=== RUN   TestPagerdutyTestRoutingKey/error_if_no_routing_key_or_key_file
=== RUN   TestPagerdutyTestRoutingKey/error_if_both_routing_key_and_key_file
--- PASS: TestPagerdutyTestRoutingKey (0.00s)
    --- PASS: TestPagerdutyTestRoutingKey/error_if_no_routing_key_or_key_file (0.00s)
    --- PASS: TestPagerdutyTestRoutingKey/error_if_both_routing_key_and_key_file (0.00s)
=== RUN   TestPagerdutyServiceKey
=== RUN   TestPagerdutyServiceKey/error_if_no_service_key_or_key_file
=== RUN   TestPagerdutyServiceKey/error_if_both_service_key_and_key_file
--- PASS: TestPagerdutyServiceKey (0.00s)
    --- PASS: TestPagerdutyServiceKey/error_if_no_service_key_or_key_file (0.00s)
    --- PASS: TestPagerdutyServiceKey/error_if_both_service_key_and_key_file (0.00s)
=== RUN   TestPagerdutyDetails
--- PASS: TestPagerdutyDetails (0.00s)
=== RUN   TestPagerDutySource
=== RUN   TestPagerDutySource/check_source_field_is_backward_compatible
=== RUN   TestPagerDutySource/check_source_field_is_set
--- PASS: TestPagerDutySource (0.00s)
    --- PASS: TestPagerDutySource/check_source_field_is_backward_compatible (0.00s)
    --- PASS: TestPagerDutySource/check_source_field_is_set (0.00s)
=== RUN   TestWebhookURLIsPresent
--- PASS: TestWebhookURLIsPresent (0.00s)
=== RUN   TestWebhookURLOrURLFile
--- PASS: TestWebhookURLOrURLFile (0.00s)
=== RUN   TestWebhookHttpConfigIsValid
--- PASS: TestWebhookHttpConfigIsValid (0.00s)
=== RUN   TestWebhookHttpConfigIsOptional
--- PASS: TestWebhookHttpConfigIsOptional (0.00s)
=== RUN   TestWebhookPasswordIsObfuscated
--- PASS: TestWebhookPasswordIsObfuscated (0.00s)
=== RUN   TestVictorOpsConfiguration
=== RUN   TestVictorOpsConfiguration/valid_configuration
=== RUN   TestVictorOpsConfiguration/routing_key_is_missing
=== RUN   TestVictorOpsConfiguration/api_key_and_api_key_file_both_defined
--- PASS: TestVictorOpsConfiguration (0.00s)
    --- PASS: TestVictorOpsConfiguration/valid_configuration (0.00s)
    --- PASS: TestVictorOpsConfiguration/routing_key_is_missing (0.00s)
    --- PASS: TestVictorOpsConfiguration/api_key_and_api_key_file_both_defined (0.00s)
=== RUN   TestVictorOpsCustomFieldsValidation
--- PASS: TestVictorOpsCustomFieldsValidation (0.00s)
=== RUN   TestPushoverUserKeyIsPresent
--- PASS: TestPushoverUserKeyIsPresent (0.00s)
=== RUN   TestPushoverUserKeyOrUserKeyFile
--- PASS: TestPushoverUserKeyOrUserKeyFile (0.00s)
=== RUN   TestPushoverTokenIsPresent
--- PASS: TestPushoverTokenIsPresent (0.00s)
=== RUN   TestPushoverTokenOrTokenFile
--- PASS: TestPushoverTokenOrTokenFile (0.00s)
=== RUN   TestLoadSlackConfiguration
--- PASS: TestLoadSlackConfiguration (0.00s)
=== RUN   TestSlackFieldConfigValidation
--- PASS: TestSlackFieldConfigValidation (0.00s)
=== RUN   TestSlackFieldConfigUnmarshaling
--- PASS: TestSlackFieldConfigUnmarshaling (0.00s)
=== RUN   TestSlackActionsValidation
--- PASS: TestSlackActionsValidation (0.00s)
=== RUN   TestOpsgenieTypeMatcher
--- PASS: TestOpsgenieTypeMatcher (0.00s)
=== RUN   TestOpsGenieConfiguration
=== RUN   TestOpsGenieConfiguration/valid_configuration
=== RUN   TestOpsGenieConfiguration/api_key_and_api_key_file_both_defined
=== RUN   TestOpsGenieConfiguration/invalid_responder_type
=== RUN   TestOpsGenieConfiguration/missing_responder_field
=== RUN   TestOpsGenieConfiguration/valid_responder_type_template
=== RUN   TestOpsGenieConfiguration/invalid_responder_type_template
--- PASS: TestOpsGenieConfiguration (0.00s)
    --- PASS: TestOpsGenieConfiguration/valid_configuration (0.00s)
    --- PASS: TestOpsGenieConfiguration/api_key_and_api_key_file_both_defined (0.00s)
    --- PASS: TestOpsGenieConfiguration/invalid_responder_type (0.00s)
    --- PASS: TestOpsGenieConfiguration/missing_responder_field (0.00s)
    --- PASS: TestOpsGenieConfiguration/valid_responder_type_template (0.00s)
    --- PASS: TestOpsGenieConfiguration/invalid_responder_type_template (0.00s)
=== RUN   TestSNS
=== RUN   TestSNS/#00
=== RUN   TestSNS/#01
=== RUN   TestSNS/#02
=== RUN   TestSNS/#03
=== RUN   TestSNS/#04
=== RUN   TestSNS/#05
=== RUN   TestSNS/#06
=== RUN   TestSNS/#07
=== RUN   TestSNS/#08
--- PASS: TestSNS (0.00s)
    --- PASS: TestSNS/#00 (0.00s)
    --- PASS: TestSNS/#01 (0.00s)
    --- PASS: TestSNS/#02 (0.00s)
    --- PASS: TestSNS/#03 (0.00s)
    --- PASS: TestSNS/#04 (0.00s)
    --- PASS: TestSNS/#05 (0.00s)
    --- PASS: TestSNS/#06 (0.00s)
    --- PASS: TestSNS/#07 (0.00s)
    --- PASS: TestSNS/#08 (0.00s)
=== RUN   TestWeChatTypeMatcher
--- PASS: TestWeChatTypeMatcher (0.00s)
=== RUN   TestWebexConfiguration
=== RUN   TestWebexConfiguration/with_no_room_id_-_it_fails
=== RUN   TestWebexConfiguration/with_room_id_and_http_config.authorization_set_-_it_succeeds
--- PASS: TestWebexConfiguration (0.00s)
    --- PASS: TestWebexConfiguration/with_no_room_id_-_it_fails (0.00s)
    --- PASS: TestWebexConfiguration/with_room_id_and_http_config.authorization_set_-_it_succeeds (0.00s)
=== RUN   TestTelegramConfiguration
=== RUN   TestTelegramConfiguration/with_both_bot_token_&_bot_token_file_-_it_fails
=== RUN   TestTelegramConfiguration/with_no_bot_token_&_bot_token_file_-_it_fails
=== RUN   TestTelegramConfiguration/with_bot_token_and_chat_id_set_-_it_succeeds
=== RUN   TestTelegramConfiguration/with_bot_token,_chat_id_and_message_thread_id_set_-_it_succeeds
=== RUN   TestTelegramConfiguration/with_bot_token_file_and_chat_id_set_-_it_succeeds
=== RUN   TestTelegramConfiguration/with_no_chat_id_set_-_it_fails
=== RUN   TestTelegramConfiguration/with_unknown_parse_mode_-_it_fails
--- PASS: TestTelegramConfiguration (0.00s)
    --- PASS: TestTelegramConfiguration/with_both_bot_token_&_bot_token_file_-_it_fails (0.00s)
    --- PASS: TestTelegramConfiguration/with_no_bot_token_&_bot_token_file_-_it_fails (0.00s)
    --- PASS: TestTelegramConfiguration/with_bot_token_and_chat_id_set_-_it_succeeds (0.00s)
    --- PASS: TestTelegramConfiguration/with_bot_token,_chat_id_and_message_thread_id_set_-_it_succeeds (0.00s)
    --- PASS: TestTelegramConfiguration/with_bot_token_file_and_chat_id_set_-_it_succeeds (0.00s)
    --- PASS: TestTelegramConfiguration/with_no_chat_id_set_-_it_fails (0.00s)
    --- PASS: TestTelegramConfiguration/with_unknown_parse_mode_-_it_fails (0.00s)
PASS
ok  	github.com/prometheus/alertmanager/config	1.124s
=== RUN   TestBuildReceiverIntegrations
=== RUN   TestBuildReceiverIntegrations/#00
=== RUN   TestBuildReceiverIntegrations/#01
--- PASS: TestBuildReceiverIntegrations (0.00s)
    --- PASS: TestBuildReceiverIntegrations/#00 (0.00s)
    --- PASS: TestBuildReceiverIntegrations/#01 (0.00s)
PASS
ok  	github.com/prometheus/alertmanager/config/receiver	0.132s
=== RUN   TestAggrGroup
--- PASS: TestAggrGroup (3.43s)
=== RUN   TestGroupLabels
--- PASS: TestGroupLabels (0.00s)
=== RUN   TestGroupByAllLabels
--- PASS: TestGroupByAllLabels (0.00s)
=== RUN   TestGroups
--- PASS: TestGroups (0.20s)
=== RUN   TestGroupsWithLimits
--- PASS: TestGroupsWithLimits (0.41s)
=== RUN   TestDispatcherRace
--- PASS: TestDispatcherRace (0.00s)
=== RUN   TestDispatcherRaceOnFirstAlertNotDeliveredWhenGroupWaitIsZero
--- PASS: TestDispatcherRaceOnFirstAlertNotDeliveredWhenGroupWaitIsZero (0.76s)
=== RUN   TestDispatcher_DoMaintenance
--- PASS: TestDispatcher_DoMaintenance (0.00s)
=== RUN   TestRouteMatch
--- PASS: TestRouteMatch (0.00s)
=== RUN   TestRouteWalk
--- PASS: TestRouteWalk (0.00s)
=== RUN   TestInheritParentGroupByAll
--- PASS: TestInheritParentGroupByAll (0.00s)
=== RUN   TestRouteMatchers
--- PASS: TestRouteMatchers (0.00s)
=== RUN   TestRouteMatchersAndMatch
--- PASS: TestRouteMatchersAndMatch (0.00s)
=== RUN   TestRouteID
--- PASS: TestRouteID (0.00s)
PASS
ok  	github.com/prometheus/alertmanager/dispatch	5.504s
=== RUN   TestFlags
=== RUN   TestFlags/with_only_valid_feature_flags
=== RUN   TestFlags/with_only_invalid_feature_flags
=== RUN   TestFlags/with_both,_valid_and_invalid_feature_flags
--- PASS: TestFlags (0.00s)
    --- PASS: TestFlags/with_only_valid_feature_flags (0.00s)
    --- PASS: TestFlags/with_only_invalid_feature_flags (0.00s)
    --- PASS: TestFlags/with_both,_valid_and_invalid_feature_flags (0.00s)
PASS
ok  	github.com/prometheus/alertmanager/featurecontrol	0.072s
=== RUN   TestInhibitRuleHasEqual
=== PAUSE TestInhibitRuleHasEqual
=== RUN   TestInhibitRuleMatches
=== PAUSE TestInhibitRuleMatches
=== RUN   TestInhibitRuleMatchers
=== PAUSE TestInhibitRuleMatchers
=== RUN   TestInhibit
=== PAUSE TestInhibit
=== CONT  TestInhibitRuleHasEqual
--- PASS: TestInhibitRuleHasEqual (0.00s)
=== CONT  TestInhibit
=== CONT  TestInhibitRuleMatchers
--- PASS: TestInhibitRuleMatchers (0.00s)
=== CONT  TestInhibitRuleMatches
--- PASS: TestInhibitRuleMatches (0.00s)
--- PASS: TestInhibit (0.00s)
PASS
ok  	github.com/prometheus/alertmanager/inhibit	0.200s
=== RUN   TestFallbackMatcherParser
=== RUN   TestFallbackMatcherParser/input_is_accepted
=== RUN   TestFallbackMatcherParser/input_is_accepted_in_neither
=== RUN   TestFallbackMatcherParser/input_is_accepted_in_matchers/parse_but_not_pkg/labels
=== RUN   TestFallbackMatcherParser/input_is_accepted_in_pkg/labels_but_not_matchers/parse
=== RUN   TestFallbackMatcherParser/input_causes_disagreement
--- PASS: TestFallbackMatcherParser (0.00s)
    --- PASS: TestFallbackMatcherParser/input_is_accepted (0.00s)
    --- PASS: TestFallbackMatcherParser/input_is_accepted_in_neither (0.00s)
    --- PASS: TestFallbackMatcherParser/input_is_accepted_in_matchers/parse_but_not_pkg/labels (0.00s)
    --- PASS: TestFallbackMatcherParser/input_is_accepted_in_pkg/labels_but_not_matchers/parse (0.00s)
    --- PASS: TestFallbackMatcherParser/input_causes_disagreement (0.00s)
=== RUN   TestFallbackMatchersParser
=== RUN   TestFallbackMatchersParser/input_is_accepted
=== RUN   TestFallbackMatchersParser/input_is_accepted_in_neither
=== RUN   TestFallbackMatchersParser/input_is_accepted_in_matchers/parse_but_not_pkg/labels
=== RUN   TestFallbackMatchersParser/is_accepted_in_pkg/labels_but_not_matchers/parse
=== RUN   TestFallbackMatchersParser/input_causes_disagreement
--- PASS: TestFallbackMatchersParser (0.00s)
    --- PASS: TestFallbackMatchersParser/input_is_accepted (0.00s)
    --- PASS: TestFallbackMatchersParser/input_is_accepted_in_neither (0.00s)
    --- PASS: TestFallbackMatchersParser/input_is_accepted_in_matchers/parse_but_not_pkg/labels (0.00s)
    --- PASS: TestFallbackMatchersParser/is_accepted_in_pkg/labels_but_not_matchers/parse (0.00s)
    --- PASS: TestFallbackMatchersParser/input_causes_disagreement (0.00s)
=== RUN   TestIsValidClassicLabelName
=== RUN   TestIsValidClassicLabelName/foo_is_accepted
=== RUN   TestIsValidClassicLabelName/starts_with_underscore_and_ends_with_number_is_accepted
=== RUN   TestIsValidClassicLabelName/empty_is_not_accepted
=== RUN   TestIsValidClassicLabelName/starts_with_number_is_not_accepted
=== RUN   TestIsValidClassicLabelName/contains_emoji_is_not_accepted
--- PASS: TestIsValidClassicLabelName (0.00s)
    --- PASS: TestIsValidClassicLabelName/foo_is_accepted (0.00s)
    --- PASS: TestIsValidClassicLabelName/starts_with_underscore_and_ends_with_number_is_accepted (0.00s)
    --- PASS: TestIsValidClassicLabelName/empty_is_not_accepted (0.00s)
    --- PASS: TestIsValidClassicLabelName/starts_with_number_is_not_accepted (0.00s)
    --- PASS: TestIsValidClassicLabelName/contains_emoji_is_not_accepted (0.00s)
=== RUN   TestIsValidUTF8LabelName
=== RUN   TestIsValidUTF8LabelName/foo_is_accepted
=== RUN   TestIsValidUTF8LabelName/starts_with_underscore_and_ends_with_number_is_accepted
=== RUN   TestIsValidUTF8LabelName/starts_with_number_is_accepted
=== RUN   TestIsValidUTF8LabelName/contains_emoji_is_accepted
=== RUN   TestIsValidUTF8LabelName/empty_is_not_accepted
--- PASS: TestIsValidUTF8LabelName (0.00s)
    --- PASS: TestIsValidUTF8LabelName/foo_is_accepted (0.00s)
    --- PASS: TestIsValidUTF8LabelName/starts_with_underscore_and_ends_with_number_is_accepted (0.00s)
    --- PASS: TestIsValidUTF8LabelName/starts_with_number_is_accepted (0.00s)
    --- PASS: TestIsValidUTF8LabelName/contains_emoji_is_accepted (0.00s)
    --- PASS: TestIsValidUTF8LabelName/empty_is_not_accepted (0.00s)
PASS
ok  	github.com/prometheus/alertmanager/matcher/compat	0.068s
=== RUN   TestCompliance
=== RUN   TestCompliance/{}
    compliance_test.go:442: 
=== RUN   TestCompliance/{foo='}
    compliance_test.go:442: 
=== RUN   TestCompliance/{foo=`}
    compliance_test.go:442: 
=== RUN   TestCompliance/{foo=\n}
    compliance_test.go:442: 
=== RUN   TestCompliance/{foo=bar\n}
    compliance_test.go:442: 
=== RUN   TestCompliance/{foo=\t}
    compliance_test.go:442: 
=== RUN   TestCompliance/{foo=bar\t}
    compliance_test.go:442: 
=== RUN   TestCompliance/{foo=bar\}
    compliance_test.go:442: 
=== RUN   TestCompliance/{foo=bar\\}
    compliance_test.go:442: 
=== RUN   TestCompliance/{foo=\"}
    compliance_test.go:442: 
=== RUN   TestCompliance/{foo=bar\"}
    compliance_test.go:442: 
=== RUN   TestCompliance/{foo=bar}
=== RUN   TestCompliance/{foo="bar"}
=== RUN   TestCompliance/{foo=~bar.*}
=== RUN   TestCompliance/{foo=~"bar.*"}
=== RUN   TestCompliance/{foo!=bar}
=== RUN   TestCompliance/{foo!="bar"}
=== RUN   TestCompliance/{foo!~bar.*}
=== RUN   TestCompliance/{foo!~"bar.*"}
=== RUN   TestCompliance/{foo="bar",_baz!="quux"}
=== RUN   TestCompliance/{foo="bar",_baz!~"quux.*"}
=== RUN   TestCompliance/{foo="bar",baz!~".*quux",_derp="wat"}
=== RUN   TestCompliance/{foo="bar",_baz!="quux",_derp="wat"}
=== RUN   TestCompliance/{foo="bar",_baz!~".*quux.*",_derp="wat"}
=== RUN   TestCompliance/{foo="bar",_instance=~"some-api.*"}
=== RUN   TestCompliance/{foo=""}
=== RUN   TestCompliance/{foo="bar,quux",_job="job1"}
=== RUN   TestCompliance/{foo_=_"bar",_dings_!=_"bums",_}
=== RUN   TestCompliance/foo=bar,dings!=bums
=== RUN   TestCompliance/{quote="She_said:_\"Hi,_ladies!_That's_gender-neutral…\""}
=== RUN   TestCompliance/statuscode=~"5.."
=== RUN   TestCompliance/tricky=~~~
    compliance_test.go:442: 
=== RUN   TestCompliance/trickier==\\=\=\"
    compliance_test.go:442: 
=== RUN   TestCompliance/contains_quote_!=_"\""_,_contains_comma_!~_"foo,bar"_,_
=== RUN   TestCompliance/{foo=bar}}
    compliance_test.go:442: 
=== RUN   TestCompliance/{foo=bar}},}
    compliance_test.go:442: 
=== RUN   TestCompliance/{foo=,bar=}}
    compliance_test.go:442: 
=== RUN   TestCompliance/job=
    compliance_test.go:442: 
=== RUN   TestCompliance/{name-with-dashes_=_"bar"}
=== RUN   TestCompliance/{,}
=== RUN   TestCompliance/job="value
=== RUN   TestCompliance/job=value"
=== RUN   TestCompliance/trickier==\\=\=\""
=== RUN   TestCompliance/contains_unescaped_quote_=_foo"bar
=== RUN   TestCompliance/{foo=~"invalid[regexp"}
=== RUN   TestCompliance/"{foo=\"bar"}
=== RUN   TestCompliance/"foo=\"bar"
=== RUN   TestCompliance/"foo=\"bar\""
=== RUN   TestCompliance/"foo=\"bar\"
=== RUN   TestCompliance/"{foo=\"bar\"}"
=== RUN   TestCompliance/"foo="bar""
=== RUN   TestCompliance/{{foo=
=== RUN   TestCompliance/{foo=
    compliance_test.go:442: 
=== RUN   TestCompliance/{foo=}b
    compliance_test.go:442: 
--- PASS: TestCompliance (0.00s)
    --- SKIP: TestCompliance/{} (0.00s)
    --- SKIP: TestCompliance/{foo='} (0.00s)
    --- SKIP: TestCompliance/{foo=`} (0.00s)
    --- SKIP: TestCompliance/{foo=\n} (0.00s)
    --- SKIP: TestCompliance/{foo=bar\n} (0.00s)
    --- SKIP: TestCompliance/{foo=\t} (0.00s)
    --- SKIP: TestCompliance/{foo=bar\t} (0.00s)
    --- SKIP: TestCompliance/{foo=bar\} (0.00s)
    --- SKIP: TestCompliance/{foo=bar\\} (0.00s)
    --- SKIP: TestCompliance/{foo=\"} (0.00s)
    --- SKIP: TestCompliance/{foo=bar\"} (0.00s)
    --- PASS: TestCompliance/{foo=bar} (0.00s)
    --- PASS: TestCompliance/{foo="bar"} (0.00s)
    --- PASS: TestCompliance/{foo=~bar.*} (0.00s)
    --- PASS: TestCompliance/{foo=~"bar.*"} (0.00s)
    --- PASS: TestCompliance/{foo!=bar} (0.00s)
    --- PASS: TestCompliance/{foo!="bar"} (0.00s)
    --- PASS: TestCompliance/{foo!~bar.*} (0.00s)
    --- PASS: TestCompliance/{foo!~"bar.*"} (0.00s)
    --- PASS: TestCompliance/{foo="bar",_baz!="quux"} (0.00s)
    --- PASS: TestCompliance/{foo="bar",_baz!~"quux.*"} (0.00s)
    --- PASS: TestCompliance/{foo="bar",baz!~".*quux",_derp="wat"} (0.00s)
    --- PASS: TestCompliance/{foo="bar",_baz!="quux",_derp="wat"} (0.00s)
    --- PASS: TestCompliance/{foo="bar",_baz!~".*quux.*",_derp="wat"} (0.00s)
    --- PASS: TestCompliance/{foo="bar",_instance=~"some-api.*"} (0.00s)
    --- PASS: TestCompliance/{foo=""} (0.00s)
    --- PASS: TestCompliance/{foo="bar,quux",_job="job1"} (0.00s)
    --- PASS: TestCompliance/{foo_=_"bar",_dings_!=_"bums",_} (0.00s)
    --- PASS: TestCompliance/foo=bar,dings!=bums (0.00s)
    --- PASS: TestCompliance/{quote="She_said:_\"Hi,_ladies!_That's_gender-neutral…\""} (0.00s)
    --- PASS: TestCompliance/statuscode=~"5.." (0.00s)
    --- SKIP: TestCompliance/tricky=~~~ (0.00s)
    --- SKIP: TestCompliance/trickier==\\=\=\" (0.00s)
    --- PASS: TestCompliance/contains_quote_!=_"\""_,_contains_comma_!~_"foo,bar"_,_ (0.00s)
    --- SKIP: TestCompliance/{foo=bar}} (0.00s)
    --- SKIP: TestCompliance/{foo=bar}},} (0.00s)
    --- SKIP: TestCompliance/{foo=,bar=}} (0.00s)
    --- SKIP: TestCompliance/job= (0.00s)
    --- PASS: TestCompliance/{name-with-dashes_=_"bar"} (0.00s)
    --- PASS: TestCompliance/{,} (0.00s)
    --- PASS: TestCompliance/job="value (0.00s)
    --- PASS: TestCompliance/job=value" (0.00s)
    --- PASS: TestCompliance/trickier==\\=\=\"" (0.00s)
    --- PASS: TestCompliance/contains_unescaped_quote_=_foo"bar (0.00s)
    --- PASS: TestCompliance/{foo=~"invalid[regexp"} (0.00s)
    --- PASS: TestCompliance/"{foo=\"bar"} (0.00s)
    --- PASS: TestCompliance/"foo=\"bar" (0.00s)
    --- PASS: TestCompliance/"foo=\"bar\"" (0.00s)
    --- PASS: TestCompliance/"foo=\"bar\" (0.00s)
    --- PASS: TestCompliance/"{foo=\"bar\"}" (0.00s)
    --- PASS: TestCompliance/"foo="bar"" (0.00s)
    --- PASS: TestCompliance/{{foo= (0.00s)
    --- SKIP: TestCompliance/{foo= (0.00s)
    --- SKIP: TestCompliance/{foo=}b (0.00s)
PASS
ok  	github.com/prometheus/alertmanager/matcher/compliance	0.064s
=== RUN   TestLexer_Scan
=== RUN   TestLexer_Scan/no_input
=== RUN   TestLexer_Scan/open_brace
=== RUN   TestLexer_Scan/open_brace_with_leading_space
=== RUN   TestLexer_Scan/close_brace
=== RUN   TestLexer_Scan/close_brace_with_leading_space
=== RUN   TestLexer_Scan/open_and_closing_braces
=== RUN   TestLexer_Scan/open_and_closing_braces_with_space
=== RUN   TestLexer_Scan/unquoted
=== RUN   TestLexer_Scan/unquoted_with_underscore
=== RUN   TestLexer_Scan/unquoted_with_colon
=== RUN   TestLexer_Scan/unquoted_with_numbers
=== RUN   TestLexer_Scan/unquoted_can_start_with_underscore
=== RUN   TestLexer_Scan/unquoted_separated_with_space
=== RUN   TestLexer_Scan/unquoted_$
=== RUN   TestLexer_Scan/unquoted_emoji
=== RUN   TestLexer_Scan/unquoted_unicode
=== RUN   TestLexer_Scan/unquoted_unicode_sentence
=== RUN   TestLexer_Scan/unquoted_unicode_sentence_with_unicode_space
=== RUN   TestLexer_Scan/quoted
=== RUN   TestLexer_Scan/quoted_with_unicode
=== RUN   TestLexer_Scan/quoted_with_space
=== RUN   TestLexer_Scan/quoted_with_unicode_space
=== RUN   TestLexer_Scan/quoted_with_newline
=== RUN   TestLexer_Scan/quoted_with_tab
=== RUN   TestLexer_Scan/quoted_with_regex_digit_character_class
=== RUN   TestLexer_Scan/quoted_with_escaped_regex_digit_character_class
=== RUN   TestLexer_Scan/quoted_with_escaped_quotes
=== RUN   TestLexer_Scan/quoted_with_escaped_backslash
=== RUN   TestLexer_Scan/equals_operator
=== RUN   TestLexer_Scan/not_equals_operator
=== RUN   TestLexer_Scan/matches_regex_operator
=== RUN   TestLexer_Scan/not_matches_regex_operator
=== RUN   TestLexer_Scan/invalid_operator
=== RUN   TestLexer_Scan/another_invalid_operator
=== RUN   TestLexer_Scan/unexpected_!_after_unquoted
=== RUN   TestLexer_Scan/unexpected_!_after_operator
=== RUN   TestLexer_Scan/unexpected_!!_after_operator
=== RUN   TestLexer_Scan/unterminated_quoted
=== RUN   TestLexer_Scan/unterminated_quoted_with_escaped_quote
--- PASS: TestLexer_Scan (0.00s)
    --- PASS: TestLexer_Scan/no_input (0.00s)
    --- PASS: TestLexer_Scan/open_brace (0.00s)
    --- PASS: TestLexer_Scan/open_brace_with_leading_space (0.00s)
    --- PASS: TestLexer_Scan/close_brace (0.00s)
    --- PASS: TestLexer_Scan/close_brace_with_leading_space (0.00s)
    --- PASS: TestLexer_Scan/open_and_closing_braces (0.00s)
    --- PASS: TestLexer_Scan/open_and_closing_braces_with_space (0.00s)
    --- PASS: TestLexer_Scan/unquoted (0.00s)
    --- PASS: TestLexer_Scan/unquoted_with_underscore (0.00s)
    --- PASS: TestLexer_Scan/unquoted_with_colon (0.00s)
    --- PASS: TestLexer_Scan/unquoted_with_numbers (0.00s)
    --- PASS: TestLexer_Scan/unquoted_can_start_with_underscore (0.00s)
    --- PASS: TestLexer_Scan/unquoted_separated_with_space (0.00s)
    --- PASS: TestLexer_Scan/unquoted_$ (0.00s)
    --- PASS: TestLexer_Scan/unquoted_emoji (0.00s)
    --- PASS: TestLexer_Scan/unquoted_unicode (0.00s)
    --- PASS: TestLexer_Scan/unquoted_unicode_sentence (0.00s)
    --- PASS: TestLexer_Scan/unquoted_unicode_sentence_with_unicode_space (0.00s)
    --- PASS: TestLexer_Scan/quoted (0.00s)
    --- PASS: TestLexer_Scan/quoted_with_unicode (0.00s)
    --- PASS: TestLexer_Scan/quoted_with_space (0.00s)
    --- PASS: TestLexer_Scan/quoted_with_unicode_space (0.00s)
    --- PASS: TestLexer_Scan/quoted_with_newline (0.00s)
    --- PASS: TestLexer_Scan/quoted_with_tab (0.00s)
    --- PASS: TestLexer_Scan/quoted_with_regex_digit_character_class (0.00s)
    --- PASS: TestLexer_Scan/quoted_with_escaped_regex_digit_character_class (0.00s)
    --- PASS: TestLexer_Scan/quoted_with_escaped_quotes (0.00s)
    --- PASS: TestLexer_Scan/quoted_with_escaped_backslash (0.00s)
    --- PASS: TestLexer_Scan/equals_operator (0.00s)
    --- PASS: TestLexer_Scan/not_equals_operator (0.00s)
    --- PASS: TestLexer_Scan/matches_regex_operator (0.00s)
    --- PASS: TestLexer_Scan/not_matches_regex_operator (0.00s)
    --- PASS: TestLexer_Scan/invalid_operator (0.00s)
    --- PASS: TestLexer_Scan/another_invalid_operator (0.00s)
    --- PASS: TestLexer_Scan/unexpected_!_after_unquoted (0.00s)
    --- PASS: TestLexer_Scan/unexpected_!_after_operator (0.00s)
    --- PASS: TestLexer_Scan/unexpected_!!_after_operator (0.00s)
    --- PASS: TestLexer_Scan/unterminated_quoted (0.00s)
    --- PASS: TestLexer_Scan/unterminated_quoted_with_escaped_quote (0.00s)
=== RUN   TestLexer_ScanError
--- PASS: TestLexer_ScanError (0.00s)
=== RUN   TestLexer_Peek
--- PASS: TestLexer_Peek (0.00s)
=== RUN   TestLexer_PeekError
--- PASS: TestLexer_PeekError (0.00s)
=== RUN   TestLexer_Pos
--- PASS: TestLexer_Pos (0.00s)
=== RUN   TestMatchers
=== RUN   TestMatchers/no_braces
=== RUN   TestMatchers/open_and_closing_braces
=== RUN   TestMatchers/equals
=== RUN   TestMatchers/equals_with_trailing_comma
=== RUN   TestMatchers/not_equals
=== RUN   TestMatchers/match_regex
=== RUN   TestMatchers/doesn't_match_regex
=== RUN   TestMatchers/equals_unicode_emoji
=== RUN   TestMatchers/equals_unicode_sentence
=== RUN   TestMatchers/equals_without_braces
=== RUN   TestMatchers/equals_without_braces_but_with_trailing_comma
=== RUN   TestMatchers/not_equals_without_braces
=== RUN   TestMatchers/match_regex_without_braces
=== RUN   TestMatchers/doesn't_match_regex_without_braces
=== RUN   TestMatchers/equals_in_quotes
=== RUN   TestMatchers/equals_in_quotes_and_with_trailing_comma
=== RUN   TestMatchers/not_equals_in_quotes
=== RUN   TestMatchers/match_regex_in_quotes
=== RUN   TestMatchers/match_regex_digit_in_quotes
=== RUN   TestMatchers/doesn't_match_regex_in_quotes
=== RUN   TestMatchers/equals_unicode_emoji_in_quotes
=== RUN   TestMatchers/equals_unicode_emoji_as_bytes_in_quotes
=== RUN   TestMatchers/equals_unicode_emoji_as_code_points_in_quotes
=== RUN   TestMatchers/equals_unicode_sentence_in_quotes
=== RUN   TestMatchers/equals_with_newline_in_quotes
=== RUN   TestMatchers/equals_with_tab_in_quotes
=== RUN   TestMatchers/equals_with_escaped_quotes_in_quotes
=== RUN   TestMatchers/equals_with_escaped_backslash_in_quotes
=== RUN   TestMatchers/equals_without_braces_in_quotes
=== RUN   TestMatchers/equals_without_braces_in_quotes_with_trailing_comma
=== RUN   TestMatchers/complex
=== RUN   TestMatchers/complex_in_quotes
=== RUN   TestMatchers/complex_without_braces
=== RUN   TestMatchers/complex_without_braces_in_quotes
=== RUN   TestMatchers/comma
=== RUN   TestMatchers/comma_in_braces
=== RUN   TestMatchers/open_brace
=== RUN   TestMatchers/close_brace
=== RUN   TestMatchers/no_open_brace
=== RUN   TestMatchers/no_close_brace
=== RUN   TestMatchers/invalid_input_after_operator_and_before_quotes
=== RUN   TestMatchers/invalid_escape_sequence
=== RUN   TestMatchers/invalid_escape_sequence_regex_digits
=== RUN   TestMatchers/no_unquoted_escape_sequences
=== RUN   TestMatchers/invalid_unicode
--- PASS: TestMatchers (0.01s)
    --- PASS: TestMatchers/no_braces (0.00s)
    --- PASS: TestMatchers/open_and_closing_braces (0.00s)
    --- PASS: TestMatchers/equals (0.00s)
    --- PASS: TestMatchers/equals_with_trailing_comma (0.00s)
    --- PASS: TestMatchers/not_equals (0.00s)
    --- PASS: TestMatchers/match_regex (0.00s)
    --- PASS: TestMatchers/doesn't_match_regex (0.00s)
    --- PASS: TestMatchers/equals_unicode_emoji (0.00s)
    --- PASS: TestMatchers/equals_unicode_sentence (0.00s)
    --- PASS: TestMatchers/equals_without_braces (0.00s)
    --- PASS: TestMatchers/equals_without_braces_but_with_trailing_comma (0.00s)
    --- PASS: TestMatchers/not_equals_without_braces (0.00s)
    --- PASS: TestMatchers/match_regex_without_braces (0.00s)
    --- PASS: TestMatchers/doesn't_match_regex_without_braces (0.00s)
    --- PASS: TestMatchers/equals_in_quotes (0.00s)
    --- PASS: TestMatchers/equals_in_quotes_and_with_trailing_comma (0.00s)
    --- PASS: TestMatchers/not_equals_in_quotes (0.00s)
    --- PASS: TestMatchers/match_regex_in_quotes (0.00s)
    --- PASS: TestMatchers/match_regex_digit_in_quotes (0.00s)
    --- PASS: TestMatchers/doesn't_match_regex_in_quotes (0.00s)
    --- PASS: TestMatchers/equals_unicode_emoji_in_quotes (0.00s)
    --- PASS: TestMatchers/equals_unicode_emoji_as_bytes_in_quotes (0.00s)
    --- PASS: TestMatchers/equals_unicode_emoji_as_code_points_in_quotes (0.00s)
    --- PASS: TestMatchers/equals_unicode_sentence_in_quotes (0.00s)
    --- PASS: TestMatchers/equals_with_newline_in_quotes (0.00s)
    --- PASS: TestMatchers/equals_with_tab_in_quotes (0.00s)
    --- PASS: TestMatchers/equals_with_escaped_quotes_in_quotes (0.00s)
    --- PASS: TestMatchers/equals_with_escaped_backslash_in_quotes (0.00s)
    --- PASS: TestMatchers/equals_without_braces_in_quotes (0.00s)
    --- PASS: TestMatchers/equals_without_braces_in_quotes_with_trailing_comma (0.00s)
    --- PASS: TestMatchers/complex (0.00s)
    --- PASS: TestMatchers/complex_in_quotes (0.00s)
    --- PASS: TestMatchers/complex_without_braces (0.00s)
    --- PASS: TestMatchers/complex_without_braces_in_quotes (0.00s)
    --- PASS: TestMatchers/comma (0.00s)
    --- PASS: TestMatchers/comma_in_braces (0.00s)
    --- PASS: TestMatchers/open_brace (0.00s)
    --- PASS: TestMatchers/close_brace (0.00s)
    --- PASS: TestMatchers/no_open_brace (0.00s)
    --- PASS: TestMatchers/no_close_brace (0.00s)
    --- PASS: TestMatchers/invalid_input_after_operator_and_before_quotes (0.00s)
    --- PASS: TestMatchers/invalid_escape_sequence (0.00s)
    --- PASS: TestMatchers/invalid_escape_sequence_regex_digits (0.00s)
    --- PASS: TestMatchers/no_unquoted_escape_sequences (0.00s)
    --- PASS: TestMatchers/invalid_unicode (0.00s)
=== RUN   TestMatcher
=== RUN   TestMatcher/equals
=== RUN   TestMatcher/equals_with_trailing_comma
=== RUN   TestMatcher/not_equals
=== RUN   TestMatcher/match_regex
=== RUN   TestMatcher/doesn't_match_regex
=== RUN   TestMatcher/equals_unicode_emoji
=== RUN   TestMatcher/equals_unicode_emoji_as_bytes_in_quotes
=== RUN   TestMatcher/equals_unicode_emoji_as_code_points_in_quotes
=== RUN   TestMatcher/equals_unicode_sentence
=== RUN   TestMatcher/equals_without_braces
=== RUN   TestMatcher/equals_without_braces_but_with_trailing_comma
=== RUN   TestMatcher/not_equals_without_braces
=== RUN   TestMatcher/match_regex_without_braces
=== RUN   TestMatcher/doesn't_match_regex_without_braces
=== RUN   TestMatcher/equals_in_quotes
=== RUN   TestMatcher/equals_in_quotes_and_with_trailing_comma
=== RUN   TestMatcher/not_equals_in_quotes
=== RUN   TestMatcher/match_regex_in_quotes
=== RUN   TestMatcher/doesn't_match_regex_in_quotes
=== RUN   TestMatcher/equals_unicode_emoji_in_quotes
=== RUN   TestMatcher/equals_unicode_sentence_in_quotes
=== RUN   TestMatcher/equals_with_newline_in_quotes
=== RUN   TestMatcher/equals_with_tab_in_quotes
=== RUN   TestMatcher/equals_with_escaped_quotes_in_quotes
=== RUN   TestMatcher/equals_with_escaped_backslash_in_quotes
=== RUN   TestMatcher/equals_without_braces_in_quotes
=== RUN   TestMatcher/equals_without_braces_in_quotes_with_trailing_comma
=== RUN   TestMatcher/no_input
=== RUN   TestMatcher/open_and_closing_braces
=== RUN   TestMatcher/two_or_more_returns_error
=== RUN   TestMatcher/invalid_unicode
--- PASS: TestMatcher (0.00s)
    --- PASS: TestMatcher/equals (0.00s)
    --- PASS: TestMatcher/equals_with_trailing_comma (0.00s)
    --- PASS: TestMatcher/not_equals (0.00s)
    --- PASS: TestMatcher/match_regex (0.00s)
    --- PASS: TestMatcher/doesn't_match_regex (0.00s)
    --- PASS: TestMatcher/equals_unicode_emoji (0.00s)
    --- PASS: TestMatcher/equals_unicode_emoji_as_bytes_in_quotes (0.00s)
    --- PASS: TestMatcher/equals_unicode_emoji_as_code_points_in_quotes (0.00s)
    --- PASS: TestMatcher/equals_unicode_sentence (0.00s)
    --- PASS: TestMatcher/equals_without_braces (0.00s)
    --- PASS: TestMatcher/equals_without_braces_but_with_trailing_comma (0.00s)
    --- PASS: TestMatcher/not_equals_without_braces (0.00s)
    --- PASS: TestMatcher/match_regex_without_braces (0.00s)
    --- PASS: TestMatcher/doesn't_match_regex_without_braces (0.00s)
    --- PASS: TestMatcher/equals_in_quotes (0.00s)
    --- PASS: TestMatcher/equals_in_quotes_and_with_trailing_comma (0.00s)
    --- PASS: TestMatcher/not_equals_in_quotes (0.00s)
    --- PASS: TestMatcher/match_regex_in_quotes (0.00s)
    --- PASS: TestMatcher/doesn't_match_regex_in_quotes (0.00s)
    --- PASS: TestMatcher/equals_unicode_emoji_in_quotes (0.00s)
    --- PASS: TestMatcher/equals_unicode_sentence_in_quotes (0.00s)
    --- PASS: TestMatcher/equals_with_newline_in_quotes (0.00s)
    --- PASS: TestMatcher/equals_with_tab_in_quotes (0.00s)
    --- PASS: TestMatcher/equals_with_escaped_quotes_in_quotes (0.00s)
    --- PASS: TestMatcher/equals_with_escaped_backslash_in_quotes (0.00s)
    --- PASS: TestMatcher/equals_without_braces_in_quotes (0.00s)
    --- PASS: TestMatcher/equals_without_braces_in_quotes_with_trailing_comma (0.00s)
    --- PASS: TestMatcher/no_input (0.00s)
    --- PASS: TestMatcher/open_and_closing_braces (0.00s)
    --- PASS: TestMatcher/two_or_more_returns_error (0.00s)
    --- PASS: TestMatcher/invalid_unicode (0.00s)
=== RUN   FuzzParse
=== RUN   FuzzParse/seed#0
--- PASS: FuzzParse (0.00s)
    --- PASS: FuzzParse/seed#0 (0.00s)
PASS
ok  	github.com/prometheus/alertmanager/matcher/parse	0.088s
=== RUN   TestLogGC
--- PASS: TestLogGC (0.00s)
=== RUN   TestLogSnapshot
--- PASS: TestLogSnapshot (0.00s)
=== RUN   TestWithMaintenance_SupportsCustomCallback
--- PASS: TestWithMaintenance_SupportsCustomCallback (1.01s)
=== RUN   TestReplaceFile
--- PASS: TestReplaceFile (0.10s)
=== RUN   TestStateMerge
--- PASS: TestStateMerge (0.00s)
=== RUN   TestStateDataCoding
--- PASS: TestStateDataCoding (0.00s)
=== RUN   TestQuery
--- PASS: TestQuery (0.00s)
=== RUN   TestStateDecodingError
--- PASS: TestStateDecodingError (0.00s)
PASS
ok  	github.com/prometheus/alertmanager/nflog	1.195s
=== RUN   TestIsFiringSubset
--- PASS: TestIsFiringSubset (0.00s)
=== RUN   TestIsResolvedSubset
--- PASS: TestIsResolvedSubset (0.00s)
PASS
ok  	github.com/prometheus/alertmanager/nflog/nflogpb	0.040s
=== RUN   TestDedupStageNeedsUpdate
    notify_test.go:208: case 0
    notify_test.go:208: case 1
    notify_test.go:208: case 2
    notify_test.go:208: case 3
    notify_test.go:208: case 4
    notify_test.go:208: case 5
    notify_test.go:208: case 6
    notify_test.go:208: case 7
    notify_test.go:208: case 8
    notify_test.go:208: case 9
    notify_test.go:208: case 10
--- PASS: TestDedupStageNeedsUpdate (0.00s)
=== RUN   TestDedupStage
--- PASS: TestDedupStage (0.00s)
=== RUN   TestMultiStage
--- PASS: TestMultiStage (0.00s)
=== RUN   TestMultiStageFailure
--- PASS: TestMultiStageFailure (0.00s)
=== RUN   TestRoutingStage
--- PASS: TestRoutingStage (0.00s)
=== RUN   TestRetryStageWithError
--- PASS: TestRetryStageWithError (0.40s)
=== RUN   TestRetryStageWithErrorCode
--- PASS: TestRetryStageWithErrorCode (0.00s)
=== RUN   TestRetryStageWithContextCanceled
--- PASS: TestRetryStageWithContextCanceled (0.00s)
=== RUN   TestRetryStageNoResolved
--- PASS: TestRetryStageNoResolved (0.00s)
=== RUN   TestRetryStageSendResolved
--- PASS: TestRetryStageSendResolved (0.00s)
=== RUN   TestSetNotifiesStage
--- PASS: TestSetNotifiesStage (0.00s)
=== RUN   TestMuteStage
--- PASS: TestMuteStage (0.00s)
=== RUN   TestMuteStageWithSilences
--- PASS: TestMuteStageWithSilences (0.00s)
=== RUN   TestTimeMuteStage
=== RUN   TestTimeMuteStage/Should_be_muted_outside_working_hours
=== RUN   TestTimeMuteStage/Should_not_be_muted_during_workings_hours
=== RUN   TestTimeMuteStage/Should_be_muted_during_weekends
=== RUN   TestTimeMuteStage/Should_be_muted_at_12pm_UTC_on_a_weekday
=== RUN   TestTimeMuteStage/Should_be_muted_at_12pm_UTC_on_a_weekend
--- PASS: TestTimeMuteStage (0.00s)
    --- PASS: TestTimeMuteStage/Should_be_muted_outside_working_hours (0.00s)
    --- PASS: TestTimeMuteStage/Should_not_be_muted_during_workings_hours (0.00s)
    --- PASS: TestTimeMuteStage/Should_be_muted_during_weekends (0.00s)
    --- PASS: TestTimeMuteStage/Should_be_muted_at_12pm_UTC_on_a_weekday (0.00s)
    --- PASS: TestTimeMuteStage/Should_be_muted_at_12pm_UTC_on_a_weekend (0.00s)
=== RUN   TestTimeActiveStage
=== RUN   TestTimeActiveStage/Should_be_muted_outside_working_hours
=== RUN   TestTimeActiveStage/Should_not_be_muted_during_workings_hours
=== RUN   TestTimeActiveStage/Should_be_muted_during_weekends
=== RUN   TestTimeActiveStage/Should_be_muted_at_12pm_UTC
--- PASS: TestTimeActiveStage (0.00s)
    --- PASS: TestTimeActiveStage/Should_be_muted_outside_working_hours (0.00s)
    --- PASS: TestTimeActiveStage/Should_not_be_muted_during_workings_hours (0.00s)
    --- PASS: TestTimeActiveStage/Should_be_muted_during_weekends (0.00s)
    --- PASS: TestTimeActiveStage/Should_be_muted_at_12pm_UTC (0.00s)
=== RUN   TestTruncate
=== RUN   TestTruncate/notify.TruncateInBytes(,5)
=== RUN   TestTruncate/notify.TruncateInRunes(,5)
=== RUN   TestTruncate/notify.TruncateInBytes(abcde,2)
=== RUN   TestTruncate/notify.TruncateInRunes(abcde,2)
=== RUN   TestTruncate/notify.TruncateInBytes(abcde,4)
=== RUN   TestTruncate/notify.TruncateInRunes(abcde,4)
=== RUN   TestTruncate/notify.TruncateInBytes(abcde,5)
=== RUN   TestTruncate/notify.TruncateInRunes(abcde,5)
=== RUN   TestTruncate/notify.TruncateInBytes(abcdefgh,5)
=== RUN   TestTruncate/notify.TruncateInRunes(abcdefgh,5)
=== RUN   TestTruncate/notify.TruncateInBytes(a⌘cde,5)
=== RUN   TestTruncate/notify.TruncateInRunes(a⌘cde,5)
=== RUN   TestTruncate/notify.TruncateInBytes(a⌘cdef,5)
=== RUN   TestTruncate/notify.TruncateInRunes(a⌘cdef,5)
=== RUN   TestTruncate/notify.TruncateInBytes(世界cdef,3)
=== RUN   TestTruncate/notify.TruncateInRunes(世界cdef,3)
=== RUN   TestTruncate/notify.TruncateInBytes(❤️✅🚀🔥❌❤️✅🚀🔥❌❤️✅🚀🔥❌❤️✅🚀🔥❌,19)
=== RUN   TestTruncate/notify.TruncateInRunes(❤️✅🚀🔥❌❤️✅🚀🔥❌❤️✅🚀🔥❌❤️✅🚀🔥❌,19)
--- PASS: TestTruncate (0.00s)
    --- PASS: TestTruncate/notify.TruncateInBytes(,5) (0.00s)
    --- PASS: TestTruncate/notify.TruncateInRunes(,5) (0.00s)
    --- PASS: TestTruncate/notify.TruncateInBytes(abcde,2) (0.00s)
    --- PASS: TestTruncate/notify.TruncateInRunes(abcde,2) (0.00s)
    --- PASS: TestTruncate/notify.TruncateInBytes(abcde,4) (0.00s)
    --- PASS: TestTruncate/notify.TruncateInRunes(abcde,4) (0.00s)
    --- PASS: TestTruncate/notify.TruncateInBytes(abcde,5) (0.00s)
    --- PASS: TestTruncate/notify.TruncateInRunes(abcde,5) (0.00s)
    --- PASS: TestTruncate/notify.TruncateInBytes(abcdefgh,5) (0.00s)
    --- PASS: TestTruncate/notify.TruncateInRunes(abcdefgh,5) (0.00s)
    --- PASS: TestTruncate/notify.TruncateInBytes(a⌘cde,5) (0.00s)
    --- PASS: TestTruncate/notify.TruncateInRunes(a⌘cde,5) (0.00s)
    --- PASS: TestTruncate/notify.TruncateInBytes(a⌘cdef,5) (0.00s)
    --- PASS: TestTruncate/notify.TruncateInRunes(a⌘cdef,5) (0.00s)
    --- PASS: TestTruncate/notify.TruncateInBytes(世界cdef,3) (0.00s)
    --- PASS: TestTruncate/notify.TruncateInRunes(世界cdef,3) (0.00s)
    --- PASS: TestTruncate/notify.TruncateInBytes(❤️✅🚀🔥❌❤️✅🚀🔥❌❤️✅🚀🔥❌❤️✅🚀🔥❌,19) (0.00s)
    --- PASS: TestTruncate/notify.TruncateInRunes(❤️✅🚀🔥❌❤️✅🚀🔥❌❤️✅🚀🔥❌❤️✅🚀🔥❌,19) (0.00s)
=== RUN   TestRetrierCheck
=== RUN   TestRetrierCheck/#00
=== RUN   TestRetrierCheck/#01
=== RUN   TestRetrierCheck/#02
=== RUN   TestRetrierCheck/#03
=== RUN   TestRetrierCheck/#04
=== RUN   TestRetrierCheck/#05
=== RUN   TestRetrierCheck/#06
=== RUN   TestRetrierCheck/#07
--- PASS: TestRetrierCheck (0.01s)
    --- PASS: TestRetrierCheck/#00 (0.00s)
    --- PASS: TestRetrierCheck/#01 (0.00s)
    --- PASS: TestRetrierCheck/#02 (0.00s)
    --- PASS: TestRetrierCheck/#03 (0.00s)
    --- PASS: TestRetrierCheck/#04 (0.00s)
    --- PASS: TestRetrierCheck/#05 (0.00s)
    --- PASS: TestRetrierCheck/#06 (0.00s)
    --- PASS: TestRetrierCheck/#07 (0.00s)
PASS
ok  	github.com/prometheus/alertmanager/notify	0.552s
=== RUN   TestDiscordRetry
--- PASS: TestDiscordRetry (0.03s)
=== RUN   TestDiscordTemplating
=== RUN   TestDiscordTemplating/full-blown_message
=== RUN   TestDiscordTemplating/title_with_templating_errors
=== RUN   TestDiscordTemplating/message_with_templating_errors
--- PASS: TestDiscordTemplating (0.07s)
    --- PASS: TestDiscordTemplating/full-blown_message (0.03s)
    --- PASS: TestDiscordTemplating/title_with_templating_errors (0.00s)
    --- PASS: TestDiscordTemplating/message_with_templating_errors (0.03s)
=== RUN   TestDiscordRedactedURL
--- PASS: TestDiscordRedactedURL (0.00s)
=== RUN   TestDiscordReadingURLFromFile
--- PASS: TestDiscordReadingURLFromFile (0.03s)
=== RUN   TestDiscord_Notify
--- PASS: TestDiscord_Notify (0.02s)
PASS
ok  	github.com/prometheus/alertmanager/notify/discord	0.484s
=== RUN   TestEmailNotifyWithErrors
    email_test.go:232: EMAIL_NO_AUTH_CONFIG not set
--- SKIP: TestEmailNotifyWithErrors (0.00s)
=== RUN   TestEmailNotifyWithDoneContext
    email_test.go:341: EMAIL_NO_AUTH_CONFIG not set
--- SKIP: TestEmailNotifyWithDoneContext (0.00s)
=== RUN   TestEmailNotifyWithoutAuthentication
    email_test.go:372: EMAIL_NO_AUTH_CONFIG not set
--- SKIP: TestEmailNotifyWithoutAuthentication (0.00s)
=== RUN   TestEmailNotifyWithSTARTTLS
    email_test.go:413: EMAIL_NO_AUTH_CONFIG not set
--- SKIP: TestEmailNotifyWithSTARTTLS (0.00s)
=== RUN   TestEmailNotifyWithAuthentication
    email_test.go:443: EMAIL_AUTH_CONFIG not set
--- SKIP: TestEmailNotifyWithAuthentication (0.00s)
=== RUN   TestEmailConfigNoAuthMechs
--- PASS: TestEmailConfigNoAuthMechs (0.00s)
=== RUN   TestEmailConfigMissingAuthParam
--- PASS: TestEmailConfigMissingAuthParam (0.00s)
=== RUN   TestEmailNoUsernameStillOk
--- PASS: TestEmailNoUsernameStillOk (0.00s)
=== RUN   TestEmailRejected
--- PASS: TestEmailRejected (0.24s)
PASS
ok  	github.com/prometheus/alertmanager/notify/email	0.531s
=== RUN   TestMSTeamsRetry
--- PASS: TestMSTeamsRetry (0.01s)
=== RUN   TestMSTeamsTemplating
=== RUN   TestMSTeamsTemplating/full-blown_message
=== RUN   TestMSTeamsTemplating/title_with_templating_errors
=== RUN   TestMSTeamsTemplating/summary_with_templating_errors
=== RUN   TestMSTeamsTemplating/message_with_templating_errors
--- PASS: TestMSTeamsTemplating (0.03s)
    --- PASS: TestMSTeamsTemplating/full-blown_message (0.01s)
    --- PASS: TestMSTeamsTemplating/title_with_templating_errors (0.01s)
    --- PASS: TestMSTeamsTemplating/summary_with_templating_errors (0.01s)
    --- PASS: TestMSTeamsTemplating/message_with_templating_errors (0.00s)
=== RUN   TestNotifier_Notify_WithReason
=== RUN   TestNotifier_Notify_WithReason/with_a_2xx_status_code_and_response_1
--- PASS: TestNotifier_Notify_WithReason (0.00s)
    --- PASS: TestNotifier_Notify_WithReason/with_a_2xx_status_code_and_response_1 (0.00s)
=== RUN   TestMSTeamsRedactedURL
--- PASS: TestMSTeamsRedactedURL (0.01s)
=== RUN   TestMSTeamsReadingURLFromFile
--- PASS: TestMSTeamsReadingURLFromFile (0.14s)
PASS
ok  	github.com/prometheus/alertmanager/notify/msteams	0.458s
=== RUN   TestMSTeamsV2Retry
--- PASS: TestMSTeamsV2Retry (0.01s)
=== RUN   TestNotifier_Notify_WithReason
=== RUN   TestNotifier_Notify_WithReason/with_a_2xx_status_code_and_response_1
--- PASS: TestNotifier_Notify_WithReason (0.00s)
    --- PASS: TestNotifier_Notify_WithReason/with_a_2xx_status_code_and_response_1 (0.00s)
=== RUN   TestMSTeamsV2Templating
=== RUN   TestMSTeamsV2Templating/full-blown_message
=== RUN   TestMSTeamsV2Templating/title_with_templating_errors
=== RUN   TestMSTeamsV2Templating/message_with_templating_errors
--- PASS: TestMSTeamsV2Templating (0.07s)
    --- PASS: TestMSTeamsV2Templating/full-blown_message (0.01s)
    --- PASS: TestMSTeamsV2Templating/title_with_templating_errors (0.03s)
    --- PASS: TestMSTeamsV2Templating/message_with_templating_errors (0.01s)
=== RUN   TestMSTeamsV2RedactedURL
--- PASS: TestMSTeamsV2RedactedURL (0.02s)
=== RUN   TestMSTeamsV2ReadingURLFromFile
--- PASS: TestMSTeamsV2ReadingURLFromFile (0.03s)
PASS
ok  	github.com/prometheus/alertmanager/notify/msteamsv2	0.477s
=== RUN   TestOpsGenieRetry
--- PASS: TestOpsGenieRetry (0.00s)
=== RUN   TestOpsGenieRedactedURL
--- PASS: TestOpsGenieRedactedURL (0.01s)
=== RUN   TestGettingOpsGegineApikeyFromFile
--- PASS: TestGettingOpsGegineApikeyFromFile (0.13s)
=== RUN   TestOpsGenie
=== RUN   TestOpsGenie/config_without_details
=== RUN   TestOpsGenie/config_with_details
=== RUN   TestOpsGenie/config_with_multiple_teams
--- PASS: TestOpsGenie (0.03s)
    --- PASS: TestOpsGenie/config_without_details (0.00s)
    --- PASS: TestOpsGenie/config_with_details (0.00s)
    --- PASS: TestOpsGenie/config_with_multiple_teams (0.00s)
=== RUN   TestOpsGenieWithUpdate
--- PASS: TestOpsGenieWithUpdate (0.02s)
=== RUN   TestOpsGenieApiKeyFile
--- PASS: TestOpsGenieApiKeyFile (0.01s)
PASS
ok  	github.com/prometheus/alertmanager/notify/opsgenie	0.437s
=== RUN   TestPagerDutyRetryV1
--- PASS: TestPagerDutyRetryV1 (0.00s)
=== RUN   TestPagerDutyRetryV2
--- PASS: TestPagerDutyRetryV2 (0.02s)
=== RUN   TestPagerDutyRedactedURLV1
--- PASS: TestPagerDutyRedactedURLV1 (0.01s)
=== RUN   TestPagerDutyRedactedURLV2
--- PASS: TestPagerDutyRedactedURLV2 (0.00s)
=== RUN   TestPagerDutyV1ServiceKeyFromFile
--- PASS: TestPagerDutyV1ServiceKeyFromFile (0.03s)
=== RUN   TestPagerDutyV2RoutingKeyFromFile
--- PASS: TestPagerDutyV2RoutingKeyFromFile (0.01s)
=== RUN   TestPagerDutyTemplating
=== RUN   TestPagerDutyTemplating/full-blown_message
=== RUN   TestPagerDutyTemplating/details_with_templating_errors
=== RUN   TestPagerDutyTemplating/v2_message_with_templating_errors
=== RUN   TestPagerDutyTemplating/v1_message_with_templating_errors
=== RUN   TestPagerDutyTemplating/routing_key_cannot_be_empty
=== RUN   TestPagerDutyTemplating/service_key_cannot_be_empty
--- PASS: TestPagerDutyTemplating (0.10s)
    --- PASS: TestPagerDutyTemplating/full-blown_message (0.01s)
    --- PASS: TestPagerDutyTemplating/details_with_templating_errors (0.04s)
    --- PASS: TestPagerDutyTemplating/v2_message_with_templating_errors (0.03s)
    --- PASS: TestPagerDutyTemplating/v1_message_with_templating_errors (0.00s)
    --- PASS: TestPagerDutyTemplating/routing_key_cannot_be_empty (0.00s)
    --- PASS: TestPagerDutyTemplating/service_key_cannot_be_empty (0.02s)
=== RUN   TestErrDetails
=== RUN   TestErrDetails/#00
=== RUN   TestErrDetails/#01
=== RUN   TestErrDetails/#02
=== RUN   TestErrDetails/#03
--- PASS: TestErrDetails (0.00s)
    --- PASS: TestErrDetails/#00 (0.00s)
    --- PASS: TestErrDetails/#01 (0.00s)
    --- PASS: TestErrDetails/#02 (0.00s)
    --- PASS: TestErrDetails/#03 (0.00s)
=== RUN   TestEventSizeEnforcement
--- PASS: TestEventSizeEnforcement (0.09s)
=== RUN   TestPagerDutyEmptySrcHref
--- PASS: TestPagerDutyEmptySrcHref (0.02s)
PASS
ok  	github.com/prometheus/alertmanager/notify/pagerduty	0.468s
=== RUN   TestPushoverRetry
--- PASS: TestPushoverRetry (0.01s)
=== RUN   TestPushoverRedactedURL
--- PASS: TestPushoverRedactedURL (0.01s)
=== RUN   TestPushoverReadingUserKeyFromFile
--- PASS: TestPushoverReadingUserKeyFromFile (0.01s)
=== RUN   TestPushoverReadingTokenFromFile
--- PASS: TestPushoverReadingTokenFromFile (0.06s)
PASS
ok  	github.com/prometheus/alertmanager/notify/pushover	0.360s
=== RUN   TestRocketchatRetry
--- PASS: TestRocketchatRetry (0.01s)
=== RUN   TestGettingRocketchatTokenFromFile
--- PASS: TestGettingRocketchatTokenFromFile (0.02s)
PASS
ok  	github.com/prometheus/alertmanager/notify/rocketchat	0.329s
=== RUN   TestSlackRetry
--- PASS: TestSlackRetry (0.01s)
=== RUN   TestSlackRedactedURL
--- PASS: TestSlackRedactedURL (0.01s)
=== RUN   TestGettingSlackURLFromFile
--- PASS: TestGettingSlackURLFromFile (0.01s)
=== RUN   TestTrimmingSlackURLFromFile
--- PASS: TestTrimmingSlackURLFromFile (0.01s)
=== RUN   TestNotifier_Notify_WithReason
=== RUN   TestNotifier_Notify_WithReason/with_a_4xx_status_code
=== RUN   TestNotifier_Notify_WithReason/with_a_5xx_status_code
=== RUN   TestNotifier_Notify_WithReason/with_a_3xx_status_code
=== RUN   TestNotifier_Notify_WithReason/with_a_1xx_status_code
=== RUN   TestNotifier_Notify_WithReason/2xx_response_with_invalid_JSON
=== RUN   TestNotifier_Notify_WithReason/2xx_response_with_a_JSON_error
=== RUN   TestNotifier_Notify_WithReason/2xx_response_with_a_plaintext_error
=== RUN   TestNotifier_Notify_WithReason/successful_JSON_response
=== RUN   TestNotifier_Notify_WithReason/successful_plaintext_response
--- PASS: TestNotifier_Notify_WithReason (0.09s)
    --- PASS: TestNotifier_Notify_WithReason/with_a_4xx_status_code (0.02s)
    --- PASS: TestNotifier_Notify_WithReason/with_a_5xx_status_code (0.00s)
    --- PASS: TestNotifier_Notify_WithReason/with_a_3xx_status_code (0.00s)
    --- PASS: TestNotifier_Notify_WithReason/with_a_1xx_status_code (0.00s)
    --- PASS: TestNotifier_Notify_WithReason/2xx_response_with_invalid_JSON (0.00s)
    --- PASS: TestNotifier_Notify_WithReason/2xx_response_with_a_JSON_error (0.04s)
    --- PASS: TestNotifier_Notify_WithReason/2xx_response_with_a_plaintext_error (0.00s)
    --- PASS: TestNotifier_Notify_WithReason/successful_JSON_response (0.01s)
    --- PASS: TestNotifier_Notify_WithReason/successful_plaintext_response (0.00s)
PASS
ok  	github.com/prometheus/alertmanager/notify/slack	0.313s
=== RUN   TestValidateAndTruncateMessage
--- PASS: TestValidateAndTruncateMessage (0.00s)
=== RUN   TestNotifyWithInvalidTemplate
=== RUN   TestNotifyWithInvalidTemplate/with_invalid_Attribute_template
=== RUN   TestNotifyWithInvalidTemplate/with_invalid_TopicArn_template
=== RUN   TestNotifyWithInvalidTemplate/with_invalid_PhoneNumber_template
=== RUN   TestNotifyWithInvalidTemplate/with_invalid_Message_template
=== RUN   TestNotifyWithInvalidTemplate/with_invalid_Subject_template
=== RUN   TestNotifyWithInvalidTemplate/with_invalid_APIUrl_template
=== RUN   TestNotifyWithInvalidTemplate/with_invalid_TargetARN_template
--- PASS: TestNotifyWithInvalidTemplate (0.01s)
    --- PASS: TestNotifyWithInvalidTemplate/with_invalid_Attribute_template (0.01s)
    --- PASS: TestNotifyWithInvalidTemplate/with_invalid_TopicArn_template (0.00s)
    --- PASS: TestNotifyWithInvalidTemplate/with_invalid_PhoneNumber_template (0.00s)
    --- PASS: TestNotifyWithInvalidTemplate/with_invalid_Message_template (0.00s)
    --- PASS: TestNotifyWithInvalidTemplate/with_invalid_Subject_template (0.00s)
    --- PASS: TestNotifyWithInvalidTemplate/with_invalid_APIUrl_template (0.00s)
    --- PASS: TestNotifyWithInvalidTemplate/with_invalid_TargetARN_template (0.00s)
PASS
ok  	github.com/prometheus/alertmanager/notify/sns	0.264s
=== RUN   TestTelegramUnmarshal
--- PASS: TestTelegramUnmarshal (0.00s)
=== RUN   TestTelegramRetry
--- PASS: TestTelegramRetry (0.00s)
=== RUN   TestTelegramNotify
=== RUN   TestTelegramNotify/No_escaping_by_default
=== RUN   TestTelegramNotify/Characters_escaped_in_HTML_mode
=== RUN   TestTelegramNotify/Bot_token_from_file
--- PASS: TestTelegramNotify (0.09s)
    --- PASS: TestTelegramNotify/No_escaping_by_default (0.02s)
    --- PASS: TestTelegramNotify/Characters_escaped_in_HTML_mode (0.05s)
    --- PASS: TestTelegramNotify/Bot_token_from_file (0.01s)
PASS
ok  	github.com/prometheus/alertmanager/notify/telegram	0.212s
?   	github.com/prometheus/alertmanager/notify/test	[no test files]
=== RUN   TestVictorOpsCustomFields
--- PASS: TestVictorOpsCustomFields (0.01s)
=== RUN   TestVictorOpsRetry
--- PASS: TestVictorOpsRetry (0.00s)
=== RUN   TestVictorOpsRedactedURL
--- PASS: TestVictorOpsRedactedURL (0.01s)
=== RUN   TestVictorOpsReadingApiKeyFromFile
--- PASS: TestVictorOpsReadingApiKeyFromFile (0.01s)
=== RUN   TestVictorOpsTemplating
=== RUN   TestVictorOpsTemplating/default_valid_templates
=== RUN   TestVictorOpsTemplating/invalid_message_type
=== RUN   TestVictorOpsTemplating/invalid_entity_display_name
=== RUN   TestVictorOpsTemplating/invalid_state_message
=== RUN   TestVictorOpsTemplating/invalid_monitoring_tool
=== RUN   TestVictorOpsTemplating/invalid_routing_key
--- PASS: TestVictorOpsTemplating (0.06s)
    --- PASS: TestVictorOpsTemplating/default_valid_templates (0.04s)
    --- PASS: TestVictorOpsTemplating/invalid_message_type (0.00s)
    --- PASS: TestVictorOpsTemplating/invalid_entity_display_name (0.00s)
    --- PASS: TestVictorOpsTemplating/invalid_state_message (0.00s)
    --- PASS: TestVictorOpsTemplating/invalid_monitoring_tool (0.00s)
    --- PASS: TestVictorOpsTemplating/invalid_routing_key (0.00s)
PASS
ok  	github.com/prometheus/alertmanager/notify/victorops	0.163s
=== RUN   TestWebexRetry
--- PASS: TestWebexRetry (0.02s)
=== RUN   TestWebexTemplating
=== RUN   TestWebexTemplating/with_a_valid_message_and_a_set_http_config.authorization,_it_is_formatted_as_expected
=== RUN   TestWebexTemplating/with_message_templating_errors,_it_fails.
=== RUN   TestWebexTemplating/with_a_valid_roomID_set,_the_roomID_is_used_accordingly.
=== RUN   TestWebexTemplating/with_a_valid_roomID_template,_the_roomID_is_used_accordingly.
--- PASS: TestWebexTemplating (0.08s)
    --- PASS: TestWebexTemplating/with_a_valid_message_and_a_set_http_config.authorization,_it_is_formatted_as_expected (0.02s)
    --- PASS: TestWebexTemplating/with_message_templating_errors,_it_fails. (0.01s)
    --- PASS: TestWebexTemplating/with_a_valid_roomID_set,_the_roomID_is_used_accordingly. (0.01s)
    --- PASS: TestWebexTemplating/with_a_valid_roomID_template,_the_roomID_is_used_accordingly. (0.04s)
PASS
ok  	github.com/prometheus/alertmanager/notify/webex	0.193s
=== RUN   TestWebhookRetry
=== RUN   TestWebhookRetry/test_retry_status_code
=== RUN   TestWebhookRetry/test_retry_error_details
=== RUN   TestWebhookRetry/test_retry_error_details/#00
=== RUN   TestWebhookRetry/test_retry_error_details/#01
--- PASS: TestWebhookRetry (0.00s)
    --- PASS: TestWebhookRetry/test_retry_status_code (0.00s)
    --- PASS: TestWebhookRetry/test_retry_error_details (0.00s)
        --- PASS: TestWebhookRetry/test_retry_error_details/#00 (0.00s)
        --- PASS: TestWebhookRetry/test_retry_error_details/#01 (0.00s)
=== RUN   TestWebhookTruncateAlerts
--- PASS: TestWebhookTruncateAlerts (0.00s)
=== RUN   TestWebhookRedactedURL
--- PASS: TestWebhookRedactedURL (0.02s)
=== RUN   TestWebhookReadingURLFromFile
--- PASS: TestWebhookReadingURLFromFile (0.01s)
PASS
ok  	github.com/prometheus/alertmanager/notify/webhook	0.276s
=== RUN   TestWechatRedactedURLOnInitialAuthentication
--- PASS: TestWechatRedactedURLOnInitialAuthentication (0.00s)
=== RUN   TestWechatRedactedURLOnNotify
--- PASS: TestWechatRedactedURLOnNotify (0.02s)
=== RUN   TestWechatMessageTypeSelector
--- PASS: TestWechatMessageTypeSelector (0.01s)
PASS
ok  	github.com/prometheus/alertmanager/notify/wechat	0.260s
=== RUN   TestMatcher
--- PASS: TestMatcher (0.00s)
=== RUN   TestMatcherString
--- PASS: TestMatcherString (0.00s)
=== RUN   TestMatcherJSONMarshal
--- PASS: TestMatcherJSONMarshal (0.00s)
=== RUN   TestMatcherJSONUnmarshal
--- PASS: TestMatcherJSONUnmarshal (0.00s)
=== RUN   TestMatchers
=== RUN   TestMatchers/{}
=== RUN   TestMatchers/,
=== RUN   TestMatchers/{,}
=== RUN   TestMatchers/{foo='}
=== RUN   TestMatchers/{foo=`}
=== RUN   TestMatchers/{foo=\"}
=== RUN   TestMatchers/{foo=bar}
=== RUN   TestMatchers/{foo="bar"}
=== RUN   TestMatchers/{foo=~bar.*}
=== RUN   TestMatchers/{foo=~"bar.*"}
=== RUN   TestMatchers/{foo!=bar}
=== RUN   TestMatchers/{foo!="bar"}
=== RUN   TestMatchers/{foo!~bar.*}
=== RUN   TestMatchers/{foo!~"bar.*"}
=== RUN   TestMatchers/{foo="bar",_baz!="quux"}
=== RUN   TestMatchers/{foo="bar",_baz!~"quux.*"}
=== RUN   TestMatchers/{foo="bar",baz!~".*quux",_derp="wat"}
=== RUN   TestMatchers/{foo="bar",_baz!="quux",_derp="wat"}
=== RUN   TestMatchers/{foo="bar",_baz!~".*quux.*",_derp="wat"}
=== RUN   TestMatchers/{foo="bar",_instance=~"some-api.*"}
=== RUN   TestMatchers/{foo=""}
=== RUN   TestMatchers/{foo="bar,quux",_job="job1"}
=== RUN   TestMatchers/{foo_=_"bar",_dings_!=_"bums",_}
=== RUN   TestMatchers/foo=bar,dings!=bums
=== RUN   TestMatchers/{quote="She_said:_\"Hi,_ladies!_That's_gender-neutral…\""}
=== RUN   TestMatchers/statuscode=~"5.."
=== RUN   TestMatchers/tricky=~~~
=== RUN   TestMatchers/trickier==\\=\=\"
=== RUN   TestMatchers/contains_quote_!=_"\""_,_contains_comma_!~_"foo,bar"_,_
=== RUN   TestMatchers/{foo=bar}}
=== RUN   TestMatchers/{foo=bar}},}
=== RUN   TestMatchers/{foo=,bar=}}
=== RUN   TestMatchers/{foo=bar\t}
=== RUN   TestMatchers/{foo=bar\n}
=== RUN   TestMatchers/{foo=bar\}
=== RUN   TestMatchers/{foo=bar\\}
=== RUN   TestMatchers/{foo=bar\"}
=== RUN   TestMatchers/job=
=== RUN   TestMatchers/job="value
=== RUN   TestMatchers/job=value"
=== RUN   TestMatchers/trickier==\\=\=\""
=== RUN   TestMatchers/contains_unescaped_quote_=_foo"bar
=== RUN   TestMatchers/{invalid-name_=_"valid_label"}
=== RUN   TestMatchers/{foo=~"invalid[regexp"}
=== RUN   TestMatchers/"{foo=\"bar"}
=== RUN   TestMatchers/"foo=\"bar"
=== RUN   TestMatchers/"foo=\"bar\""
=== RUN   TestMatchers/"foo=\"bar\"
=== RUN   TestMatchers/"{foo=\"bar\"}"
=== RUN   TestMatchers/"foo="bar""
=== RUN   TestMatchers/{{foo=
=== RUN   TestMatchers/{foo=
=== RUN   TestMatchers/{foo=}b
--- PASS: TestMatchers (0.00s)
    --- PASS: TestMatchers/{} (0.00s)
    --- PASS: TestMatchers/, (0.00s)
    --- PASS: TestMatchers/{,} (0.00s)
    --- PASS: TestMatchers/{foo='} (0.00s)
    --- PASS: TestMatchers/{foo=`} (0.00s)
    --- PASS: TestMatchers/{foo=\"} (0.00s)
    --- PASS: TestMatchers/{foo=bar} (0.00s)
    --- PASS: TestMatchers/{foo="bar"} (0.00s)
    --- PASS: TestMatchers/{foo=~bar.*} (0.00s)
    --- PASS: TestMatchers/{foo=~"bar.*"} (0.00s)
    --- PASS: TestMatchers/{foo!=bar} (0.00s)
    --- PASS: TestMatchers/{foo!="bar"} (0.00s)
    --- PASS: TestMatchers/{foo!~bar.*} (0.00s)
    --- PASS: TestMatchers/{foo!~"bar.*"} (0.00s)
    --- PASS: TestMatchers/{foo="bar",_baz!="quux"} (0.00s)
    --- PASS: TestMatchers/{foo="bar",_baz!~"quux.*"} (0.00s)
    --- PASS: TestMatchers/{foo="bar",baz!~".*quux",_derp="wat"} (0.00s)
    --- PASS: TestMatchers/{foo="bar",_baz!="quux",_derp="wat"} (0.00s)
    --- PASS: TestMatchers/{foo="bar",_baz!~".*quux.*",_derp="wat"} (0.00s)
    --- PASS: TestMatchers/{foo="bar",_instance=~"some-api.*"} (0.00s)
    --- PASS: TestMatchers/{foo=""} (0.00s)
    --- PASS: TestMatchers/{foo="bar,quux",_job="job1"} (0.00s)
    --- PASS: TestMatchers/{foo_=_"bar",_dings_!=_"bums",_} (0.00s)
    --- PASS: TestMatchers/foo=bar,dings!=bums (0.00s)
    --- PASS: TestMatchers/{quote="She_said:_\"Hi,_ladies!_That's_gender-neutral…\""} (0.00s)
    --- PASS: TestMatchers/statuscode=~"5.." (0.00s)
    --- PASS: TestMatchers/tricky=~~~ (0.00s)
    --- PASS: TestMatchers/trickier==\\=\=\" (0.00s)
    --- PASS: TestMatchers/contains_quote_!=_"\""_,_contains_comma_!~_"foo,bar"_,_ (0.00s)
    --- PASS: TestMatchers/{foo=bar}} (0.00s)
    --- PASS: TestMatchers/{foo=bar}},} (0.00s)
    --- PASS: TestMatchers/{foo=,bar=}} (0.00s)
    --- PASS: TestMatchers/{foo=bar\t} (0.00s)
    --- PASS: TestMatchers/{foo=bar\n} (0.00s)
    --- PASS: TestMatchers/{foo=bar\} (0.00s)
    --- PASS: TestMatchers/{foo=bar\\} (0.00s)
    --- PASS: TestMatchers/{foo=bar\"} (0.00s)
    --- PASS: TestMatchers/job= (0.00s)
    --- PASS: TestMatchers/job="value (0.00s)
    --- PASS: TestMatchers/job=value" (0.00s)
    --- PASS: TestMatchers/trickier==\\=\=\"" (0.00s)
    --- PASS: TestMatchers/contains_unescaped_quote_=_foo"bar (0.00s)
    --- PASS: TestMatchers/{invalid-name_=_"valid_label"} (0.00s)
    --- PASS: TestMatchers/{foo=~"invalid[regexp"} (0.00s)
    --- PASS: TestMatchers/"{foo=\"bar"} (0.00s)
    --- PASS: TestMatchers/"foo=\"bar" (0.00s)
    --- PASS: TestMatchers/"foo=\"bar\"" (0.00s)
    --- PASS: TestMatchers/"foo=\"bar\" (0.00s)
    --- PASS: TestMatchers/"{foo=\"bar\"}" (0.00s)
    --- PASS: TestMatchers/"foo="bar"" (0.00s)
    --- PASS: TestMatchers/{{foo= (0.00s)
    --- PASS: TestMatchers/{foo= (0.00s)
    --- PASS: TestMatchers/{foo=}b (0.00s)
PASS
ok  	github.com/prometheus/alertmanager/pkg/labels	0.032s
?   	github.com/prometheus/alertmanager/pkg/modtimevfs	[no test files]
?   	github.com/prometheus/alertmanager/provider	[no test files]
=== RUN   TestAlertsSubscribePutStarvation
--- PASS: TestAlertsSubscribePutStarvation (0.10s)
=== RUN   TestDeadLock
--- PASS: TestDeadLock (1.00s)
=== RUN   TestAlertsPut
--- PASS: TestAlertsPut (0.00s)
=== RUN   TestAlertsSubscribe
--- PASS: TestAlertsSubscribe (0.00s)
=== RUN   TestAlertsGetPending
--- PASS: TestAlertsGetPending (0.00s)
=== RUN   TestAlertsGC
--- PASS: TestAlertsGC (0.30s)
=== RUN   TestAlertsStoreCallback
--- PASS: TestAlertsStoreCallback (0.30s)
=== RUN   TestAlerts_Count
--- PASS: TestAlerts_Count (0.81s)
=== RUN   TestAlertsConcurrently
--- PASS: TestAlertsConcurrently (2.04s)
PASS
ok  	github.com/prometheus/alertmanager/provider/mem	4.572s
=== RUN   TestOptionsValidate
--- PASS: TestOptionsValidate (0.00s)
=== RUN   TestSilenceGCOverTime
=== RUN   TestSilenceGCOverTime/GC_does_not_remove_active_silences
=== RUN   TestSilenceGCOverTime/GC_does_not_leak_cache_entries
=== RUN   TestSilenceGCOverTime/replacing_a_silences_does_not_leak_cache_entries
=== RUN   TestSilenceGCOverTime/updating_a_silences_does_not_leak_cache_entries
--- PASS: TestSilenceGCOverTime (0.00s)
    --- PASS: TestSilenceGCOverTime/GC_does_not_remove_active_silences (0.00s)
    --- PASS: TestSilenceGCOverTime/GC_does_not_leak_cache_entries (0.00s)
    --- PASS: TestSilenceGCOverTime/replacing_a_silences_does_not_leak_cache_entries (0.00s)
    --- PASS: TestSilenceGCOverTime/updating_a_silences_does_not_leak_cache_entries (0.00s)
=== RUN   TestSilencesSnapshot
--- PASS: TestSilencesSnapshot (0.00s)
=== RUN   TestSilences_Maintenance_DefaultMaintenanceFuncDoesntCrash
--- PASS: TestSilences_Maintenance_DefaultMaintenanceFuncDoesntCrash (0.01s)
=== RUN   TestSilences_Maintenance_SupportsCustomCallback
--- PASS: TestSilences_Maintenance_SupportsCustomCallback (1.01s)
=== RUN   TestSilencesSetSilence
--- PASS: TestSilencesSetSilence (0.00s)
=== RUN   TestSilenceSet
--- PASS: TestSilenceSet (0.00s)
=== RUN   TestSilenceLimits
--- PASS: TestSilenceLimits (0.00s)
=== RUN   TestSilenceNoLimits
--- PASS: TestSilenceNoLimits (0.00s)
=== RUN   TestSetActiveSilence
--- PASS: TestSetActiveSilence (0.00s)
=== RUN   TestSilencesSetFail
--- PASS: TestSilencesSetFail (0.00s)
=== RUN   TestQState
--- PASS: TestQState (0.00s)
=== RUN   TestQMatches
--- PASS: TestQMatches (0.00s)
=== RUN   TestSilencesQuery
--- PASS: TestSilencesQuery (0.00s)
=== RUN   TestSilenceCanUpdate
--- PASS: TestSilenceCanUpdate (0.00s)
=== RUN   TestSilenceExpire
--- PASS: TestSilenceExpire (0.00s)
=== RUN   TestSilenceExpireWithZeroRetention
--- PASS: TestSilenceExpireWithZeroRetention (0.00s)
=== RUN   TestSilenceExpireInvalid
--- PASS: TestSilenceExpireInvalid (0.00s)
=== RUN   TestSilencer
--- PASS: TestSilencer (0.00s)
=== RUN   TestValidateClassicMatcher
--- PASS: TestValidateClassicMatcher (0.00s)
=== RUN   TestValidateUTF8Matcher
--- PASS: TestValidateUTF8Matcher (0.00s)
=== RUN   TestValidateSilence
--- PASS: TestValidateSilence (0.00s)
=== RUN   TestStateMerge
--- PASS: TestStateMerge (0.00s)
=== RUN   TestStateCoding
--- PASS: TestStateCoding (0.00s)
=== RUN   TestStateDecodingError
--- PASS: TestStateDecodingError (0.00s)
PASS
ok  	github.com/prometheus/alertmanager/silence	1.089s
?   	github.com/prometheus/alertmanager/silence/silencepb	[no test files]
=== RUN   TestSetGet
--- PASS: TestSetGet (0.00s)
=== RUN   TestDeleteIfNotModified
=== RUN   TestDeleteIfNotModified/unmodified_alert_should_be_deleted
=== RUN   TestDeleteIfNotModified/modified_alert_should_not_be_deleted
=== RUN   TestDeleteIfNotModified/should_not_delete_other_alerts
--- PASS: TestDeleteIfNotModified (0.00s)
    --- PASS: TestDeleteIfNotModified/unmodified_alert_should_be_deleted (0.00s)
    --- PASS: TestDeleteIfNotModified/modified_alert_should_not_be_deleted (0.00s)
    --- PASS: TestDeleteIfNotModified/should_not_delete_other_alerts (0.00s)
=== RUN   TestGC
--- PASS: TestGC (0.01s)
PASS
ok  	github.com/prometheus/alertmanager/store	0.066s
=== RUN   TestPairNames
--- PASS: TestPairNames (0.00s)
=== RUN   TestPairValues
--- PASS: TestPairValues (0.00s)
=== RUN   TestPairsString
--- PASS: TestPairsString (0.00s)
=== RUN   TestKVSortedPairs
--- PASS: TestKVSortedPairs (0.00s)
=== RUN   TestKVRemove
--- PASS: TestKVRemove (0.00s)
=== RUN   TestAlertsFiring
--- PASS: TestAlertsFiring (0.00s)
=== RUN   TestAlertsResolved
--- PASS: TestAlertsResolved (0.00s)
=== RUN   TestData
=== RUN   TestData/#00
=== RUN   TestData/#01
=== RUN   TestData/#02
--- PASS: TestData (0.01s)
    --- PASS: TestData/#00 (0.00s)
    --- PASS: TestData/#01 (0.00s)
    --- PASS: TestData/#02 (0.01s)
=== RUN   TestTemplateExpansion
=== RUN   TestTemplateExpansion/Template_without_action
=== RUN   TestTemplateExpansion/Template_with_simple_action
=== RUN   TestTemplateExpansion/Template_with_invalid_syntax
=== RUN   TestTemplateExpansion/Template_using_toUpper
=== RUN   TestTemplateExpansion/Template_using_toLower
=== RUN   TestTemplateExpansion/Template_using_title
=== RUN   TestTemplateExpansion/Template_using_TrimSpace
=== RUN   TestTemplateExpansion/Template_using_positive_match
=== RUN   TestTemplateExpansion/Template_using_negative_match
=== RUN   TestTemplateExpansion/Template_using_join
=== RUN   TestTemplateExpansion/Text_template_without_HTML_escaping
=== RUN   TestTemplateExpansion/HTML_template_with_escaping
=== RUN   TestTemplateExpansion/HTML_template_using_safeHTML
=== RUN   TestTemplateExpansion/Template_using_reReplaceAll
=== RUN   TestTemplateExpansion/Template_using_stringSlice
--- PASS: TestTemplateExpansion (0.01s)
    --- PASS: TestTemplateExpansion/Template_without_action (0.00s)
    --- PASS: TestTemplateExpansion/Template_with_simple_action (0.00s)
    --- PASS: TestTemplateExpansion/Template_with_invalid_syntax (0.00s)
    --- PASS: TestTemplateExpansion/Template_using_toUpper (0.00s)
    --- PASS: TestTemplateExpansion/Template_using_toLower (0.00s)
    --- PASS: TestTemplateExpansion/Template_using_title (0.00s)
    --- PASS: TestTemplateExpansion/Template_using_TrimSpace (0.00s)
    --- PASS: TestTemplateExpansion/Template_using_positive_match (0.00s)
    --- PASS: TestTemplateExpansion/Template_using_negative_match (0.00s)
    --- PASS: TestTemplateExpansion/Template_using_join (0.00s)
    --- PASS: TestTemplateExpansion/Text_template_without_HTML_escaping (0.00s)
    --- PASS: TestTemplateExpansion/HTML_template_with_escaping (0.00s)
    --- PASS: TestTemplateExpansion/HTML_template_using_safeHTML (0.00s)
    --- PASS: TestTemplateExpansion/Template_using_reReplaceAll (0.00s)
    --- PASS: TestTemplateExpansion/Template_using_stringSlice (0.00s)
=== RUN   TestTemplateExpansionWithOptions
=== RUN   TestTemplateExpansionWithOptions/Test_custom_function
=== RUN   TestTemplateExpansionWithOptions/Test_Default_function_with_additional_function_added
=== RUN   TestTemplateExpansionWithOptions/Test_custom_function_is_overridden_by_the_DefaultFuncs
=== RUN   TestTemplateExpansionWithOptions/Test_later_Option_overrides_the_previous
--- PASS: TestTemplateExpansionWithOptions (0.04s)
    --- PASS: TestTemplateExpansionWithOptions/Test_custom_function (0.01s)
    --- PASS: TestTemplateExpansionWithOptions/Test_Default_function_with_additional_function_added (0.00s)
    --- PASS: TestTemplateExpansionWithOptions/Test_custom_function_is_overridden_by_the_DefaultFuncs (0.01s)
    --- PASS: TestTemplateExpansionWithOptions/Test_later_Option_overrides_the_previous (0.02s)
=== RUN   TestTemplateFuncs
=== RUN   TestTemplateFuncs/Template_using_toUpper
=== RUN   TestTemplateFuncs/Template_using_toLower
=== RUN   TestTemplateFuncs/Template_using_title
=== RUN   TestTemplateFuncs/Template_using_trimSpace
=== RUN   TestTemplateFuncs/Template_using_join
=== RUN   TestTemplateFuncs/Template_using_match
=== RUN   TestTemplateFuncs/Template_using_reReplaceAll
=== RUN   TestTemplateFuncs/Template_using_date
=== RUN   TestTemplateFuncs/Template_using_tz
=== RUN   TestTemplateFuncs/Template_using_invalid_tz
=== RUN   TestTemplateFuncs/Template_using_HumanizeDuration_-_seconds_-_float64
=== RUN   TestTemplateFuncs/Template_using_HumanizeDuration_-_seconds_-_string.
=== RUN   TestTemplateFuncs/Template_using_HumanizeDuration_-_subsecond_and_fractional_seconds_-_float64.
=== RUN   TestTemplateFuncs/Template_using_HumanizeDuration_-_subsecond_and_fractional_seconds_-_string.
=== RUN   TestTemplateFuncs/Template_using_HumanizeDuration_-_string_with_error.
=== RUN   TestTemplateFuncs/Template_using_HumanizeDuration_-_int.
=== RUN   TestTemplateFuncs/Template_using_HumanizeDuration_-_uint.
=== RUN   TestTemplateFuncs/Template_using_since
--- PASS: TestTemplateFuncs (0.08s)
    --- PASS: TestTemplateFuncs/Template_using_toUpper (0.00s)
    --- PASS: TestTemplateFuncs/Template_using_toLower (0.00s)
    --- PASS: TestTemplateFuncs/Template_using_title (0.00s)
    --- PASS: TestTemplateFuncs/Template_using_trimSpace (0.00s)
    --- PASS: TestTemplateFuncs/Template_using_join (0.00s)
    --- PASS: TestTemplateFuncs/Template_using_match (0.00s)
    --- PASS: TestTemplateFuncs/Template_using_reReplaceAll (0.00s)
    --- PASS: TestTemplateFuncs/Template_using_date (0.00s)
    --- PASS: TestTemplateFuncs/Template_using_tz (0.01s)
    --- PASS: TestTemplateFuncs/Template_using_invalid_tz (0.02s)
    --- PASS: TestTemplateFuncs/Template_using_HumanizeDuration_-_seconds_-_float64 (0.00s)
    --- PASS: TestTemplateFuncs/Template_using_HumanizeDuration_-_seconds_-_string. (0.00s)
    --- PASS: TestTemplateFuncs/Template_using_HumanizeDuration_-_subsecond_and_fractional_seconds_-_float64. (0.00s)
    --- PASS: TestTemplateFuncs/Template_using_HumanizeDuration_-_subsecond_and_fractional_seconds_-_string. (0.00s)
    --- PASS: TestTemplateFuncs/Template_using_HumanizeDuration_-_string_with_error. (0.00s)
    --- PASS: TestTemplateFuncs/Template_using_HumanizeDuration_-_int. (0.00s)
    --- PASS: TestTemplateFuncs/Template_using_HumanizeDuration_-_uint. (0.00s)
    --- PASS: TestTemplateFuncs/Template_using_since (0.00s)
PASS
ok  	github.com/prometheus/alertmanager/template	0.192s
?   	github.com/prometheus/alertmanager/test/cli	[no test files]
?   	github.com/prometheus/alertmanager/test/with_api_v2	[no test files]
=== RUN   TestYamlUnmarshal
--- PASS: TestYamlUnmarshal (0.00s)
=== RUN   TestContainsTime
--- PASS: TestContainsTime (0.00s)
=== RUN   TestParseTimeString
--- PASS: TestParseTimeString (0.00s)
=== RUN   TestYamlMarshal
--- PASS: TestYamlMarshal (0.00s)
=== RUN   TestJsonMarshal
--- PASS: TestJsonMarshal (0.00s)
=== RUN   TestTimeIntervalComplete
--- PASS: TestTimeIntervalComplete (0.00s)
=== RUN   TestIntervener_Mutes
=== RUN   TestIntervener_Mutes/Should_be_muted_outside_working_hours
=== RUN   TestIntervener_Mutes/Should_not_be_muted_during_working_hours
=== RUN   TestIntervener_Mutes/Should_be_muted_during_weekends
=== RUN   TestIntervener_Mutes/Should_be_muted_during_weekend_evenings
=== RUN   TestIntervener_Mutes/Should_be_muted_at_12pm_UTC_on_a_weekday
=== RUN   TestIntervener_Mutes/Should_be_muted_at_12pm_UTC_on_a_weekend
--- PASS: TestIntervener_Mutes (0.00s)
    --- PASS: TestIntervener_Mutes/Should_be_muted_outside_working_hours (0.00s)
    --- PASS: TestIntervener_Mutes/Should_not_be_muted_during_working_hours (0.00s)
    --- PASS: TestIntervener_Mutes/Should_be_muted_during_weekends (0.00s)
    --- PASS: TestIntervener_Mutes/Should_be_muted_during_weekend_evenings (0.00s)
    --- PASS: TestIntervener_Mutes/Should_be_muted_at_12pm_UTC_on_a_weekday (0.00s)
    --- PASS: TestIntervener_Mutes/Should_be_muted_at_12pm_UTC_on_a_weekend (0.00s)
PASS
ok  	github.com/prometheus/alertmanager/timeinterval	0.044s
=== RUN   TestMemMarker_Muted
--- PASS: TestMemMarker_Muted (0.00s)
=== RUN   TestMemMarker_DeleteByGroupKey
--- PASS: TestMemMarker_DeleteByGroupKey (0.00s)
=== RUN   TestMemMarker_Count
--- PASS: TestMemMarker_Count (0.00s)
=== RUN   TestAlertMerge
=== RUN   TestAlertMerge/0
=== RUN   TestAlertMerge/1
=== RUN   TestAlertMerge/2
=== RUN   TestAlertMerge/3
=== RUN   TestAlertMerge/4
=== RUN   TestAlertMerge/5
=== RUN   TestAlertMerge/6
=== RUN   TestAlertMerge/7
--- PASS: TestAlertMerge (0.00s)
    --- PASS: TestAlertMerge/0 (0.00s)
    --- PASS: TestAlertMerge/1 (0.00s)
    --- PASS: TestAlertMerge/2 (0.00s)
    --- PASS: TestAlertMerge/3 (0.00s)
    --- PASS: TestAlertMerge/4 (0.00s)
    --- PASS: TestAlertMerge/5 (0.00s)
    --- PASS: TestAlertMerge/6 (0.00s)
    --- PASS: TestAlertMerge/7 (0.00s)
=== RUN   TestValidateUTF8Ls
=== RUN   TestValidateUTF8Ls/valid_UTF-8_label_set
=== RUN   TestValidateUTF8Ls/invalid_UTF-8_label_set
--- PASS: TestValidateUTF8Ls (0.00s)
    --- PASS: TestValidateUTF8Ls/valid_UTF-8_label_set (0.00s)
    --- PASS: TestValidateUTF8Ls/invalid_UTF-8_label_set (0.00s)
=== RUN   TestCalcSilenceState
--- PASS: TestCalcSilenceState (0.00s)
=== RUN   TestSilenceExpired
--- PASS: TestSilenceExpired (0.00s)
=== RUN   TestAlertSliceSort
--- PASS: TestAlertSliceSort (0.00s)
=== RUN   TestNewMarkerRegistersMetrics
--- PASS: TestNewMarkerRegistersMetrics (0.00s)
PASS
ok  	github.com/prometheus/alertmanager/types	0.084s
?   	github.com/prometheus/alertmanager/ui	[no test files]
   debian/rules execute_after_dh_auto_test
make[1]: Entering directory '/build/reproducible-path/prometheus-alertmanager-0.28.1+ds'
# Don't abort if acceptance tests fail, as they are too sensitive to
# timing issues.
( for pkg in cli/acceptance with_api_v1/acceptance \
    with_api_v2/acceptance; do \
    DH_GOLANG_EXCLUDES= DH_GOPKG=github.com/prometheus/alertmanager/test/$pkg \
    dh_auto_test || { \
	echo "*** Acceptance tests failed ***"; \
	exit 1; \
	}; \
  done; ) || true
	cd _build && go test -vet=off -v -p 20 github.com/prometheus/alertmanager/test/cli/acceptance
=== RUN   TestAmtoolVersion
=== PAUSE TestAmtoolVersion
=== RUN   TestAddAlert
=== PAUSE TestAddAlert
=== RUN   TestQueryAlert
=== PAUSE TestQueryAlert
=== RUN   TestQuerySilence
=== PAUSE TestQuerySilence
=== RUN   TestRoutesShow
=== PAUSE TestRoutesShow
=== RUN   TestRoutesTest
=== PAUSE TestRoutesTest
=== CONT  TestAmtoolVersion
=== CONT  TestQuerySilence
=== CONT  TestQueryAlert
=== CONT  TestRoutesTest
=== CONT  TestRoutesShow
=== CONT  TestAddAlert
=== NAME  TestAmtoolVersion
    cli_test.go:43: testing amtool version: 0.28.1
--- PASS: TestAmtoolVersion (0.34s)
=== NAME  TestQuerySilence
    cli_test.go:173: 
        	Error Trace:	/build/reproducible-path/prometheus-alertmanager-0.28.1+ds/_build/src/github.com/prometheus/alertmanager/test/cli/acceptance/cli_test.go:173
        	Error:      	Received unexpected error:
        	            	starting alertmanager cluster: starting alertmanager failed: timeout
        	Test:       	TestQuerySilence
--- FAIL: TestQuerySilence (5.39s)
=== NAME  TestAddAlert
    acceptance.go:203: starting alertmanager cluster: starting alertmanager failed: timeout
    acceptance.go:194: Error sending SIGTERM to Alertmanager process: no such process
--- FAIL: TestAddAlert (5.39s)
=== NAME  TestRoutesShow
    cli_test.go:229: 
        	Error Trace:	/build/reproducible-path/prometheus-alertmanager-0.28.1+ds/_build/src/github.com/prometheus/alertmanager/test/cli/acceptance/cli_test.go:229
        	Error:      	Received unexpected error:
        	            	starting alertmanager cluster: starting alertmanager failed: timeout
        	Test:       	TestRoutesShow
--- FAIL: TestRoutesShow (5.40s)
=== NAME  TestQueryAlert
    cli_test.go:108: 
        	Error Trace:	/build/reproducible-path/prometheus-alertmanager-0.28.1+ds/_build/src/github.com/prometheus/alertmanager/test/cli/acceptance/cli_test.go:108
        	Error:      	Received unexpected error:
        	            	starting alertmanager cluster: starting alertmanager failed: timeout
        	Test:       	TestQueryAlert
--- FAIL: TestQueryAlert (5.41s)
=== NAME  TestRoutesTest
    cli_test.go:262: 
        	Error Trace:	/build/reproducible-path/prometheus-alertmanager-0.28.1+ds/_build/src/github.com/prometheus/alertmanager/test/cli/acceptance/cli_test.go:262
        	Error:      	Received unexpected error:
        	            	starting alertmanager cluster: starting alertmanager failed: timeout
        	Test:       	TestRoutesTest
--- FAIL: TestRoutesTest (5.40s)
FAIL
FAIL	github.com/prometheus/alertmanager/test/cli/acceptance	5.828s
FAIL
dh_auto_test: error: cd _build && go test -vet=off -v -p 20 github.com/prometheus/alertmanager/test/cli/acceptance returned exit code 1
*** Acceptance tests failed ***
make[1]: Leaving directory '/build/reproducible-path/prometheus-alertmanager-0.28.1+ds'
   create-stamp debian/debhelper-build-stamp
   dh_testroot -O--builddir=_build -O--buildsystem=golang
   dh_prep -O--builddir=_build -O--buildsystem=golang
   dh_installdirs -O--builddir=_build -O--buildsystem=golang
   dh_auto_install -O--builddir=_build -O--buildsystem=golang
	cd _build && mkdir -p /build/reproducible-path/prometheus-alertmanager-0.28.1\+ds/debian/tmp/usr
	cd _build && cp -r bin /build/reproducible-path/prometheus-alertmanager-0.28.1\+ds/debian/tmp/usr
   dh_install -O--builddir=_build -O--buildsystem=golang
   dh_installdocs -O--builddir=_build -O--buildsystem=golang
   dh_installchangelogs -O--builddir=_build -O--buildsystem=golang
   dh_installexamples -O--builddir=_build -O--buildsystem=golang
   debian/rules execute_before_dh_installman
make[1]: Entering directory '/build/reproducible-path/prometheus-alertmanager-0.28.1+ds'
_build/bin/prometheus-alertmanager --help-man > _build/prometheus-alertmanager.1
_build/bin/amtool --help-man > _build/amtool.1
# Fix title header and footers.
sed -i '/^.TH .*/c.TH PROMETHEUS-ALERTMANAGER "1" "March 2025" "prometheus-alertmanager 0.28.1+ds" "Prometheus"/' \
        _build/prometheus-alertmanager.1
sed -i '/^.TH .*/c.TH AMTOOL "1" "March 2025" "prometheus-alertmanager 0.28.1+ds" "Prometheus"/' \
        _build/amtool.1
# Remove build user/build date/go version headers, which is ugly.
sed -i '/^  /d' _build/*.1
# Fix whatis entries.
sed -i '/^.SH "NAME"/,+1c.SH "NAME"\nprometheus-alertmanager \\- the Prometheus alert manager' _build/prometheus-alertmanager.1
sed -i '/^.SH "NAME"/,+1c.SH "NAME"\namtool \\- Tooling for the Prometheus alert manager' _build/amtool.1
# Remove default values, as they create unwieldy long lines.
sed -i 's/\\fB--\(.*\)=".*"\\fR/\\fB--\1\\fR/' _build/*.1
# Fix executable path in amtool examples
sed -i 's/\.\/amtool/amtool/' _build/amtool.1
make[1]: Leaving directory '/build/reproducible-path/prometheus-alertmanager-0.28.1+ds'
   dh_installman -O--builddir=_build -O--buildsystem=golang
   dh_bash-completion -O--builddir=_build -O--buildsystem=golang
   dh_installinit -O--builddir=_build -O--buildsystem=golang
   dh_installsystemd -O--builddir=_build -O--buildsystem=golang
   dh_installsystemduser -O--builddir=_build -O--buildsystem=golang
   dh_installlogrotate -O--builddir=_build -O--buildsystem=golang
   dh_lintian -O--builddir=_build -O--buildsystem=golang
   dh_perl -O--builddir=_build -O--buildsystem=golang
   dh_link -O--builddir=_build -O--buildsystem=golang
   dh_strip_nondeterminism -O--builddir=_build -O--buildsystem=golang
   dh_compress -O--builddir=_build -O--buildsystem=golang
   dh_fixperms -O--builddir=_build -O--buildsystem=golang
   dh_missing -O--builddir=_build -O--buildsystem=golang
   dh_strip -a -O--builddir=_build -O--buildsystem=golang
   dh_makeshlibs -a -O--builddir=_build -O--buildsystem=golang
   dh_shlibdeps -a -O--builddir=_build -O--buildsystem=golang
   dh_installdeb -O--builddir=_build -O--buildsystem=golang
   dh_golang -O--builddir=_build -O--buildsystem=golang
   dh_gencontrol -O--builddir=_build -O--buildsystem=golang
   dh_md5sums -O--builddir=_build -O--buildsystem=golang
   dh_builddeb -O--builddir=_build -O--buildsystem=golang
dpkg-deb: building package 'prometheus-alertmanager' in '../prometheus-alertmanager_0.28.1+ds-1_amd64.deb'.
dpkg-deb: building package 'prometheus-alertmanager-dbgsym' in '../prometheus-alertmanager-dbgsym_0.28.1+ds-1_amd64.deb'.
dpkg-deb: building package 'golang-github-prometheus-alertmanager-dev' in '../golang-github-prometheus-alertmanager-dev_0.28.1+ds-1_all.deb'.
 dpkg-genbuildinfo --build=binary -O../prometheus-alertmanager_0.28.1+ds-1_amd64.buildinfo
 dpkg-genchanges --build=binary -O../prometheus-alertmanager_0.28.1+ds-1_amd64.changes
dpkg-genchanges: info: binary-only upload (no source code included)
 dpkg-source --after-build .
dpkg-buildpackage: info: binary-only upload (no source included)
dpkg-genchanges: info: including full source code in upload
I: copying local configuration
I: user script /srv/workspace/pbuilder/2508373/tmp/hooks/B01_cleanup starting
I: user script /srv/workspace/pbuilder/2508373/tmp/hooks/B01_cleanup finished
I: unmounting dev/ptmx filesystem
I: unmounting dev/pts filesystem
I: unmounting dev/shm filesystem
I: unmounting proc filesystem
I: unmounting sys filesystem
I: cleaning the build env 
I: removing directory /srv/workspace/pbuilder/2508373 and its subdirectories
I: Current time: Thu Mar 13 02:41:34 +14 2025
I: pbuilder-time-stamp: 1741783294