Diff of the two buildlogs:

--
--- b1/build.log	2025-03-05 18:08:18.282101406 +0000
+++ b2/build.log	2025-03-05 18:14:36.293021829 +0000
@@ -1,6 +1,6 @@
 I: pbuilder: network access will be disabled during build
-I: Current time: Wed Mar  5 05:59:53 -12 2025
-I: pbuilder-time-stamp: 1741197593
+I: Current time: Wed Apr  8 14:31:22 +14 2026
+I: pbuilder-time-stamp: 1775608282
 I: Building the build Environment
 I: extracting base tarball [/var/cache/pbuilder/unstable-reproducible-base.tgz]
 I: copying local configuration
@@ -23,54 +23,86 @@
 dpkg-source: info: unpacking tomcat-jakartaee-migration_1.0.9-1.debian.tar.xz
 I: using fakeroot in build.
 I: Installing the build-deps
-I: user script /srv/workspace/pbuilder/12012/tmp/hooks/D02_print_environment starting
+I: user script /srv/workspace/pbuilder/9211/tmp/hooks/D01_modify_environment starting
+debug: Running on ionos6-i386.
+I: Changing host+domainname to test build reproducibility
+I: Adding a custom variable just for the fun of it...
+I: Changing /bin/sh to bash
+'/bin/sh' -> '/bin/bash'
+lrwxrwxrwx 1 root root 9 Apr  8 00:31 /bin/sh -> /bin/bash
+I: Setting pbuilder2's login shell to /bin/bash
+I: Setting pbuilder2's GECOS to second user,second room,second work-phone,second home-phone,second other
+I: user script /srv/workspace/pbuilder/9211/tmp/hooks/D01_modify_environment finished
+I: user script /srv/workspace/pbuilder/9211/tmp/hooks/D02_print_environment starting
 I: set
-  BUILDDIR='/build/reproducible-path'
-  BUILDUSERGECOS='first user,first room,first work-phone,first home-phone,first other'
-  BUILDUSERNAME='pbuilder1'
-  BUILD_ARCH='i386'
-  DEBIAN_FRONTEND='noninteractive'
-  DEB_BUILD_OPTIONS='buildinfo=+all reproducible=+all parallel=11 '
-  DISTRIBUTION='unstable'
-  HOME='/root'
-  HOST_ARCH='i386'
+  BASH=/bin/sh
+  BASHOPTS=checkwinsize:cmdhist:complete_fullquote:extquote:force_fignore:globasciiranges:globskipdots:hostcomplete:interactive_comments:patsub_replacement:progcomp:promptvars:sourcepath
+  BASH_ALIASES=()
+  BASH_ARGC=()
+  BASH_ARGV=()
+  BASH_CMDS=()
+  BASH_LINENO=([0]="12" [1]="0")
+  BASH_LOADABLES_PATH=/usr/local/lib/bash:/usr/lib/bash:/opt/local/lib/bash:/usr/pkg/lib/bash:/opt/pkg/lib/bash:.
+  BASH_SOURCE=([0]="/tmp/hooks/D02_print_environment" [1]="/tmp/hooks/D02_print_environment")
+  BASH_VERSINFO=([0]="5" [1]="2" [2]="37" [3]="1" [4]="release" [5]="i686-pc-linux-gnu")
+  BASH_VERSION='5.2.37(1)-release'
+  BUILDDIR=/build/reproducible-path
+  BUILDUSERGECOS='second user,second room,second work-phone,second home-phone,second other'
+  BUILDUSERNAME=pbuilder2
+  BUILD_ARCH=i386
+  DEBIAN_FRONTEND=noninteractive
+  DEB_BUILD_OPTIONS='buildinfo=+all reproducible=+all parallel=21 '
+  DIRSTACK=()
+  DISTRIBUTION=unstable
+  EUID=0
+  FUNCNAME=([0]="Echo" [1]="main")
+  GROUPS=()
+  HOME=/root
+  HOSTNAME=i-capture-the-hostname
+  HOSTTYPE=i686
+  HOST_ARCH=i386
   IFS=' 	
   '
-  INVOCATION_ID='d18ea5a770f24f50a5b7ae1a3524d41b'
-  LANG='C'
-  LANGUAGE='en_US:en'
-  LC_ALL='C'
-  LD_LIBRARY_PATH='/usr/lib/libeatmydata'
-  LD_PRELOAD='libeatmydata.so'
-  MAIL='/var/mail/root'
-  OPTIND='1'
-  PATH='/usr/sbin:/usr/bin:/sbin:/bin:/usr/games'
-  PBCURRENTCOMMANDLINEOPERATION='build'
-  PBUILDER_OPERATION='build'
-  PBUILDER_PKGDATADIR='/usr/share/pbuilder'
-  PBUILDER_PKGLIBDIR='/usr/lib/pbuilder'
-  PBUILDER_SYSCONFDIR='/etc'
-  PPID='12012'
-  PS1='# '
-  PS2='> '
+  INVOCATION_ID=a2c3b512d5f44e7fb23c34f6368ceceb
+  LANG=C
+  LANGUAGE=de_CH:de
+  LC_ALL=C
+  LD_LIBRARY_PATH=/usr/lib/libeatmydata
+  LD_PRELOAD=libeatmydata.so
+  MACHTYPE=i686-pc-linux-gnu
+  MAIL=/var/mail/root
+  OPTERR=1
+  OPTIND=1
+  OSTYPE=linux-gnu
+  PATH=/usr/sbin:/usr/bin:/sbin:/bin:/usr/games:/i/capture/the/path
+  PBCURRENTCOMMANDLINEOPERATION=build
+  PBUILDER_OPERATION=build
+  PBUILDER_PKGDATADIR=/usr/share/pbuilder
+  PBUILDER_PKGLIBDIR=/usr/lib/pbuilder
+  PBUILDER_SYSCONFDIR=/etc
+  PIPESTATUS=([0]="0")
+  POSIXLY_CORRECT=y
+  PPID=9211
   PS4='+ '
-  PWD='/'
-  SHELL='/bin/bash'
-  SHLVL='2'
-  SUDO_COMMAND='/usr/bin/timeout -k 18.1h 18h /usr/bin/ionice -c 3 /usr/bin/nice /usr/sbin/pbuilder --build --configfile /srv/reproducible-results/rbuild-debian/r-b-build.15Y96GMc/pbuilderrc_NoBW --distribution unstable --hookdir /etc/pbuilder/first-build-hooks --debbuildopts -b --basetgz /var/cache/pbuilder/unstable-reproducible-base.tgz --buildresult /srv/reproducible-results/rbuild-debian/r-b-build.15Y96GMc/b1 --logfile b1/build.log tomcat-jakartaee-migration_1.0.9-1.dsc'
-  SUDO_GID='112'
-  SUDO_UID='107'
-  SUDO_USER='jenkins'
-  TERM='unknown'
-  TZ='/usr/share/zoneinfo/Etc/GMT+12'
-  USER='root'
-  _='/usr/bin/systemd-run'
-  http_proxy='http://46.16.76.132:3128'
+  PWD=/
+  SHELL=/bin/bash
+  SHELLOPTS=braceexpand:errexit:hashall:interactive-comments:posix
+  SHLVL=3
+  SUDO_COMMAND='/usr/bin/timeout -k 24.1h 24h /usr/bin/ionice -c 3 /usr/bin/nice -n 11 /usr/bin/unshare --uts -- /usr/sbin/pbuilder --build --configfile /srv/reproducible-results/rbuild-debian/r-b-build.15Y96GMc/pbuilderrc_hjNR --distribution unstable --hookdir /etc/pbuilder/rebuild-hooks --debbuildopts -b --basetgz /var/cache/pbuilder/unstable-reproducible-base.tgz --buildresult /srv/reproducible-results/rbuild-debian/r-b-build.15Y96GMc/b2 --logfile b2/build.log tomcat-jakartaee-migration_1.0.9-1.dsc'
+  SUDO_GID=112
+  SUDO_UID=107
+  SUDO_USER=jenkins
+  TERM=unknown
+  TZ=/usr/share/zoneinfo/Etc/GMT-14
+  UID=0
+  USER=root
+  _='I: set'
+  http_proxy=http://213.165.73.152:3128
 I: uname -a
-  Linux ionos2-i386 6.1.0-31-amd64 #1 SMP PREEMPT_DYNAMIC Debian 6.1.128-1 (2025-02-07) x86_64 GNU/Linux
+  Linux i-capture-the-hostname 6.1.0-31-amd64 #1 SMP PREEMPT_DYNAMIC Debian 6.1.128-1 (2025-02-07) x86_64 GNU/Linux
 I: ls -l /bin
-  lrwxrwxrwx 1 root root 7 Nov 22 14:40 /bin -> usr/bin
-I: user script /srv/workspace/pbuilder/12012/tmp/hooks/D02_print_environment finished
+  lrwxrwxrwx 1 root root 7 Mar  4  2025 /bin -> usr/bin
+I: user script /srv/workspace/pbuilder/9211/tmp/hooks/D02_print_environment finished
  -> Attempting to satisfy build-dependencies
  -> Creating pbuilder-satisfydepends-dummy package
 Package: pbuilder-satisfydepends-dummy
@@ -408,7 +440,7 @@
 Get: 286 http://deb.debian.org/debian unstable/main i386 maven-repo-helper all 1.11 [142 kB]
 Get: 287 http://deb.debian.org/debian unstable/main i386 unzip i386 6.0-28 [166 kB]
 Get: 288 http://deb.debian.org/debian unstable/main i386 maven-debian-helper all 2.6.7 [108 kB]
-Fetched 273 MB in 4s (74.1 MB/s)
+Fetched 273 MB in 3s (78.8 MB/s)
 Preconfiguring packages ...
 Selecting previously unselected package libsystemd-shared:i386.
 (Reading database ... 
(Reading database ... 5%
(Reading database ... 10%
(Reading database ... 15%
(Reading database ... 20%
(Reading database ... 25%
(Reading database ... 30%
(Reading database ... 35%
(Reading database ... 40%
(Reading database ... 45%
(Reading database ... 50%
(Reading database ... 55%
(Reading database ... 60%
(Reading database ... 65%
(Reading database ... 70%
(Reading database ... 75%
(Reading database ... 80%
(Reading database ... 85%
(Reading database ... 90%
(Reading database ... 95%
(Reading database ... 100%
(Reading database ... 19769 files and directories currently installed.)
@@ -1796,7 +1828,11 @@
 fakeroot is already the newest version (1.37-1).
 0 upgraded, 0 newly installed, 0 to remove and 0 not upgraded.
 I: Building the package
-I: Running cd /build/reproducible-path/tomcat-jakartaee-migration-1.0.9/ && env PATH="/usr/sbin:/usr/bin:/sbin:/bin:/usr/games" HOME="/nonexistent/first-build" dpkg-buildpackage -us -uc -b && env PATH="/usr/sbin:/usr/bin:/sbin:/bin:/usr/games" HOME="/nonexistent/first-build" dpkg-genchanges -S  > ../tomcat-jakartaee-migration_1.0.9-1_source.changes
+I: user script /srv/workspace/pbuilder/9211/tmp/hooks/A99_set_merged_usr starting
+Not re-configuring usrmerge for unstable
+I: user script /srv/workspace/pbuilder/9211/tmp/hooks/A99_set_merged_usr finished
+hostname: Name or service not known
+I: Running cd /build/reproducible-path/tomcat-jakartaee-migration-1.0.9/ && env PATH="/usr/sbin:/usr/bin:/sbin:/bin:/usr/games:/i/capture/the/path" HOME="/nonexistent/second-build" dpkg-buildpackage -us -uc -b && env PATH="/usr/sbin:/usr/bin:/sbin:/bin:/usr/games:/i/capture/the/path" HOME="/nonexistent/second-build" dpkg-genchanges -S  > ../tomcat-jakartaee-migration_1.0.9-1_source.changes
 dpkg-buildpackage: info: source package tomcat-jakartaee-migration
 dpkg-buildpackage: info: source version 1.0.9-1
 dpkg-buildpackage: info: source distribution unstable
@@ -1866,9 +1902,9 @@
 [INFO]      [copy] Copying 1 file to /build/reproducible-path/tomcat-jakartaee-migration-1.0.9/target/test-classes
 [INFO]      [copy] Copying 1 file to /build/reproducible-path/tomcat-jakartaee-migration-1.0.9/target/test-classes
 [INFO]      [copy] Copying 1 file to /build/reproducible-path/tomcat-jakartaee-migration-1.0.9/target/test-classes
+[INFO]   [signjar] Signing JAR: /build/reproducible-path/tomcat-jakartaee-migration-1.0.9/target/test-classes/hellocgi-signed-dsa.jar to /build/reproducible-path/tomcat-jakartaee-migration-1.0.9/target/test-classes/hellocgi-signed-dsa.jar as dsa
 [INFO]   [signjar] Signing JAR: /build/reproducible-path/tomcat-jakartaee-migration-1.0.9/target/test-classes/hellocgi-signed-rsa.jar to /build/reproducible-path/tomcat-jakartaee-migration-1.0.9/target/test-classes/hellocgi-signed-rsa.jar as rsa
 [INFO]   [signjar] Signing JAR: /build/reproducible-path/tomcat-jakartaee-migration-1.0.9/target/test-classes/hellocgi-signed-ec.jar to /build/reproducible-path/tomcat-jakartaee-migration-1.0.9/target/test-classes/hellocgi-signed-ec.jar as ec
-[INFO]   [signjar] Signing JAR: /build/reproducible-path/tomcat-jakartaee-migration-1.0.9/target/test-classes/hellocgi-signed-dsa.jar to /build/reproducible-path/tomcat-jakartaee-migration-1.0.9/target/test-classes/hellocgi-signed-dsa.jar as dsa
 [INFO]   [signjar] jar signed.
 [INFO]   [signjar] 
 [INFO]   [signjar] Warning: 
@@ -1879,12 +1915,12 @@
 [INFO]   [signjar] 
 [INFO]   [signjar] Warning: 
 [INFO]   [signjar] The signer's certificate is self-signed.
+[INFO]   [signjar] The RSA signing key has a keysize of 1024 which is considered a security risk. This key size will be disabled in a future update.
 [INFO]   [signjar] POSIX file permission and/or symlink attributes detected. These attributes are ignored when signing and are not protected by the signature.
 [INFO]   [signjar] jar signed.
 [INFO]   [signjar] 
 [INFO]   [signjar] Warning: 
 [INFO]   [signjar] The signer's certificate is self-signed.
-[INFO]   [signjar] The RSA signing key has a keysize of 1024 which is considered a security risk. This key size will be disabled in a future update.
 [INFO]   [signjar] POSIX file permission and/or symlink attributes detected. These attributes are ignored when signing and are not protected by the signature.
 [INFO] Executed tasks
 [INFO] 
@@ -1915,8 +1951,8 @@
 [INFO] ------------------------------------------------------------------------
 [INFO] BUILD SUCCESS
 [INFO] ------------------------------------------------------------------------
-[INFO] Total time:  16.467 s
-[INFO] Finished at: 2025-03-05T18:02:27Z
+[INFO] Total time:  6.207 s
+[INFO] Finished at: 2026-04-08T00:32:18Z
 [INFO] ------------------------------------------------------------------------
 mv target/jakartaee-migration-*-shaded.jar target/jakartaee-migration-shaded.jar
 make[1]: Leaving directory '/build/reproducible-path/tomcat-jakartaee-migration-1.0.9'
@@ -1956,18 +1992,18 @@
 [INFO]   [signjar] 
 [INFO]   [signjar] Warning: 
 [INFO]   [signjar] The signer's certificate is self-signed.
+[INFO]   [signjar] The DSA signing key has a keysize of 1024 which is considered a security risk. This key size will be disabled in a future update.
 [INFO]   [signjar] POSIX file permission and/or symlink attributes detected. These attributes are ignored when signing and are not protected by the signature.
 [INFO]   [signjar] jar signed.
 [INFO]   [signjar] 
 [INFO]   [signjar] Warning: 
 [INFO]   [signjar] The signer's certificate is self-signed.
-[INFO]   [signjar] The DSA signing key has a keysize of 1024 which is considered a security risk. This key size will be disabled in a future update.
+[INFO]   [signjar] The RSA signing key has a keysize of 1024 which is considered a security risk. This key size will be disabled in a future update.
 [INFO]   [signjar] POSIX file permission and/or symlink attributes detected. These attributes are ignored when signing and are not protected by the signature.
 [INFO]   [signjar] jar signed.
 [INFO]   [signjar] 
 [INFO]   [signjar] Warning: 
 [INFO]   [signjar] The signer's certificate is self-signed.
-[INFO]   [signjar] The RSA signing key has a keysize of 1024 which is considered a security risk. This key size will be disabled in a future update.
 [INFO]   [signjar] POSIX file permission and/or symlink attributes detected. These attributes are ignored when signing and are not protected by the signature.
 [INFO] Executed tasks
 [INFO] 
@@ -1976,88 +2012,102 @@
 [INFO] -------------------------------------------------------
 [INFO]  T E S T S
 [INFO] -------------------------------------------------------
+[INFO] Running org.apache.tomcat.jakartaee.EESpecProfileTest
+[INFO] Tests run: 3, Failures: 0, Errors: 0, Skipped: 0, Time elapsed: 0.042 s - in org.apache.tomcat.jakartaee.EESpecProfileTest
+[INFO] Running org.apache.tomcat.jakartaee.GlobMatcherTest
+[INFO] Tests run: 8, Failures: 0, Errors: 0, Skipped: 0, Time elapsed: 0.054 s - in org.apache.tomcat.jakartaee.GlobMatcherTest
+[INFO] Running org.apache.tomcat.jakartaee.TextConverterTest
+[INFO] Tests run: 1, Failures: 0, Errors: 0, Skipped: 0, Time elapsed: 0.065 s - in org.apache.tomcat.jakartaee.TextConverterTest
+[INFO] Running org.apache.tomcat.jakartaee.MigrationTaskTest
+
+invalid-profile:
+
+migrate-single-source-file:
+[javax2jakarta] Performing migration from source [/build/reproducible-path/tomcat-jakartaee-migration-1.0.9/target/test-classes/HelloServlet.java] to destination [/build/reproducible-path/tomcat-jakartaee-migration-1.0.9/target/test-classes/HelloServlet.migrated-by-ant.java] with Jakarta EE specification profile [TOMCAT]
+[javax2jakarta] Migration completed successfully in [1] milliseconds
+[INFO] Tests run: 2, Failures: 0, Errors: 0, Skipped: 0, Time elapsed: 0.451 s - in org.apache.tomcat.jakartaee.MigrationTaskTest
 [INFO] Running org.apache.tomcat.jakartaee.MigrationTest
-Mar 05, 2025 6:02:41 PM org.apache.tomcat.jakartaee.Migration execute
+Apr 08, 2026 12:34:25 AM org.apache.tomcat.jakartaee.Migration execute
 INFO: Performing migration from source [/build/reproducible-path/tomcat-jakartaee-migration-1.0.9/target/test-classes/hellocgi-signed-dsa.jar] to destination [/build/reproducible-path/tomcat-jakartaee-migration-1.0.9/target/test-classes/hellocgi-signed-dsa.jar] with Jakarta EE specification profile [TOMCAT]
-Mar 05, 2025 6:02:41 PM org.apache.tomcat.jakartaee.Migration migrateStream
+Apr 08, 2026 12:34:25 AM org.apache.tomcat.jakartaee.Migration migrateStream
 INFO: Migration starting for archive [/build/reproducible-path/tomcat-jakartaee-migration-1.0.9/target/test-classes/hellocgi-signed-dsa.jar] using streaming
-Mar 05, 2025 6:02:41 PM org.apache.tomcat.jakartaee.Migration migrateArchiveStreaming
+Apr 08, 2026 12:34:25 AM org.apache.tomcat.jakartaee.Migration migrateArchiveStreaming
 WARNING: Drop cryptographic signature file [META-INF/DSA.SF]
-Mar 05, 2025 6:02:41 PM org.apache.tomcat.jakartaee.Migration migrateArchiveStreaming
+Apr 08, 2026 12:34:25 AM org.apache.tomcat.jakartaee.Migration migrateArchiveStreaming
 WARNING: Drop cryptographic signature file [META-INF/DSA.DSA]
-Mar 05, 2025 6:02:41 PM org.apache.tomcat.jakartaee.Migration migrateStream
+Apr 08, 2026 12:34:25 AM org.apache.tomcat.jakartaee.Migration migrateStream
 INFO: Migration finished for archive [/build/reproducible-path/tomcat-jakartaee-migration-1.0.9/target/test-classes/hellocgi-signed-dsa.jar]
-Mar 05, 2025 6:02:41 PM org.apache.tomcat.jakartaee.Migration execute
-INFO: Migration completed successfully in [372] milliseconds
-Mar 05, 2025 6:02:41 PM org.apache.tomcat.jakartaee.Migration execute
+Apr 08, 2026 12:34:25 AM org.apache.tomcat.jakartaee.Migration execute
+INFO: Migration completed successfully in [110] milliseconds
+Apr 08, 2026 12:34:25 AM org.apache.tomcat.jakartaee.Migration execute
 INFO: Performing migration from source [/build/reproducible-path/tomcat-jakartaee-migration-1.0.9/target/test-classes/hellocgi-signed-rsa.jar] to destination [/build/reproducible-path/tomcat-jakartaee-migration-1.0.9/target/test-classes/hellocgi-signed-rsa.jar] with Jakarta EE specification profile [TOMCAT]
-Mar 05, 2025 6:02:41 PM org.apache.tomcat.jakartaee.Migration migrateStream
+Apr 08, 2026 12:34:25 AM org.apache.tomcat.jakartaee.Migration migrateStream
 INFO: Migration starting for archive [/build/reproducible-path/tomcat-jakartaee-migration-1.0.9/target/test-classes/hellocgi-signed-rsa.jar] using streaming
-Mar 05, 2025 6:02:41 PM org.apache.tomcat.jakartaee.Migration migrateArchiveStreaming
+Apr 08, 2026 12:34:25 AM org.apache.tomcat.jakartaee.Migration migrateArchiveStreaming
 WARNING: Drop cryptographic signature file [META-INF/RSA.SF]
-Mar 05, 2025 6:02:41 PM org.apache.tomcat.jakartaee.Migration migrateArchiveStreaming
+Apr 08, 2026 12:34:25 AM org.apache.tomcat.jakartaee.Migration migrateArchiveStreaming
 WARNING: Drop cryptographic signature file [META-INF/RSA.RSA]
-Mar 05, 2025 6:02:41 PM org.apache.tomcat.jakartaee.Migration migrateStream
+Apr 08, 2026 12:34:25 AM org.apache.tomcat.jakartaee.Migration migrateStream
 INFO: Migration finished for archive [/build/reproducible-path/tomcat-jakartaee-migration-1.0.9/target/test-classes/hellocgi-signed-rsa.jar]
-Mar 05, 2025 6:02:41 PM org.apache.tomcat.jakartaee.Migration execute
-INFO: Migration completed successfully in [27] milliseconds
-Mar 05, 2025 6:02:41 PM org.apache.tomcat.jakartaee.Migration execute
+Apr 08, 2026 12:34:25 AM org.apache.tomcat.jakartaee.Migration execute
+INFO: Migration completed successfully in [8] milliseconds
+Apr 08, 2026 12:34:25 AM org.apache.tomcat.jakartaee.Migration execute
 INFO: Performing migration from source [/build/reproducible-path/tomcat-jakartaee-migration-1.0.9/src/test/resources] to destination [/build/reproducible-path/tomcat-jakartaee-migration-1.0.9/target/test-classes/migration-ee] with Jakarta EE specification profile [EE]
-Mar 05, 2025 6:02:41 PM org.apache.tomcat.jakartaee.Migration execute
-INFO: Migration completed successfully in [2] milliseconds
-Mar 05, 2025 6:02:41 PM org.apache.tomcat.jakartaee.Migration execute
+Apr 08, 2026 12:34:25 AM org.apache.tomcat.jakartaee.Migration execute
+INFO: Migration completed successfully in [1] milliseconds
+Apr 08, 2026 12:34:25 AM org.apache.tomcat.jakartaee.Migration execute
 INFO: Performing migration from source [/build/reproducible-path/tomcat-jakartaee-migration-1.0.9/target/test-classes/hellocgi.jar] to destination [/build/reproducible-path/tomcat-jakartaee-migration-1.0.9/target/test-classes/hellocgi-target.jar] with Jakarta EE specification profile [TOMCAT]
-Mar 05, 2025 6:02:41 PM org.apache.tomcat.jakartaee.Migration migrateStream
+Apr 08, 2026 12:34:25 AM org.apache.tomcat.jakartaee.Migration migrateStream
 INFO: Migration starting for archive [/build/reproducible-path/tomcat-jakartaee-migration-1.0.9/target/test-classes/hellocgi.jar] using in memory copy
-Mar 05, 2025 6:02:41 PM org.apache.tomcat.jakartaee.Migration migrateStream
+Apr 08, 2026 12:34:25 AM org.apache.tomcat.jakartaee.Migration migrateStream
 INFO: Migration finished for archive [/build/reproducible-path/tomcat-jakartaee-migration-1.0.9/target/test-classes/hellocgi.jar]
-Mar 05, 2025 6:02:41 PM org.apache.tomcat.jakartaee.Migration execute
-INFO: Migration completed successfully in [41] milliseconds
-Mar 05, 2025 6:02:41 PM org.apache.tomcat.jakartaee.Migration execute
+Apr 08, 2026 12:34:25 AM org.apache.tomcat.jakartaee.Migration execute
+INFO: Migration completed successfully in [20] milliseconds
+Apr 08, 2026 12:34:25 AM org.apache.tomcat.jakartaee.Migration execute
 INFO: Performing migration from source [/build/reproducible-path/tomcat-jakartaee-migration-1.0.9/target/test-classes/hellocgi-signed-ec.jar] to destination [/build/reproducible-path/tomcat-jakartaee-migration-1.0.9/target/test-classes/hellocgi-signed-ec.jar] with Jakarta EE specification profile [TOMCAT]
-Mar 05, 2025 6:02:41 PM org.apache.tomcat.jakartaee.Migration migrateStream
+Apr 08, 2026 12:34:25 AM org.apache.tomcat.jakartaee.Migration migrateStream
 INFO: Migration starting for archive [/build/reproducible-path/tomcat-jakartaee-migration-1.0.9/target/test-classes/hellocgi-signed-ec.jar] using streaming
-Mar 05, 2025 6:02:41 PM org.apache.tomcat.jakartaee.Migration migrateArchiveStreaming
+Apr 08, 2026 12:34:25 AM org.apache.tomcat.jakartaee.Migration migrateArchiveStreaming
 WARNING: Drop cryptographic signature file [META-INF/EC.SF]
-Mar 05, 2025 6:02:41 PM org.apache.tomcat.jakartaee.Migration migrateArchiveStreaming
+Apr 08, 2026 12:34:25 AM org.apache.tomcat.jakartaee.Migration migrateArchiveStreaming
 WARNING: Drop cryptographic signature file [META-INF/EC.EC]
-Mar 05, 2025 6:02:41 PM org.apache.tomcat.jakartaee.Migration migrateStream
+Apr 08, 2026 12:34:25 AM org.apache.tomcat.jakartaee.Migration migrateStream
 INFO: Migration finished for archive [/build/reproducible-path/tomcat-jakartaee-migration-1.0.9/target/test-classes/hellocgi-signed-ec.jar]
-Mar 05, 2025 6:02:41 PM org.apache.tomcat.jakartaee.Migration execute
-INFO: Migration completed successfully in [17] milliseconds
-Mar 05, 2025 6:02:41 PM org.apache.tomcat.jakartaee.Migration execute
+Apr 08, 2026 12:34:25 AM org.apache.tomcat.jakartaee.Migration execute
+INFO: Migration completed successfully in [6] milliseconds
+Apr 08, 2026 12:34:25 AM org.apache.tomcat.jakartaee.Migration execute
 INFO: Performing migration from source [/build/reproducible-path/tomcat-jakartaee-migration-1.0.9/src/test/resources] to destination [/build/reproducible-path/tomcat-jakartaee-migration-1.0.9/target/test-classes/migration] with Jakarta EE specification profile [TOMCAT]
-Mar 05, 2025 6:02:41 PM org.apache.tomcat.jakartaee.Migration execute
-INFO: Migration completed successfully in [1] milliseconds
-Mar 05, 2025 6:02:41 PM org.apache.tomcat.jakartaee.Migration execute
+Apr 08, 2026 12:34:25 AM org.apache.tomcat.jakartaee.Migration execute
+INFO: Migration completed successfully in [0] milliseconds
+Apr 08, 2026 12:34:25 AM org.apache.tomcat.jakartaee.Migration execute
 INFO: Performing migration from source [/build/reproducible-path/tomcat-jakartaee-migration-1.0.9/target/test-classes/hellocgi.jar] to destination [/build/reproducible-path/tomcat-jakartaee-migration-1.0.9/target/test-classes/hellocgi-target.jar] with Jakarta EE specification profile [TOMCAT]
-Mar 05, 2025 6:02:41 PM org.apache.tomcat.jakartaee.Migration migrateStream
+Apr 08, 2026 12:34:25 AM org.apache.tomcat.jakartaee.Migration migrateStream
 INFO: Migration starting for archive [/build/reproducible-path/tomcat-jakartaee-migration-1.0.9/target/test-classes/hellocgi.jar] using streaming
-Mar 05, 2025 6:02:41 PM org.apache.tomcat.jakartaee.Migration migrateStream
+Apr 08, 2026 12:34:25 AM org.apache.tomcat.jakartaee.Migration migrateStream
 INFO: Migration finished for archive [/build/reproducible-path/tomcat-jakartaee-migration-1.0.9/target/test-classes/hellocgi.jar]
-Mar 05, 2025 6:02:41 PM org.apache.tomcat.jakartaee.Migration execute
-INFO: Migration completed successfully in [12] milliseconds
-Mar 05, 2025 6:02:41 PM org.apache.tomcat.jakartaee.Migration execute
+Apr 08, 2026 12:34:25 AM org.apache.tomcat.jakartaee.Migration execute
+INFO: Migration completed successfully in [4] milliseconds
+Apr 08, 2026 12:34:25 AM org.apache.tomcat.jakartaee.Migration execute
 INFO: Performing migration from source [/build/reproducible-path/tomcat-jakartaee-migration-1.0.9/target/test-classes/HelloServlet.inplace.java] to destination [/build/reproducible-path/tomcat-jakartaee-migration-1.0.9/target/test-classes/HelloServlet.inplace.java] with Jakarta EE specification profile [EE]
-Mar 05, 2025 6:02:41 PM org.apache.tomcat.jakartaee.Migration execute
+Apr 08, 2026 12:34:25 AM org.apache.tomcat.jakartaee.Migration execute
 INFO: Migration completed successfully in [0] milliseconds
-Mar 05, 2025 6:02:41 PM org.apache.tomcat.jakartaee.Migration execute
+Apr 08, 2026 12:34:25 AM org.apache.tomcat.jakartaee.Migration execute
 INFO: Performing migration from source [/build/reproducible-path/tomcat-jakartaee-migration-1.0.9/target/test-classes/org/apache/tomcat/jakartaee/HelloCGI.class] to destination [/build/reproducible-path/tomcat-jakartaee-migration-1.0.9/target/test-classes/org/apache/tomcat/jakartaee/HelloCGI.class] with Jakarta EE specification profile [TOMCAT]
-Mar 05, 2025 6:02:41 PM org.apache.tomcat.jakartaee.Migration execute
-INFO: Migration completed successfully in [1] milliseconds
-Mar 05, 2025 6:02:41 PM org.apache.tomcat.jakartaee.Migration execute
+Apr 08, 2026 12:34:25 AM org.apache.tomcat.jakartaee.Migration execute
+INFO: Migration completed successfully in [0] milliseconds
+Apr 08, 2026 12:34:25 AM org.apache.tomcat.jakartaee.Migration execute
 INFO: Performing migration from source [/build/reproducible-path/tomcat-jakartaee-migration-1.0.9/target/test-classes/HelloServlet.java] to destination [/build/reproducible-path/tomcat-jakartaee-migration-1.0.9/target/test-classes/HelloServlet.migrated.java] with Jakarta EE specification profile [TOMCAT]
-Mar 05, 2025 6:02:41 PM org.apache.tomcat.jakartaee.Migration execute
+Apr 08, 2026 12:34:25 AM org.apache.tomcat.jakartaee.Migration execute
 INFO: Migration completed successfully in [0] milliseconds
-Mar 05, 2025 6:02:41 PM org.apache.tomcat.jakartaee.Migration execute
+Apr 08, 2026 12:34:25 AM org.apache.tomcat.jakartaee.Migration execute
 INFO: Performing migration from source [/build/reproducible-path/tomcat-jakartaee-migration-1.0.9/target/test-classes/HelloServlet.java] to destination [/build/reproducible-path/tomcat-jakartaee-migration-1.0.9/target/test-classes/HelloServlet.migrated.java] with Jakarta EE specification profile [EE]
-Mar 05, 2025 6:02:41 PM org.apache.tomcat.jakartaee.TextConverter convert
+Apr 08, 2026 12:34:25 AM org.apache.tomcat.jakartaee.TextConverter convert
 FINE: Migrated text file [/build/reproducible-path/tomcat-jakartaee-migration-1.0.9/target/test-classes/HelloServlet.java]
-Mar 05, 2025 6:02:41 PM org.apache.tomcat.jakartaee.Migration execute
-INFO: Migration completed successfully in [1] milliseconds
-[WARNING] Tests run: 14, Failures: 0, Errors: 0, Skipped: 2, Time elapsed: 1.007 s - in org.apache.tomcat.jakartaee.MigrationTest
-Mar 05, 2025 6:02:42 PM java.lang.ProcessBuilder start
-FINE: ProcessBuilder.start(): pid: 23155, dir: null, cmd: "/bin/sh"
+Apr 08, 2026 12:34:25 AM org.apache.tomcat.jakartaee.Migration execute
+INFO: Migration completed successfully in [0] milliseconds
+[WARNING] Tests run: 14, Failures: 0, Errors: 0, Skipped: 2, Time elapsed: 0.358 s - in org.apache.tomcat.jakartaee.MigrationTest
+Apr 08, 2026 12:34:26 AM java.lang.ProcessBuilder start
+FINE: ProcessBuilder.start(): pid: 33316, dir: null, cmd: "/bin/sh"
 java.lang.RuntimeException: ProcessBuilder.start() debug
 	at java.base/java.lang.ProcessBuilder.start(ProcessBuilder.java:1147)
 	at java.base/java.lang.ProcessBuilder.start(ProcessBuilder.java:1089)
@@ -2072,8 +2122,8 @@
 	at java.base/java.util.concurrent.ThreadPoolExecutor$Worker.run(ThreadPoolExecutor.java:642)
 	at java.base/java.lang.Thread.run(Thread.java:1583)
 
-Mar 05, 2025 6:02:43 PM java.lang.ProcessBuilder start
-FINE: ProcessBuilder.start(): pid: 23157, dir: null, cmd: "/bin/sh"
+Apr 08, 2026 12:34:27 AM java.lang.ProcessBuilder start
+FINE: ProcessBuilder.start(): pid: 33324, dir: null, cmd: "/bin/sh"
 java.lang.RuntimeException: ProcessBuilder.start() debug
 	at java.base/java.lang.ProcessBuilder.start(ProcessBuilder.java:1147)
 	at java.base/java.lang.ProcessBuilder.start(ProcessBuilder.java:1089)
@@ -2088,8 +2138,8 @@
 	at java.base/java.util.concurrent.ThreadPoolExecutor$Worker.run(ThreadPoolExecutor.java:642)
 	at java.base/java.lang.Thread.run(Thread.java:1583)
 
-Mar 05, 2025 6:02:44 PM java.lang.ProcessBuilder start
-FINE: ProcessBuilder.start(): pid: 23159, dir: null, cmd: "/bin/sh"
+Apr 08, 2026 12:34:28 AM java.lang.ProcessBuilder start
+FINE: ProcessBuilder.start(): pid: 33332, dir: null, cmd: "/bin/sh"
 java.lang.RuntimeException: ProcessBuilder.start() debug
 	at java.base/java.lang.ProcessBuilder.start(ProcessBuilder.java:1147)
 	at java.base/java.lang.ProcessBuilder.start(ProcessBuilder.java:1089)
@@ -2104,8 +2154,8 @@
 	at java.base/java.util.concurrent.ThreadPoolExecutor$Worker.run(ThreadPoolExecutor.java:642)
 	at java.base/java.lang.Thread.run(Thread.java:1583)
 
-Mar 05, 2025 6:02:45 PM java.lang.ProcessBuilder start
-FINE: ProcessBuilder.start(): pid: 23163, dir: null, cmd: "/bin/sh"
+Apr 08, 2026 12:34:29 AM java.lang.ProcessBuilder start
+FINE: ProcessBuilder.start(): pid: 33340, dir: null, cmd: "/bin/sh"
 java.lang.RuntimeException: ProcessBuilder.start() debug
 	at java.base/java.lang.ProcessBuilder.start(ProcessBuilder.java:1147)
 	at java.base/java.lang.ProcessBuilder.start(ProcessBuilder.java:1089)
@@ -2120,8 +2170,8 @@
 	at java.base/java.util.concurrent.ThreadPoolExecutor$Worker.run(ThreadPoolExecutor.java:642)
 	at java.base/java.lang.Thread.run(Thread.java:1583)
 
-Mar 05, 2025 6:02:46 PM java.lang.ProcessBuilder start
-FINE: ProcessBuilder.start(): pid: 23169, dir: null, cmd: "/bin/sh"
+Apr 08, 2026 12:34:30 AM java.lang.ProcessBuilder start
+FINE: ProcessBuilder.start(): pid: 33347, dir: null, cmd: "/bin/sh"
 java.lang.RuntimeException: ProcessBuilder.start() debug
 	at java.base/java.lang.ProcessBuilder.start(ProcessBuilder.java:1147)
 	at java.base/java.lang.ProcessBuilder.start(ProcessBuilder.java:1089)
@@ -2136,8 +2186,8 @@
 	at java.base/java.util.concurrent.ThreadPoolExecutor$Worker.run(ThreadPoolExecutor.java:642)
 	at java.base/java.lang.Thread.run(Thread.java:1583)
 
-Mar 05, 2025 6:02:47 PM java.lang.ProcessBuilder start
-FINE: ProcessBuilder.start(): pid: 23171, dir: null, cmd: "/bin/sh"
+Apr 08, 2026 12:34:31 AM java.lang.ProcessBuilder start
+FINE: ProcessBuilder.start(): pid: 33356, dir: null, cmd: "/bin/sh"
 java.lang.RuntimeException: ProcessBuilder.start() debug
 	at java.base/java.lang.ProcessBuilder.start(ProcessBuilder.java:1147)
 	at java.base/java.lang.ProcessBuilder.start(ProcessBuilder.java:1089)
@@ -2152,8 +2202,8 @@
 	at java.base/java.util.concurrent.ThreadPoolExecutor$Worker.run(ThreadPoolExecutor.java:642)
 	at java.base/java.lang.Thread.run(Thread.java:1583)
 
-Mar 05, 2025 6:02:49 PM java.lang.ProcessBuilder start
-FINE: ProcessBuilder.start(): pid: 23185, dir: null, cmd: "/bin/sh"
+Apr 08, 2026 12:34:32 AM java.lang.ProcessBuilder start
+FINE: ProcessBuilder.start(): pid: 33363, dir: null, cmd: "/bin/sh"
 java.lang.RuntimeException: ProcessBuilder.start() debug
 	at java.base/java.lang.ProcessBuilder.start(ProcessBuilder.java:1147)
 	at java.base/java.lang.ProcessBuilder.start(ProcessBuilder.java:1089)
@@ -2168,8 +2218,8 @@
 	at java.base/java.util.concurrent.ThreadPoolExecutor$Worker.run(ThreadPoolExecutor.java:642)
 	at java.base/java.lang.Thread.run(Thread.java:1583)
 
-Mar 05, 2025 6:02:50 PM java.lang.ProcessBuilder start
-FINE: ProcessBuilder.start(): pid: 23187, dir: null, cmd: "/bin/sh"
+Apr 08, 2026 12:34:33 AM java.lang.ProcessBuilder start
+FINE: ProcessBuilder.start(): pid: 33370, dir: null, cmd: "/bin/sh"
 java.lang.RuntimeException: ProcessBuilder.start() debug
 	at java.base/java.lang.ProcessBuilder.start(ProcessBuilder.java:1147)
 	at java.base/java.lang.ProcessBuilder.start(ProcessBuilder.java:1089)
@@ -2184,8 +2234,8 @@
 	at java.base/java.util.concurrent.ThreadPoolExecutor$Worker.run(ThreadPoolExecutor.java:642)
 	at java.base/java.lang.Thread.run(Thread.java:1583)
 
-Mar 05, 2025 6:02:51 PM java.lang.ProcessBuilder start
-FINE: ProcessBuilder.start(): pid: 23189, dir: null, cmd: "/bin/sh"
+Apr 08, 2026 12:34:34 AM java.lang.ProcessBuilder start
+FINE: ProcessBuilder.start(): pid: 33377, dir: null, cmd: "/bin/sh"
 java.lang.RuntimeException: ProcessBuilder.start() debug
 	at java.base/java.lang.ProcessBuilder.start(ProcessBuilder.java:1147)
 	at java.base/java.lang.ProcessBuilder.start(ProcessBuilder.java:1089)
@@ -2200,8 +2250,8 @@
 	at java.base/java.util.concurrent.ThreadPoolExecutor$Worker.run(ThreadPoolExecutor.java:642)
 	at java.base/java.lang.Thread.run(Thread.java:1583)
 
-Mar 05, 2025 6:02:52 PM java.lang.ProcessBuilder start
-FINE: ProcessBuilder.start(): pid: 23193, dir: null, cmd: "/bin/sh"
+Apr 08, 2026 12:34:35 AM java.lang.ProcessBuilder start
+FINE: ProcessBuilder.start(): pid: 33384, dir: null, cmd: "/bin/sh"
 java.lang.RuntimeException: ProcessBuilder.start() debug
 	at java.base/java.lang.ProcessBuilder.start(ProcessBuilder.java:1147)
 	at java.base/java.lang.ProcessBuilder.start(ProcessBuilder.java:1089)
@@ -2216,8 +2266,8 @@
 	at java.base/java.util.concurrent.ThreadPoolExecutor$Worker.run(ThreadPoolExecutor.java:642)
 	at java.base/java.lang.Thread.run(Thread.java:1583)
 
-Mar 05, 2025 6:02:53 PM java.lang.ProcessBuilder start
-FINE: ProcessBuilder.start(): pid: 23219, dir: null, cmd: "/bin/sh"
+Apr 08, 2026 12:34:36 AM java.lang.ProcessBuilder start
+FINE: ProcessBuilder.start(): pid: 33391, dir: null, cmd: "/bin/sh"
 java.lang.RuntimeException: ProcessBuilder.start() debug
 	at java.base/java.lang.ProcessBuilder.start(ProcessBuilder.java:1147)
 	at java.base/java.lang.ProcessBuilder.start(ProcessBuilder.java:1089)
@@ -2232,8 +2282,8 @@
 	at java.base/java.util.concurrent.ThreadPoolExecutor$Worker.run(ThreadPoolExecutor.java:642)
 	at java.base/java.lang.Thread.run(Thread.java:1583)
 
-Mar 05, 2025 6:02:54 PM java.lang.ProcessBuilder start
-FINE: ProcessBuilder.start(): pid: 23302, dir: null, cmd: "/bin/sh"
+Apr 08, 2026 12:34:37 AM java.lang.ProcessBuilder start
+FINE: ProcessBuilder.start(): pid: 33398, dir: null, cmd: "/bin/sh"
 java.lang.RuntimeException: ProcessBuilder.start() debug
 	at java.base/java.lang.ProcessBuilder.start(ProcessBuilder.java:1147)
 	at java.base/java.lang.ProcessBuilder.start(ProcessBuilder.java:1089)
@@ -2248,8 +2298,8 @@
 	at java.base/java.util.concurrent.ThreadPoolExecutor$Worker.run(ThreadPoolExecutor.java:642)
 	at java.base/java.lang.Thread.run(Thread.java:1583)
 
-Mar 05, 2025 6:02:55 PM java.lang.ProcessBuilder start
-FINE: ProcessBuilder.start(): pid: 23306, dir: null, cmd: "/bin/sh"
+Apr 08, 2026 12:34:38 AM java.lang.ProcessBuilder start
+FINE: ProcessBuilder.start(): pid: 33405, dir: null, cmd: "/bin/sh"
 java.lang.RuntimeException: ProcessBuilder.start() debug
 	at java.base/java.lang.ProcessBuilder.start(ProcessBuilder.java:1147)
 	at java.base/java.lang.ProcessBuilder.start(ProcessBuilder.java:1089)
@@ -2264,8 +2314,8 @@
 	at java.base/java.util.concurrent.ThreadPoolExecutor$Worker.run(ThreadPoolExecutor.java:642)
 	at java.base/java.lang.Thread.run(Thread.java:1583)
 
-Mar 05, 2025 6:02:56 PM java.lang.ProcessBuilder start
-FINE: ProcessBuilder.start(): pid: 23308, dir: null, cmd: "/bin/sh"
+Apr 08, 2026 12:34:39 AM java.lang.ProcessBuilder start
+FINE: ProcessBuilder.start(): pid: 33413, dir: null, cmd: "/bin/sh"
 java.lang.RuntimeException: ProcessBuilder.start() debug
 	at java.base/java.lang.ProcessBuilder.start(ProcessBuilder.java:1147)
 	at java.base/java.lang.ProcessBuilder.start(ProcessBuilder.java:1089)
@@ -2280,8 +2330,8 @@
 	at java.base/java.util.concurrent.ThreadPoolExecutor$Worker.run(ThreadPoolExecutor.java:642)
 	at java.base/java.lang.Thread.run(Thread.java:1583)
 
-Mar 05, 2025 6:02:57 PM java.lang.ProcessBuilder start
-FINE: ProcessBuilder.start(): pid: 23352, dir: null, cmd: "/bin/sh"
+Apr 08, 2026 12:34:40 AM java.lang.ProcessBuilder start
+FINE: ProcessBuilder.start(): pid: 33421, dir: null, cmd: "/bin/sh"
 java.lang.RuntimeException: ProcessBuilder.start() debug
 	at java.base/java.lang.ProcessBuilder.start(ProcessBuilder.java:1147)
 	at java.base/java.lang.ProcessBuilder.start(ProcessBuilder.java:1089)
@@ -2296,8 +2346,8 @@
 	at java.base/java.util.concurrent.ThreadPoolExecutor$Worker.run(ThreadPoolExecutor.java:642)
 	at java.base/java.lang.Thread.run(Thread.java:1583)
 
-Mar 05, 2025 6:02:58 PM java.lang.ProcessBuilder start
-FINE: ProcessBuilder.start(): pid: 23358, dir: null, cmd: "/bin/sh"
+Apr 08, 2026 12:34:41 AM java.lang.ProcessBuilder start
+FINE: ProcessBuilder.start(): pid: 33428, dir: null, cmd: "/bin/sh"
 java.lang.RuntimeException: ProcessBuilder.start() debug
 	at java.base/java.lang.ProcessBuilder.start(ProcessBuilder.java:1147)
 	at java.base/java.lang.ProcessBuilder.start(ProcessBuilder.java:1089)
@@ -2312,8 +2362,8 @@
 	at java.base/java.util.concurrent.ThreadPoolExecutor$Worker.run(ThreadPoolExecutor.java:642)
 	at java.base/java.lang.Thread.run(Thread.java:1583)
 
-Mar 05, 2025 6:02:59 PM java.lang.ProcessBuilder start
-FINE: ProcessBuilder.start(): pid: 23360, dir: null, cmd: "/bin/sh"
+Apr 08, 2026 12:34:42 AM java.lang.ProcessBuilder start
+FINE: ProcessBuilder.start(): pid: 33436, dir: null, cmd: "/bin/sh"
 java.lang.RuntimeException: ProcessBuilder.start() debug
 	at java.base/java.lang.ProcessBuilder.start(ProcessBuilder.java:1147)
 	at java.base/java.lang.ProcessBuilder.start(ProcessBuilder.java:1089)
@@ -2328,8 +2378,8 @@
 	at java.base/java.util.concurrent.ThreadPoolExecutor$Worker.run(ThreadPoolExecutor.java:642)
 	at java.base/java.lang.Thread.run(Thread.java:1583)
 
-Mar 05, 2025 6:03:00 PM java.lang.ProcessBuilder start
-FINE: ProcessBuilder.start(): pid: 23362, dir: null, cmd: "/bin/sh"
+Apr 08, 2026 12:34:43 AM java.lang.ProcessBuilder start
+FINE: ProcessBuilder.start(): pid: 33442, dir: null, cmd: "/bin/sh"
 java.lang.RuntimeException: ProcessBuilder.start() debug
 	at java.base/java.lang.ProcessBuilder.start(ProcessBuilder.java:1147)
 	at java.base/java.lang.ProcessBuilder.start(ProcessBuilder.java:1089)
@@ -2344,8 +2394,8 @@
 	at java.base/java.util.concurrent.ThreadPoolExecutor$Worker.run(ThreadPoolExecutor.java:642)
 	at java.base/java.lang.Thread.run(Thread.java:1583)
 
-Mar 05, 2025 6:03:01 PM java.lang.ProcessBuilder start
-FINE: ProcessBuilder.start(): pid: 23386, dir: null, cmd: "/bin/sh"
+Apr 08, 2026 12:34:44 AM java.lang.ProcessBuilder start
+FINE: ProcessBuilder.start(): pid: 33450, dir: null, cmd: "/bin/sh"
 java.lang.RuntimeException: ProcessBuilder.start() debug
 	at java.base/java.lang.ProcessBuilder.start(ProcessBuilder.java:1147)
 	at java.base/java.lang.ProcessBuilder.start(ProcessBuilder.java:1089)
@@ -2360,8 +2410,8 @@
 	at java.base/java.util.concurrent.ThreadPoolExecutor$Worker.run(ThreadPoolExecutor.java:642)
 	at java.base/java.lang.Thread.run(Thread.java:1583)
 
-Mar 05, 2025 6:03:02 PM java.lang.ProcessBuilder start
-FINE: ProcessBuilder.start(): pid: 23390, dir: null, cmd: "/bin/sh"
+Apr 08, 2026 12:34:45 AM java.lang.ProcessBuilder start
+FINE: ProcessBuilder.start(): pid: 33457, dir: null, cmd: "/bin/sh"
 java.lang.RuntimeException: ProcessBuilder.start() debug
 	at java.base/java.lang.ProcessBuilder.start(ProcessBuilder.java:1147)
 	at java.base/java.lang.ProcessBuilder.start(ProcessBuilder.java:1089)
@@ -2376,8 +2426,8 @@
 	at java.base/java.util.concurrent.ThreadPoolExecutor$Worker.run(ThreadPoolExecutor.java:642)
 	at java.base/java.lang.Thread.run(Thread.java:1583)
 
-Mar 05, 2025 6:03:03 PM java.lang.ProcessBuilder start
-FINE: ProcessBuilder.start(): pid: 23392, dir: null, cmd: "/bin/sh"
+Apr 08, 2026 12:34:46 AM java.lang.ProcessBuilder start
+FINE: ProcessBuilder.start(): pid: 33464, dir: null, cmd: "/bin/sh"
 java.lang.RuntimeException: ProcessBuilder.start() debug
 	at java.base/java.lang.ProcessBuilder.start(ProcessBuilder.java:1147)
 	at java.base/java.lang.ProcessBuilder.start(ProcessBuilder.java:1089)
@@ -2392,8 +2442,8 @@
 	at java.base/java.util.concurrent.ThreadPoolExecutor$Worker.run(ThreadPoolExecutor.java:642)
 	at java.base/java.lang.Thread.run(Thread.java:1583)
 
-Mar 05, 2025 6:03:04 PM java.lang.ProcessBuilder start
-FINE: ProcessBuilder.start(): pid: 23395, dir: null, cmd: "/bin/sh"
+Apr 08, 2026 12:34:47 AM java.lang.ProcessBuilder start
+FINE: ProcessBuilder.start(): pid: 33480, dir: null, cmd: "/bin/sh"
 java.lang.RuntimeException: ProcessBuilder.start() debug
 	at java.base/java.lang.ProcessBuilder.start(ProcessBuilder.java:1147)
 	at java.base/java.lang.ProcessBuilder.start(ProcessBuilder.java:1089)
@@ -2408,8 +2458,8 @@
 	at java.base/java.util.concurrent.ThreadPoolExecutor$Worker.run(ThreadPoolExecutor.java:642)
 	at java.base/java.lang.Thread.run(Thread.java:1583)
 
-Mar 05, 2025 6:03:06 PM java.lang.ProcessBuilder start
-FINE: ProcessBuilder.start(): pid: 23406, dir: null, cmd: "/bin/sh"
+Apr 08, 2026 12:34:48 AM java.lang.ProcessBuilder start
+FINE: ProcessBuilder.start(): pid: 33487, dir: null, cmd: "/bin/sh"
 java.lang.RuntimeException: ProcessBuilder.start() debug
 	at java.base/java.lang.ProcessBuilder.start(ProcessBuilder.java:1147)
 	at java.base/java.lang.ProcessBuilder.start(ProcessBuilder.java:1089)
@@ -2424,8 +2474,8 @@
 	at java.base/java.util.concurrent.ThreadPoolExecutor$Worker.run(ThreadPoolExecutor.java:642)
 	at java.base/java.lang.Thread.run(Thread.java:1583)
 
-Mar 05, 2025 6:03:07 PM java.lang.ProcessBuilder start
-FINE: ProcessBuilder.start(): pid: 23410, dir: null, cmd: "/bin/sh"
+Apr 08, 2026 12:34:49 AM java.lang.ProcessBuilder start
+FINE: ProcessBuilder.start(): pid: 33495, dir: null, cmd: "/bin/sh"
 java.lang.RuntimeException: ProcessBuilder.start() debug
 	at java.base/java.lang.ProcessBuilder.start(ProcessBuilder.java:1147)
 	at java.base/java.lang.ProcessBuilder.start(ProcessBuilder.java:1089)
@@ -2440,8 +2490,8 @@
 	at java.base/java.util.concurrent.ThreadPoolExecutor$Worker.run(ThreadPoolExecutor.java:642)
 	at java.base/java.lang.Thread.run(Thread.java:1583)
 
-Mar 05, 2025 6:03:08 PM java.lang.ProcessBuilder start
-FINE: ProcessBuilder.start(): pid: 23423, dir: null, cmd: "/bin/sh"
+Apr 08, 2026 12:34:50 AM java.lang.ProcessBuilder start
+FINE: ProcessBuilder.start(): pid: 33502, dir: null, cmd: "/bin/sh"
 java.lang.RuntimeException: ProcessBuilder.start() debug
 	at java.base/java.lang.ProcessBuilder.start(ProcessBuilder.java:1147)
 	at java.base/java.lang.ProcessBuilder.start(ProcessBuilder.java:1089)
@@ -2456,8 +2506,8 @@
 	at java.base/java.util.concurrent.ThreadPoolExecutor$Worker.run(ThreadPoolExecutor.java:642)
 	at java.base/java.lang.Thread.run(Thread.java:1583)
 
-Mar 05, 2025 6:03:09 PM java.lang.ProcessBuilder start
-FINE: ProcessBuilder.start(): pid: 23428, dir: null, cmd: "/bin/sh"
+Apr 08, 2026 12:34:51 AM java.lang.ProcessBuilder start
+FINE: ProcessBuilder.start(): pid: 33510, dir: null, cmd: "/bin/sh"
 java.lang.RuntimeException: ProcessBuilder.start() debug
 	at java.base/java.lang.ProcessBuilder.start(ProcessBuilder.java:1147)
 	at java.base/java.lang.ProcessBuilder.start(ProcessBuilder.java:1089)
@@ -2472,8 +2522,8 @@
 	at java.base/java.util.concurrent.ThreadPoolExecutor$Worker.run(ThreadPoolExecutor.java:642)
 	at java.base/java.lang.Thread.run(Thread.java:1583)
 
-Mar 05, 2025 6:03:10 PM java.lang.ProcessBuilder start
-FINE: ProcessBuilder.start(): pid: 23436, dir: null, cmd: "/bin/sh"
+Apr 08, 2026 12:34:52 AM java.lang.ProcessBuilder start
+FINE: ProcessBuilder.start(): pid: 33517, dir: null, cmd: "/bin/sh"
 java.lang.RuntimeException: ProcessBuilder.start() debug
 	at java.base/java.lang.ProcessBuilder.start(ProcessBuilder.java:1147)
 	at java.base/java.lang.ProcessBuilder.start(ProcessBuilder.java:1089)
@@ -2488,8 +2538,8 @@
 	at java.base/java.util.concurrent.ThreadPoolExecutor$Worker.run(ThreadPoolExecutor.java:642)
 	at java.base/java.lang.Thread.run(Thread.java:1583)
 
-Mar 05, 2025 6:03:11 PM java.lang.ProcessBuilder start
-FINE: ProcessBuilder.start(): pid: 23445, dir: null, cmd: "/bin/sh"
+Apr 08, 2026 12:34:53 AM java.lang.ProcessBuilder start
+FINE: ProcessBuilder.start(): pid: 33525, dir: null, cmd: "/bin/sh"
 java.lang.RuntimeException: ProcessBuilder.start() debug
 	at java.base/java.lang.ProcessBuilder.start(ProcessBuilder.java:1147)
 	at java.base/java.lang.ProcessBuilder.start(ProcessBuilder.java:1089)
@@ -2504,41 +2554,32 @@
 	at java.base/java.util.concurrent.ThreadPoolExecutor$Worker.run(ThreadPoolExecutor.java:642)
 	at java.base/java.lang.Thread.run(Thread.java:1583)
 
-Mar 05, 2025 6:03:11 PM java.lang.Shutdown logRuntimeExit
-FINE: Runtime.exit() called with status: 0
-java.lang.Throwable: Runtime.exit(0)
-	at java.base/java.lang.Shutdown.logRuntimeExit(Shutdown.java:179)
-	at java.base/java.lang.Shutdown.exit(Shutdown.java:160)
-	at java.base/java.lang.Runtime.exit(Runtime.java:188)
-	at java.base/java.lang.System.exit(System.java:1920)
-	at org.apache.maven.surefire.booter.ForkedBooter.acknowledgedExit(ForkedBooter.java:338)
-	at org.apache.maven.surefire.booter.ForkedBooter.execute(ForkedBooter.java:145)
-	at org.apache.maven.surefire.booter.ForkedBooter.main(ForkedBooter.java:418)
-
-[INFO] Running org.apache.tomcat.jakartaee.MigrationTaskTest
-
-invalid-profile:
+Apr 08, 2026 12:34:54 AM java.lang.ProcessBuilder start
+FINE: ProcessBuilder.start(): pid: 33534, dir: null, cmd: "/bin/sh"
+java.lang.RuntimeException: ProcessBuilder.start() debug
+	at java.base/java.lang.ProcessBuilder.start(ProcessBuilder.java:1147)
+	at java.base/java.lang.ProcessBuilder.start(ProcessBuilder.java:1089)
+	at org.apache.maven.surefire.booter.PpidChecker$ProcessInfoConsumer.execute(PpidChecker.java:351)
+	at org.apache.maven.surefire.booter.PpidChecker.unix(PpidChecker.java:190)
+	at org.apache.maven.surefire.booter.PpidChecker.isProcessAlive(PpidChecker.java:123)
+	at org.apache.maven.surefire.booter.ForkedBooter$2.run(ForkedBooter.java:214)
+	at java.base/java.util.concurrent.Executors$RunnableAdapter.call(Executors.java:572)
+	at java.base/java.util.concurrent.FutureTask.runAndReset(FutureTask.java:358)
+	at java.base/java.util.concurrent.ScheduledThreadPoolExecutor$ScheduledFutureTask.run(ScheduledThreadPoolExecutor.java:305)
+	at java.base/java.util.concurrent.ThreadPoolExecutor.runWorker(ThreadPoolExecutor.java:1144)
+	at java.base/java.util.concurrent.ThreadPoolExecutor$Worker.run(ThreadPoolExecutor.java:642)
+	at java.base/java.lang.Thread.run(Thread.java:1583)
 
-migrate-single-source-file:
-[javax2jakarta] Performing migration from source [/build/reproducible-path/tomcat-jakartaee-migration-1.0.9/target/test-classes/HelloServlet.java] to destination [/build/reproducible-path/tomcat-jakartaee-migration-1.0.9/target/test-classes/HelloServlet.migrated-by-ant.java] with Jakarta EE specification profile [TOMCAT]
-[javax2jakarta] Migration completed successfully in [2] milliseconds
-[INFO] Tests run: 2, Failures: 0, Errors: 0, Skipped: 0, Time elapsed: 1.571 s - in org.apache.tomcat.jakartaee.MigrationTaskTest
-[INFO] Running org.apache.tomcat.jakartaee.GlobMatcherTest
-[INFO] Tests run: 8, Failures: 0, Errors: 0, Skipped: 0, Time elapsed: 0.196 s - in org.apache.tomcat.jakartaee.GlobMatcherTest
-[INFO] Running org.apache.tomcat.jakartaee.UtilTest
-[INFO] Tests run: 1, Failures: 0, Errors: 0, Skipped: 0, Time elapsed: 0.1 s - in org.apache.tomcat.jakartaee.UtilTest
 [INFO] Running org.apache.tomcat.jakartaee.PassThroughConverterTest
-[INFO] Tests run: 1, Failures: 0, Errors: 0, Skipped: 0, Time elapsed: 0.132 s - in org.apache.tomcat.jakartaee.PassThroughConverterTest
-[INFO] Running org.apache.tomcat.jakartaee.InfoTest
-[INFO] Tests run: 1, Failures: 0, Errors: 0, Skipped: 0, Time elapsed: 0.124 s - in org.apache.tomcat.jakartaee.InfoTest
+[INFO] Tests run: 1, Failures: 0, Errors: 0, Skipped: 0, Time elapsed: 0.065 s - in org.apache.tomcat.jakartaee.PassThroughConverterTest
 [INFO] Running org.apache.tomcat.jakartaee.ManifestConverterTest
-[INFO] Tests run: 1, Failures: 0, Errors: 0, Skipped: 0, Time elapsed: 0.288 s - in org.apache.tomcat.jakartaee.ManifestConverterTest
-[INFO] Running org.apache.tomcat.jakartaee.TextConverterTest
-[INFO] Tests run: 1, Failures: 0, Errors: 0, Skipped: 0, Time elapsed: 0.24 s - in org.apache.tomcat.jakartaee.TextConverterTest
-[INFO] Running org.apache.tomcat.jakartaee.EESpecProfileTest
-[INFO] Tests run: 3, Failures: 0, Errors: 0, Skipped: 0, Time elapsed: 0.214 s - in org.apache.tomcat.jakartaee.EESpecProfileTest
+[INFO] Tests run: 1, Failures: 0, Errors: 0, Skipped: 0, Time elapsed: 0.081 s - in org.apache.tomcat.jakartaee.ManifestConverterTest
+[INFO] Running org.apache.tomcat.jakartaee.UtilTest
+[INFO] Tests run: 1, Failures: 0, Errors: 0, Skipped: 0, Time elapsed: 0.05 s - in org.apache.tomcat.jakartaee.UtilTest
+[INFO] Running org.apache.tomcat.jakartaee.InfoTest
+[INFO] Tests run: 1, Failures: 0, Errors: 0, Skipped: 0, Time elapsed: 0.052 s - in org.apache.tomcat.jakartaee.InfoTest
 [INFO] Running org.apache.tomcat.jakartaee.ClassConverterTest
-[INFO] Tests run: 2, Failures: 0, Errors: 0, Skipped: 0, Time elapsed: 0.564 s - in org.apache.tomcat.jakartaee.ClassConverterTest
+[INFO] Tests run: 2, Failures: 0, Errors: 0, Skipped: 0, Time elapsed: 0.179 s - in org.apache.tomcat.jakartaee.ClassConverterTest
 [INFO] 
 [INFO] Results:
 [INFO] 
@@ -2547,8 +2588,8 @@
 [INFO] ------------------------------------------------------------------------
 [INFO] BUILD SUCCESS
 [INFO] ------------------------------------------------------------------------
-[INFO] Total time:  05:25 min
-[INFO] Finished at: 2025-03-05T18:07:57Z
+[INFO] Total time:  05:10 min
+[INFO] Finished at: 2026-04-08T00:37:29Z
 [INFO] ------------------------------------------------------------------------
    create-stamp debian/debhelper-build-stamp
    dh_prep
@@ -2575,8 +2616,8 @@
 [INFO] ------------------------------------------------------------------------
 [INFO] BUILD SUCCESS
 [INFO] ------------------------------------------------------------------------
-[INFO] Total time:  1.344 s
-[INFO] Finished at: 2025-03-05T18:08:02Z
+[INFO] Total time:  0.446 s
+[INFO] Finished at: 2026-04-08T00:37:31Z
 [INFO] ------------------------------------------------------------------------
 	mh_resolve_dependencies --non-interactive --offline --build -ptomcat-jakartaee-migration --base-directory=/build/reproducible-path/tomcat-jakartaee-migration-1.0.9 --non-explore
 Analysing pom.xml...
@@ -2605,12 +2646,14 @@
 dpkg-buildpackage: info: binary-only upload (no source included)
 dpkg-genchanges: info: including full source code in upload
 I: copying local configuration
+I: user script /srv/workspace/pbuilder/9211/tmp/hooks/B01_cleanup starting
+I: user script /srv/workspace/pbuilder/9211/tmp/hooks/B01_cleanup finished
 I: unmounting dev/ptmx filesystem
 I: unmounting dev/pts filesystem
 I: unmounting dev/shm filesystem
 I: unmounting proc filesystem
 I: unmounting sys filesystem
 I: cleaning the build env 
-I: removing directory /srv/workspace/pbuilder/12012 and its subdirectories
-I: Current time: Wed Mar  5 06:08:17 -12 2025
-I: pbuilder-time-stamp: 1741198097
+I: removing directory /srv/workspace/pbuilder/9211 and its subdirectories
+I: Current time: Wed Apr  8 14:37:35 +14 2026
+I: pbuilder-time-stamp: 1775608655