Diff of the two buildlogs:

--
--- b1/build.log	2025-03-16 05:16:03.004174062 +0000
+++ b2/build.log	2025-03-16 04:02:16.283286389 +0000
@@ -1,6 +1,6 @@
 I: pbuilder: network access will be disabled during build
-I: Current time: Sat Mar 15 16:02:19 -12 2025
-I: pbuilder-time-stamp: 1742097739
+I: Current time: Sun Apr 19 00:15:07 +14 2026
+I: pbuilder-time-stamp: 1776507307
 I: Building the build Environment
 I: extracting base tarball [/var/cache/pbuilder/unstable-reproducible-base.tgz]
 I: copying local configuration
@@ -33,52 +33,84 @@
 dpkg-source: info: applying adjust-libapt-pkg7.0.patch
 I: Not using root during the build.
 I: Installing the build-deps
-I: user script /srv/workspace/pbuilder/3615403/tmp/hooks/D02_print_environment starting
+I: user script /srv/workspace/pbuilder/685150/tmp/hooks/D01_modify_environment starting
+debug: Running on ionos15-amd64.
+I: Changing host+domainname to test build reproducibility
+I: Adding a custom variable just for the fun of it...
+I: Changing /bin/sh to bash
+'/bin/sh' -> '/bin/bash'
+lrwxrwxrwx 1 root root 9 Apr 18 10:15 /bin/sh -> /bin/bash
+I: Setting pbuilder2's login shell to /bin/bash
+I: Setting pbuilder2's GECOS to second user,second room,second work-phone,second home-phone,second other
+I: user script /srv/workspace/pbuilder/685150/tmp/hooks/D01_modify_environment finished
+I: user script /srv/workspace/pbuilder/685150/tmp/hooks/D02_print_environment starting
 I: set
-  BUILDDIR='/build/reproducible-path'
-  BUILDUSERGECOS='first user,first room,first work-phone,first home-phone,first other'
-  BUILDUSERNAME='pbuilder1'
-  BUILD_ARCH='amd64'
-  DEBIAN_FRONTEND='noninteractive'
-  DEB_BUILD_OPTIONS='buildinfo=+all reproducible=+all parallel=20 '
-  DISTRIBUTION='unstable'
-  HOME='/root'
-  HOST_ARCH='amd64'
+  BASH=/bin/sh
+  BASHOPTS=checkwinsize:cmdhist:complete_fullquote:extquote:force_fignore:globasciiranges:globskipdots:hostcomplete:interactive_comments:patsub_replacement:progcomp:promptvars:sourcepath
+  BASH_ALIASES=()
+  BASH_ARGC=()
+  BASH_ARGV=()
+  BASH_CMDS=()
+  BASH_LINENO=([0]="12" [1]="0")
+  BASH_LOADABLES_PATH=/usr/local/lib/bash:/usr/lib/bash:/opt/local/lib/bash:/usr/pkg/lib/bash:/opt/pkg/lib/bash:.
+  BASH_SOURCE=([0]="/tmp/hooks/D02_print_environment" [1]="/tmp/hooks/D02_print_environment")
+  BASH_VERSINFO=([0]="5" [1]="2" [2]="37" [3]="1" [4]="release" [5]="x86_64-pc-linux-gnu")
+  BASH_VERSION='5.2.37(1)-release'
+  BUILDDIR=/build/reproducible-path
+  BUILDUSERGECOS='second user,second room,second work-phone,second home-phone,second other'
+  BUILDUSERNAME=pbuilder2
+  BUILD_ARCH=amd64
+  DEBIAN_FRONTEND=noninteractive
+  DEB_BUILD_OPTIONS='buildinfo=+all reproducible=+all parallel=42 '
+  DIRSTACK=()
+  DISTRIBUTION=unstable
+  EUID=0
+  FUNCNAME=([0]="Echo" [1]="main")
+  GROUPS=()
+  HOME=/root
+  HOSTNAME=i-capture-the-hostname
+  HOSTTYPE=x86_64
+  HOST_ARCH=amd64
   IFS=' 	
   '
-  INVOCATION_ID='b5d86d7cb20e416687647cd8535d935e'
-  LANG='C'
-  LANGUAGE='en_US:en'
-  LC_ALL='C'
-  MAIL='/var/mail/root'
-  OPTIND='1'
-  PATH='/usr/sbin:/usr/bin:/sbin:/bin:/usr/games'
-  PBCURRENTCOMMANDLINEOPERATION='build'
-  PBUILDER_OPERATION='build'
-  PBUILDER_PKGDATADIR='/usr/share/pbuilder'
-  PBUILDER_PKGLIBDIR='/usr/lib/pbuilder'
-  PBUILDER_SYSCONFDIR='/etc'
-  PPID='3615403'
-  PS1='# '
-  PS2='> '
+  INVOCATION_ID=fbfb4d4a47094c9ebe54dcf663835992
+  LANG=C
+  LANGUAGE=et_EE:et
+  LC_ALL=C
+  MACHTYPE=x86_64-pc-linux-gnu
+  MAIL=/var/mail/root
+  OPTERR=1
+  OPTIND=1
+  OSTYPE=linux-gnu
+  PATH=/usr/sbin:/usr/bin:/sbin:/bin:/usr/games:/i/capture/the/path
+  PBCURRENTCOMMANDLINEOPERATION=build
+  PBUILDER_OPERATION=build
+  PBUILDER_PKGDATADIR=/usr/share/pbuilder
+  PBUILDER_PKGLIBDIR=/usr/lib/pbuilder
+  PBUILDER_SYSCONFDIR=/etc
+  PIPESTATUS=([0]="0")
+  POSIXLY_CORRECT=y
+  PPID=685150
   PS4='+ '
-  PWD='/'
-  SHELL='/bin/bash'
-  SHLVL='2'
-  SUDO_COMMAND='/usr/bin/timeout -k 18.1h 18h /usr/bin/ionice -c 3 /usr/bin/nice /usr/sbin/pbuilder --build --configfile /srv/reproducible-results/rbuild-debian/r-b-build.JlOLCeEb/pbuilderrc_vD9F --distribution unstable --hookdir /etc/pbuilder/first-build-hooks --debbuildopts -b --basetgz /var/cache/pbuilder/unstable-reproducible-base.tgz --buildresult /srv/reproducible-results/rbuild-debian/r-b-build.JlOLCeEb/b1 --logfile b1/build.log aptitude_0.8.13-7.dsc'
-  SUDO_GID='111'
-  SUDO_UID='106'
-  SUDO_USER='jenkins'
-  TERM='unknown'
-  TZ='/usr/share/zoneinfo/Etc/GMT+12'
-  USER='root'
-  _='/usr/bin/systemd-run'
-  http_proxy='http://46.16.76.132:3128'
+  PWD=/
+  SHELL=/bin/bash
+  SHELLOPTS=braceexpand:errexit:hashall:interactive-comments:posix
+  SHLVL=3
+  SUDO_COMMAND='/usr/bin/timeout -k 24.1h 24h /usr/bin/ionice -c 3 /usr/bin/nice -n 11 /usr/bin/unshare --uts -- /usr/sbin/pbuilder --build --configfile /srv/reproducible-results/rbuild-debian/r-b-build.JlOLCeEb/pbuilderrc_OcwT --distribution unstable --hookdir /etc/pbuilder/rebuild-hooks --debbuildopts -b --basetgz /var/cache/pbuilder/unstable-reproducible-base.tgz --buildresult /srv/reproducible-results/rbuild-debian/r-b-build.JlOLCeEb/b2 --logfile b2/build.log aptitude_0.8.13-7.dsc'
+  SUDO_GID=111
+  SUDO_UID=106
+  SUDO_USER=jenkins
+  TERM=unknown
+  TZ=/usr/share/zoneinfo/Etc/GMT-14
+  UID=0
+  USER=root
+  _='I: set'
+  http_proxy=http://213.165.73.152:3128
 I: uname -a
-  Linux ionos11-amd64 6.1.0-32-amd64 #1 SMP PREEMPT_DYNAMIC Debian 6.1.129-1 (2025-03-06) x86_64 GNU/Linux
+  Linux i-capture-the-hostname 6.12.12+bpo-amd64 #1 SMP PREEMPT_DYNAMIC Debian 6.12.12-1~bpo12+1 (2025-02-23) x86_64 GNU/Linux
 I: ls -l /bin
-  lrwxrwxrwx 1 root root 7 Mar  4 11:20 /bin -> usr/bin
-I: user script /srv/workspace/pbuilder/3615403/tmp/hooks/D02_print_environment finished
+  lrwxrwxrwx 1 root root 7 Mar  4  2025 /bin -> usr/bin
+I: user script /srv/workspace/pbuilder/685150/tmp/hooks/D02_print_environment finished
  -> Attempting to satisfy build-dependencies
  -> Creating pbuilder-satisfydepends-dummy package
 Package: pbuilder-satisfydepends-dummy
@@ -318,7 +350,7 @@
 Get: 158 http://deb.debian.org/debian unstable/main amd64 opensp amd64 1.5.2-15.2 [448 kB]
 Get: 159 http://deb.debian.org/debian unstable/main amd64 po4a all 0.73-2 [2155 kB]
 Get: 160 http://deb.debian.org/debian unstable/main amd64 xsltproc amd64 1.1.35-1.1+b1 [115 kB]
-Fetched 82.6 MB in 4s (18.7 MB/s)
+Fetched 82.6 MB in 2s (35.0 MB/s)
 Preconfiguring packages ...
 Selecting previously unselected package autoconf-archive.
 (Reading database ... 
(Reading database ... 5%
(Reading database ... 10%
(Reading database ... 15%
(Reading database ... 20%
(Reading database ... 25%
(Reading database ... 30%
(Reading database ... 35%
(Reading database ... 40%
(Reading database ... 45%
(Reading database ... 50%
(Reading database ... 55%
(Reading database ... 60%
(Reading database ... 65%
(Reading database ... 70%
(Reading database ... 75%
(Reading database ... 80%
(Reading database ... 85%
(Reading database ... 90%
(Reading database ... 95%
(Reading database ... 100%
(Reading database ... 19785 files and directories currently installed.)
@@ -858,8 +890,8 @@
 Setting up tzdata (2025a-2) ...
 
 Current default time zone: 'Etc/UTC'
-Local time is now:      Sun Mar 16 04:05:27 UTC 2025.
-Universal Time is now:  Sun Mar 16 04:05:27 UTC 2025.
+Local time is now:      Sat Apr 18 10:16:13 UTC 2026.
+Universal Time is now:  Sat Apr 18 10:16:13 UTC 2026.
 Run 'dpkg-reconfigure tzdata' if you wish to change it.
 
 Setting up libpython3.13-minimal:amd64 (3.13.2-2) ...
@@ -990,7 +1022,11 @@
 Building tag database...
  -> Finished parsing the build-deps
 I: Building the package
-I: Running cd /build/reproducible-path/aptitude-0.8.13/ && env PATH="/usr/sbin:/usr/bin:/sbin:/bin:/usr/games" HOME="/nonexistent/first-build" dpkg-buildpackage -us -uc -b && env PATH="/usr/sbin:/usr/bin:/sbin:/bin:/usr/games" HOME="/nonexistent/first-build" dpkg-genchanges -S  > ../aptitude_0.8.13-7_source.changes
+I: user script /srv/workspace/pbuilder/685150/tmp/hooks/A99_set_merged_usr starting
+Not re-configuring usrmerge for unstable
+I: user script /srv/workspace/pbuilder/685150/tmp/hooks/A99_set_merged_usr finished
+hostname: Name or service not known
+I: Running cd /build/reproducible-path/aptitude-0.8.13/ && env PATH="/usr/sbin:/usr/bin:/sbin:/bin:/usr/games:/i/capture/the/path" HOME="/nonexistent/second-build" dpkg-buildpackage -us -uc -b && env PATH="/usr/sbin:/usr/bin:/sbin:/bin:/usr/games:/i/capture/the/path" HOME="/nonexistent/second-build" dpkg-genchanges -S  > ../aptitude_0.8.13-7_source.changes
 dpkg-buildpackage: info: source package aptitude
 dpkg-buildpackage: info: source version 0.8.13-7
 dpkg-buildpackage: info: source distribution unstable
@@ -1374,7 +1410,7 @@
 config.status: executing copy-gmock commands
 make[1]: Leaving directory '/build/reproducible-path/aptitude-0.8.13'
    dh_auto_build -O--builddirectory=build -O--dbgsym-migration=aptitude-dbg
-	cd build && make -j20
+	cd build && make -j42
 make[1]: Entering directory '/build/reproducible-path/aptitude-0.8.13/build'
 make  all-recursive
 make[2]: Entering directory '/build/reproducible-path/aptitude-0.8.13/build'
@@ -1600,19 +1636,7 @@
 g++ -DLOCALEDIR=\"/usr/share/locale\" -DHAVE_CONFIG_H -I. -I../../src -I..  -I.. -I../../src -I../.. -I../../src -I/usr/include -Wdate-time -D_FORTIFY_SOURCE=2 -DHELPDIR=\"/usr/share/aptitude\" -DPKGDATADIR=\"/usr/share/aptitude\"  -I/usr/include/sigc++-2.0 -I/usr/lib/x86_64-linux-gnu/sigc++-2.0/include  -I/usr/include/cwidget -I/usr/lib/x86_64-linux-gnu/cwidget -I/usr/include/sigc++-2.0 -I/usr/lib/x86_64-linux-gnu/sigc++-2.0/include     -g -O2 -ffile-prefix-map=/build/reproducible-path/aptitude-0.8.13=. -fstack-protector-strong -fstack-clash-protection -Wformat -Werror=format-security -fcf-protection  -D_REENTRANT -std=gnu++17 -Wall  -c -o menu_redirect.o ../../src/menu_redirect.cc
 g++ -DLOCALEDIR=\"/usr/share/locale\" -DHAVE_CONFIG_H -I. -I../../src -I..  -I.. -I../../src -I../.. -I../../src -I/usr/include -Wdate-time -D_FORTIFY_SOURCE=2 -DHELPDIR=\"/usr/share/aptitude\" -DPKGDATADIR=\"/usr/share/aptitude\"  -I/usr/include/sigc++-2.0 -I/usr/lib/x86_64-linux-gnu/sigc++-2.0/include  -I/usr/include/cwidget -I/usr/lib/x86_64-linux-gnu/cwidget -I/usr/include/sigc++-2.0 -I/usr/lib/x86_64-linux-gnu/sigc++-2.0/include     -g -O2 -ffile-prefix-map=/build/reproducible-path/aptitude-0.8.13=. -fstack-protector-strong -fstack-clash-protection -Wformat -Werror=format-security -fcf-protection  -D_REENTRANT -std=gnu++17 -Wall  -c -o menu_text_layout.o ../../src/menu_text_layout.cc
 g++ -DLOCALEDIR=\"/usr/share/locale\" -DHAVE_CONFIG_H -I. -I../../src -I..  -I.. -I../../src -I../.. -I../../src -I/usr/include -Wdate-time -D_FORTIFY_SOURCE=2 -DHELPDIR=\"/usr/share/aptitude\" -DPKGDATADIR=\"/usr/share/aptitude\"  -I/usr/include/sigc++-2.0 -I/usr/lib/x86_64-linux-gnu/sigc++-2.0/include  -I/usr/include/cwidget -I/usr/lib/x86_64-linux-gnu/cwidget -I/usr/include/sigc++-2.0 -I/usr/lib/x86_64-linux-gnu/sigc++-2.0/include     -g -O2 -ffile-prefix-map=/build/reproducible-path/aptitude-0.8.13=. -fstack-protector-strong -fstack-clash-protection -Wformat -Werror=format-security -fcf-protection  -D_REENTRANT -std=gnu++17 -Wall  -c -o menu_tree.o ../../src/menu_tree.cc
-In file included from ../../src/dep_item.h:31,
-                 from ../../src/dep_item.cc:27:
-../../src/pkg_item_with_subtree.h:78:38: warning: template-id not allowed for constructor in C++20 [-Wtemplate-id-cdtor]
-   78 |   pkg_item_with_subtree<child,sorter>(const pkgCache::PkgIterator &_package,
-      |                                      ^
-../../src/pkg_item_with_subtree.h:78:38: note: remove the '< >'
 g++ -DLOCALEDIR=\"/usr/share/locale\" -DHAVE_CONFIG_H -I. -I../../src -I..  -I.. -I../../src -I../.. -I../../src -I/usr/include -Wdate-time -D_FORTIFY_SOURCE=2 -DHELPDIR=\"/usr/share/aptitude\" -DPKGDATADIR=\"/usr/share/aptitude\"  -I/usr/include/sigc++-2.0 -I/usr/lib/x86_64-linux-gnu/sigc++-2.0/include  -I/usr/include/cwidget -I/usr/lib/x86_64-linux-gnu/cwidget -I/usr/include/sigc++-2.0 -I/usr/lib/x86_64-linux-gnu/sigc++-2.0/include     -g -O2 -ffile-prefix-map=/build/reproducible-path/aptitude-0.8.13=. -fstack-protector-strong -fstack-clash-protection -Wformat -Werror=format-security -fcf-protection  -D_REENTRANT -std=gnu++17 -Wall  -c -o pkg_columnizer.o ../../src/pkg_columnizer.cc
-In file included from ../../src/pkg_ver_item.h:34,
-                 from ../../src/load_grouppolicy.cc:37:
-../../src/pkg_item_with_subtree.h:78:38: warning: template-id not allowed for constructor in C++20 [-Wtemplate-id-cdtor]
-   78 |   pkg_item_with_subtree<child,sorter>(const pkgCache::PkgIterator &_package,
-      |                                      ^
-../../src/pkg_item_with_subtree.h:78:38: note: remove the '< >'
 g++ -DLOCALEDIR=\"/usr/share/locale\" -DHAVE_CONFIG_H -I. -I../../src -I..  -I.. -I../../src -I../.. -I../../src -I/usr/include -Wdate-time -D_FORTIFY_SOURCE=2 -DHELPDIR=\"/usr/share/aptitude\" -DPKGDATADIR=\"/usr/share/aptitude\"  -I/usr/include/sigc++-2.0 -I/usr/lib/x86_64-linux-gnu/sigc++-2.0/include  -I/usr/include/cwidget -I/usr/lib/x86_64-linux-gnu/cwidget -I/usr/include/sigc++-2.0 -I/usr/lib/x86_64-linux-gnu/sigc++-2.0/include     -g -O2 -ffile-prefix-map=/build/reproducible-path/aptitude-0.8.13=. -fstack-protector-strong -fstack-clash-protection -Wformat -Werror=format-security -fcf-protection  -D_REENTRANT -std=gnu++17 -Wall  -c -o pkg_info_screen.o ../../src/pkg_info_screen.cc
 g++ -DLOCALEDIR=\"/usr/share/locale\" -DHAVE_CONFIG_H -I. -I../../src -I..  -I.. -I../../src -I../.. -I../../src -I/usr/include -Wdate-time -D_FORTIFY_SOURCE=2 -DHELPDIR=\"/usr/share/aptitude\" -DPKGDATADIR=\"/usr/share/aptitude\"  -I/usr/include/sigc++-2.0 -I/usr/lib/x86_64-linux-gnu/sigc++-2.0/include  -I/usr/include/cwidget -I/usr/lib/x86_64-linux-gnu/cwidget -I/usr/include/sigc++-2.0 -I/usr/lib/x86_64-linux-gnu/sigc++-2.0/include     -g -O2 -ffile-prefix-map=/build/reproducible-path/aptitude-0.8.13=. -fstack-protector-strong -fstack-clash-protection -Wformat -Werror=format-security -fcf-protection  -D_REENTRANT -std=gnu++17 -Wall  -c -o pkg_item.o ../../src/pkg_item.cc
 g++ -DLOCALEDIR=\"/usr/share/locale\" -DHAVE_CONFIG_H -I. -I../../src -I..  -I.. -I../../src -I../.. -I../../src -I/usr/include -Wdate-time -D_FORTIFY_SOURCE=2 -DHELPDIR=\"/usr/share/aptitude\" -DPKGDATADIR=\"/usr/share/aptitude\"  -I/usr/include/sigc++-2.0 -I/usr/lib/x86_64-linux-gnu/sigc++-2.0/include  -I/usr/include/cwidget -I/usr/lib/x86_64-linux-gnu/cwidget -I/usr/include/sigc++-2.0 -I/usr/lib/x86_64-linux-gnu/sigc++-2.0/include     -g -O2 -ffile-prefix-map=/build/reproducible-path/aptitude-0.8.13=. -fstack-protector-strong -fstack-clash-protection -Wformat -Werror=format-security -fcf-protection  -D_REENTRANT -std=gnu++17 -Wall  -c -o pkg_grouppolicy.o ../../src/pkg_grouppolicy.cc
@@ -1622,13 +1646,28 @@
 g++ -DLOCALEDIR=\"/usr/share/locale\" -DHAVE_CONFIG_H -I. -I../../src -I..  -I.. -I../../src -I../.. -I../../src -I/usr/include -Wdate-time -D_FORTIFY_SOURCE=2 -DHELPDIR=\"/usr/share/aptitude\" -DPKGDATADIR=\"/usr/share/aptitude\"  -I/usr/include/sigc++-2.0 -I/usr/lib/x86_64-linux-gnu/sigc++-2.0/include  -I/usr/include/cwidget -I/usr/lib/x86_64-linux-gnu/cwidget -I/usr/include/sigc++-2.0 -I/usr/lib/x86_64-linux-gnu/sigc++-2.0/include     -g -O2 -ffile-prefix-map=/build/reproducible-path/aptitude-0.8.13=. -fstack-protector-strong -fstack-clash-protection -Wformat -Werror=format-security -fcf-protection  -D_REENTRANT -std=gnu++17 -Wall  -c -o pkg_tree.o ../../src/pkg_tree.cc
 g++ -DLOCALEDIR=\"/usr/share/locale\" -DHAVE_CONFIG_H -I. -I../../src -I..  -I.. -I../../src -I../.. -I../../src -I/usr/include -Wdate-time -D_FORTIFY_SOURCE=2 -DHELPDIR=\"/usr/share/aptitude\" -DPKGDATADIR=\"/usr/share/aptitude\"  -I/usr/include/sigc++-2.0 -I/usr/lib/x86_64-linux-gnu/sigc++-2.0/include  -I/usr/include/cwidget -I/usr/lib/x86_64-linux-gnu/cwidget -I/usr/include/sigc++-2.0 -I/usr/lib/x86_64-linux-gnu/sigc++-2.0/include     -g -O2 -ffile-prefix-map=/build/reproducible-path/aptitude-0.8.13=. -fstack-protector-strong -fstack-clash-protection -Wformat -Werror=format-security -fcf-protection  -D_REENTRANT -std=gnu++17 -Wall  -c -o pkg_ver_item.o ../../src/pkg_ver_item.cc
 g++ -DLOCALEDIR=\"/usr/share/locale\" -DHAVE_CONFIG_H -I. -I../../src -I..  -I.. -I../../src -I../.. -I../../src -I/usr/include -Wdate-time -D_FORTIFY_SOURCE=2 -DHELPDIR=\"/usr/share/aptitude\" -DPKGDATADIR=\"/usr/share/aptitude\"  -I/usr/include/sigc++-2.0 -I/usr/lib/x86_64-linux-gnu/sigc++-2.0/include  -I/usr/include/cwidget -I/usr/lib/x86_64-linux-gnu/cwidget -I/usr/include/sigc++-2.0 -I/usr/lib/x86_64-linux-gnu/sigc++-2.0/include     -g -O2 -ffile-prefix-map=/build/reproducible-path/aptitude-0.8.13=. -fstack-protector-strong -fstack-clash-protection -Wformat -Werror=format-security -fcf-protection  -D_REENTRANT -std=gnu++17 -Wall  -c -o pkg_view.o ../../src/pkg_view.cc
+g++ -DLOCALEDIR=\"/usr/share/locale\" -DHAVE_CONFIG_H -I. -I../../src -I..  -I.. -I../../src -I../.. -I../../src -I/usr/include -Wdate-time -D_FORTIFY_SOURCE=2 -DHELPDIR=\"/usr/share/aptitude\" -DPKGDATADIR=\"/usr/share/aptitude\"  -I/usr/include/sigc++-2.0 -I/usr/lib/x86_64-linux-gnu/sigc++-2.0/include  -I/usr/include/cwidget -I/usr/lib/x86_64-linux-gnu/cwidget -I/usr/include/sigc++-2.0 -I/usr/lib/x86_64-linux-gnu/sigc++-2.0/include     -g -O2 -ffile-prefix-map=/build/reproducible-path/aptitude-0.8.13=. -fstack-protector-strong -fstack-clash-protection -Wformat -Werror=format-security -fcf-protection  -D_REENTRANT -std=gnu++17 -Wall  -c -o progress.o ../../src/progress.cc
+g++ -DLOCALEDIR=\"/usr/share/locale\" -DHAVE_CONFIG_H -I. -I../../src -I..  -I.. -I../../src -I../.. -I../../src -I/usr/include -Wdate-time -D_FORTIFY_SOURCE=2 -DHELPDIR=\"/usr/share/aptitude\" -DPKGDATADIR=\"/usr/share/aptitude\"  -I/usr/include/sigc++-2.0 -I/usr/lib/x86_64-linux-gnu/sigc++-2.0/include  -I/usr/include/cwidget -I/usr/lib/x86_64-linux-gnu/cwidget -I/usr/include/sigc++-2.0 -I/usr/lib/x86_64-linux-gnu/sigc++-2.0/include     -g -O2 -ffile-prefix-map=/build/reproducible-path/aptitude-0.8.13=. -fstack-protector-strong -fstack-clash-protection -Wformat -Werror=format-security -fcf-protection  -D_REENTRANT -std=gnu++17 -Wall  -c -o reason_fragment.o ../../src/reason_fragment.cc
+g++ -DLOCALEDIR=\"/usr/share/locale\" -DHAVE_CONFIG_H -I. -I../../src -I..  -I.. -I../../src -I../.. -I../../src -I/usr/include -Wdate-time -D_FORTIFY_SOURCE=2 -DHELPDIR=\"/usr/share/aptitude\" -DPKGDATADIR=\"/usr/share/aptitude\"  -I/usr/include/sigc++-2.0 -I/usr/lib/x86_64-linux-gnu/sigc++-2.0/include  -I/usr/include/cwidget -I/usr/lib/x86_64-linux-gnu/cwidget -I/usr/include/sigc++-2.0 -I/usr/lib/x86_64-linux-gnu/sigc++-2.0/include     -g -O2 -ffile-prefix-map=/build/reproducible-path/aptitude-0.8.13=. -fstack-protector-strong -fstack-clash-protection -Wformat -Werror=format-security -fcf-protection  -D_REENTRANT -std=gnu++17 -Wall  -c -o solution_dialog.o ../../src/solution_dialog.cc
+g++ -DLOCALEDIR=\"/usr/share/locale\" -DHAVE_CONFIG_H -I. -I../../src -I..  -I.. -I../../src -I../.. -I../../src -I/usr/include -Wdate-time -D_FORTIFY_SOURCE=2 -DHELPDIR=\"/usr/share/aptitude\" -DPKGDATADIR=\"/usr/share/aptitude\"  -I/usr/include/sigc++-2.0 -I/usr/lib/x86_64-linux-gnu/sigc++-2.0/include  -I/usr/include/cwidget -I/usr/lib/x86_64-linux-gnu/cwidget -I/usr/include/sigc++-2.0 -I/usr/lib/x86_64-linux-gnu/sigc++-2.0/include     -g -O2 -ffile-prefix-map=/build/reproducible-path/aptitude-0.8.13=. -fstack-protector-strong -fstack-clash-protection -Wformat -Werror=format-security -fcf-protection  -D_REENTRANT -std=gnu++17 -Wall  -c -o solution_fragment.o ../../src/solution_fragment.cc
+g++ -DLOCALEDIR=\"/usr/share/locale\" -DHAVE_CONFIG_H -I. -I../../src -I..  -I.. -I../../src -I../.. -I../../src -I/usr/include -Wdate-time -D_FORTIFY_SOURCE=2 -DHELPDIR=\"/usr/share/aptitude\" -DPKGDATADIR=\"/usr/share/aptitude\"  -I/usr/include/sigc++-2.0 -I/usr/lib/x86_64-linux-gnu/sigc++-2.0/include  -I/usr/include/cwidget -I/usr/lib/x86_64-linux-gnu/cwidget -I/usr/include/sigc++-2.0 -I/usr/lib/x86_64-linux-gnu/sigc++-2.0/include     -g -O2 -ffile-prefix-map=/build/reproducible-path/aptitude-0.8.13=. -fstack-protector-strong -fstack-clash-protection -Wformat -Werror=format-security -fcf-protection  -D_REENTRANT -std=gnu++17 -Wall  -c -o solution_item.o ../../src/solution_item.cc
+g++ -DLOCALEDIR=\"/usr/share/locale\" -DHAVE_CONFIG_H -I. -I../../src -I..  -I.. -I../../src -I../.. -I../../src -I/usr/include -Wdate-time -D_FORTIFY_SOURCE=2 -DHELPDIR=\"/usr/share/aptitude\" -DPKGDATADIR=\"/usr/share/aptitude\"  -I/usr/include/sigc++-2.0 -I/usr/lib/x86_64-linux-gnu/sigc++-2.0/include  -I/usr/include/cwidget -I/usr/lib/x86_64-linux-gnu/cwidget -I/usr/include/sigc++-2.0 -I/usr/lib/x86_64-linux-gnu/sigc++-2.0/include     -g -O2 -ffile-prefix-map=/build/reproducible-path/aptitude-0.8.13=. -fstack-protector-strong -fstack-clash-protection -Wformat -Werror=format-security -fcf-protection  -D_REENTRANT -std=gnu++17 -Wall  -c -o solution_screen.o ../../src/solution_screen.cc
+g++ -DLOCALEDIR=\"/usr/share/locale\" -DHAVE_CONFIG_H -I. -I../../src -I..  -I.. -I../../src -I../.. -I../../src -I/usr/include -Wdate-time -D_FORTIFY_SOURCE=2 -DHELPDIR=\"/usr/share/aptitude\" -DPKGDATADIR=\"/usr/share/aptitude\"  -I/usr/include/sigc++-2.0 -I/usr/lib/x86_64-linux-gnu/sigc++-2.0/include  -I/usr/include/cwidget -I/usr/lib/x86_64-linux-gnu/cwidget -I/usr/include/sigc++-2.0 -I/usr/lib/x86_64-linux-gnu/sigc++-2.0/include     -g -O2 -ffile-prefix-map=/build/reproducible-path/aptitude-0.8.13=. -fstack-protector-strong -fstack-clash-protection -Wformat -Werror=format-security -fcf-protection  -D_REENTRANT -std=gnu++17 -Wall  -c -o trust.o ../../src/trust.cc
+g++ -DLOCALEDIR=\"/usr/share/locale\" -DHAVE_CONFIG_H -I. -I../../src -I..  -I.. -I../../src -I../.. -I../../src -I/usr/include -Wdate-time -D_FORTIFY_SOURCE=2 -DHELPDIR=\"/usr/share/aptitude\" -DPKGDATADIR=\"/usr/share/aptitude\"  -I/usr/include/sigc++-2.0 -I/usr/lib/x86_64-linux-gnu/sigc++-2.0/include  -I/usr/include/cwidget -I/usr/lib/x86_64-linux-gnu/cwidget -I/usr/include/sigc++-2.0 -I/usr/lib/x86_64-linux-gnu/sigc++-2.0/include     -g -O2 -ffile-prefix-map=/build/reproducible-path/aptitude-0.8.13=. -fstack-protector-strong -fstack-clash-protection -Wformat -Werror=format-security -fcf-protection  -D_REENTRANT -std=gnu++17 -Wall  -c -o ui.o ../../src/ui.cc
+g++ -DLOCALEDIR=\"/usr/share/locale\" -DHAVE_CONFIG_H -I. -I../../src -I..  -I.. -I../../src -I../.. -I../../src -I/usr/include -Wdate-time -D_FORTIFY_SOURCE=2 -DHELPDIR=\"/usr/share/aptitude\" -DPKGDATADIR=\"/usr/share/aptitude\"  -I/usr/include/sigc++-2.0 -I/usr/lib/x86_64-linux-gnu/sigc++-2.0/include  -I/usr/include/cwidget -I/usr/lib/x86_64-linux-gnu/cwidget -I/usr/include/sigc++-2.0 -I/usr/lib/x86_64-linux-gnu/sigc++-2.0/include     -g -O2 -ffile-prefix-map=/build/reproducible-path/aptitude-0.8.13=. -fstack-protector-strong -fstack-clash-protection -Wformat -Werror=format-security -fcf-protection  -D_REENTRANT -std=gnu++17 -Wall  -c -o ui_download_manager.o ../../src/ui_download_manager.cc
+g++ -DLOCALEDIR=\"/usr/share/locale\" -DHAVE_CONFIG_H -I. -I../../src -I..  -I.. -I../../src -I../.. -I../../src -I/usr/include -Wdate-time -D_FORTIFY_SOURCE=2 -DHELPDIR=\"/usr/share/aptitude\" -DPKGDATADIR=\"/usr/share/aptitude\"  -I/usr/include/sigc++-2.0 -I/usr/lib/x86_64-linux-gnu/sigc++-2.0/include  -I/usr/include/cwidget -I/usr/lib/x86_64-linux-gnu/cwidget -I/usr/include/sigc++-2.0 -I/usr/lib/x86_64-linux-gnu/sigc++-2.0/include     -g -O2 -ffile-prefix-map=/build/reproducible-path/aptitude-0.8.13=. -fstack-protector-strong -fstack-clash-protection -Wformat -Werror=format-security -fcf-protection  -D_REENTRANT -std=gnu++17 -Wall  -c -o view_changelog.o ../../src/view_changelog.cc
 In file included from ../../src/pkg_ver_item.h:34,
-                 from ../../src/menu_tree.cc:26:
+                 from ../../src/pkg_sortpolicy.cc:22:
+../../src/pkg_item_with_subtree.h:78:38: warning: template-id not allowed for constructor in C++20 [-Wtemplate-id-cdtor]
+   78 |   pkg_item_with_subtree<child,sorter>(const pkgCache::PkgIterator &_package,
+      |                                      ^
+../../src/pkg_item_with_subtree.h:78:38: note: remove the '< >'
+In file included from ../../src/dep_item.h:31,
+                 from ../../src/dep_item.cc:27:
 ../../src/pkg_item_with_subtree.h:78:38: warning: template-id not allowed for constructor in C++20 [-Wtemplate-id-cdtor]
    78 |   pkg_item_with_subtree<child,sorter>(const pkgCache::PkgIterator &_package,
       |                                      ^
 ../../src/pkg_item_with_subtree.h:78:38: note: remove the '< >'
-g++ -DLOCALEDIR=\"/usr/share/locale\" -DHAVE_CONFIG_H -I. -I../../src -I..  -I.. -I../../src -I../.. -I../../src -I/usr/include -Wdate-time -D_FORTIFY_SOURCE=2 -DHELPDIR=\"/usr/share/aptitude\" -DPKGDATADIR=\"/usr/share/aptitude\"  -I/usr/include/sigc++-2.0 -I/usr/lib/x86_64-linux-gnu/sigc++-2.0/include  -I/usr/include/cwidget -I/usr/lib/x86_64-linux-gnu/cwidget -I/usr/include/sigc++-2.0 -I/usr/lib/x86_64-linux-gnu/sigc++-2.0/include     -g -O2 -ffile-prefix-map=/build/reproducible-path/aptitude-0.8.13=. -fstack-protector-strong -fstack-clash-protection -Wformat -Werror=format-security -fcf-protection  -D_REENTRANT -std=gnu++17 -Wall  -c -o progress.o ../../src/progress.cc
 In file included from ../../src/pkg_info_screen.h:25,
                  from ../../src/pkg_info_screen.cc:27:
 ../../src/pkg_grouppolicy.h:96:28: warning: 'virtual pkg_grouppolicy* pkg_grouppolicy_factory::instantiate(pkg_signal*, desc_signal*)' was hidden [-Woverloaded-virtual=]
@@ -1637,6 +1676,18 @@
 ../../src/pkg_info_screen.h:47:20: note:   by 'pkg_grouppolicy* pkg_grouppolicy_info_factory::instantiate()'
    47 |   pkg_grouppolicy *instantiate();
       |                    ^~~~~~~~~~~
+In file included from ../../src/pkg_ver_item.h:34,
+                 from ../../src/load_grouppolicy.cc:37:
+../../src/pkg_item_with_subtree.h:78:38: warning: template-id not allowed for constructor in C++20 [-Wtemplate-id-cdtor]
+   78 |   pkg_item_with_subtree<child,sorter>(const pkgCache::PkgIterator &_package,
+      |                                      ^
+../../src/pkg_item_with_subtree.h:78:38: note: remove the '< >'
+In file included from ../../src/pkg_ver_item.h:34,
+                 from ../../src/reason_fragment.cc:10:
+../../src/pkg_item_with_subtree.h:78:38: warning: template-id not allowed for constructor in C++20 [-Wtemplate-id-cdtor]
+   78 |   pkg_item_with_subtree<child,sorter>(const pkgCache::PkgIterator &_package,
+      |                                      ^
+../../src/pkg_item_with_subtree.h:78:38: note: remove the '< >'
 In file included from ../../src/dep_item.h:31,
                  from ../../src/pkg_info_screen.cc:33:
 ../../src/pkg_item_with_subtree.h:78:38: warning: template-id not allowed for constructor in C++20 [-Wtemplate-id-cdtor]
@@ -1650,15 +1701,12 @@
 ../../src/pkg_grouppolicy.cc:984:15: note:   by 'const char* task_subtree::tag() const'
   984 |   const char *tag() const {return relevance;}
       |               ^~~
-g++ -DLOCALEDIR=\"/usr/share/locale\" -DHAVE_CONFIG_H -I. -I../../src -I..  -I.. -I../../src -I../.. -I../../src -I/usr/include -Wdate-time -D_FORTIFY_SOURCE=2 -DHELPDIR=\"/usr/share/aptitude\" -DPKGDATADIR=\"/usr/share/aptitude\"  -I/usr/include/sigc++-2.0 -I/usr/lib/x86_64-linux-gnu/sigc++-2.0/include  -I/usr/include/cwidget -I/usr/lib/x86_64-linux-gnu/cwidget -I/usr/include/sigc++-2.0 -I/usr/lib/x86_64-linux-gnu/sigc++-2.0/include     -g -O2 -ffile-prefix-map=/build/reproducible-path/aptitude-0.8.13=. -fstack-protector-strong -fstack-clash-protection -Wformat -Werror=format-security -fcf-protection  -D_REENTRANT -std=gnu++17 -Wall  -c -o reason_fragment.o ../../src/reason_fragment.cc
 In file included from ../../src/pkg_ver_item.h:34,
-                 from ../../src/pkg_sortpolicy.cc:22:
+                 from ../../src/menu_tree.cc:26:
 ../../src/pkg_item_with_subtree.h:78:38: warning: template-id not allowed for constructor in C++20 [-Wtemplate-id-cdtor]
    78 |   pkg_item_with_subtree<child,sorter>(const pkgCache::PkgIterator &_package,
       |                                      ^
 ../../src/pkg_item_with_subtree.h:78:38: note: remove the '< >'
-g++ -DLOCALEDIR=\"/usr/share/locale\" -DHAVE_CONFIG_H -I. -I../../src -I..  -I.. -I../../src -I../.. -I../../src -I/usr/include -Wdate-time -D_FORTIFY_SOURCE=2 -DHELPDIR=\"/usr/share/aptitude\" -DPKGDATADIR=\"/usr/share/aptitude\"  -I/usr/include/sigc++-2.0 -I/usr/lib/x86_64-linux-gnu/sigc++-2.0/include  -I/usr/include/cwidget -I/usr/lib/x86_64-linux-gnu/cwidget -I/usr/include/sigc++-2.0 -I/usr/lib/x86_64-linux-gnu/sigc++-2.0/include     -g -O2 -ffile-prefix-map=/build/reproducible-path/aptitude-0.8.13=. -fstack-protector-strong -fstack-clash-protection -Wformat -Werror=format-security -fcf-protection  -D_REENTRANT -std=gnu++17 -Wall  -c -o solution_dialog.o ../../src/solution_dialog.cc
-g++ -DLOCALEDIR=\"/usr/share/locale\" -DHAVE_CONFIG_H -I. -I../../src -I..  -I.. -I../../src -I../.. -I../../src -I/usr/include -Wdate-time -D_FORTIFY_SOURCE=2 -DHELPDIR=\"/usr/share/aptitude\" -DPKGDATADIR=\"/usr/share/aptitude\"  -I/usr/include/sigc++-2.0 -I/usr/lib/x86_64-linux-gnu/sigc++-2.0/include  -I/usr/include/cwidget -I/usr/lib/x86_64-linux-gnu/cwidget -I/usr/include/sigc++-2.0 -I/usr/lib/x86_64-linux-gnu/sigc++-2.0/include     -g -O2 -ffile-prefix-map=/build/reproducible-path/aptitude-0.8.13=. -fstack-protector-strong -fstack-clash-protection -Wformat -Werror=format-security -fcf-protection  -D_REENTRANT -std=gnu++17 -Wall  -c -o solution_fragment.o ../../src/solution_fragment.cc
 In file included from ../../src/dep_item.h:31,
                  from ../../src/pkg_ver_item.cc:23:
 ../../src/pkg_item_with_subtree.h:78:38: warning: template-id not allowed for constructor in C++20 [-Wtemplate-id-cdtor]
@@ -1673,18 +1721,6 @@
 ../../src/pkg_info_screen.h:47:20: note:   by 'pkg_grouppolicy* pkg_grouppolicy_info_factory::instantiate()'
    47 |   pkg_grouppolicy *instantiate();
       |                    ^~~~~~~~~~~
-g++ -DLOCALEDIR=\"/usr/share/locale\" -DHAVE_CONFIG_H -I. -I../../src -I..  -I.. -I../../src -I../.. -I../../src -I/usr/include -Wdate-time -D_FORTIFY_SOURCE=2 -DHELPDIR=\"/usr/share/aptitude\" -DPKGDATADIR=\"/usr/share/aptitude\"  -I/usr/include/sigc++-2.0 -I/usr/lib/x86_64-linux-gnu/sigc++-2.0/include  -I/usr/include/cwidget -I/usr/lib/x86_64-linux-gnu/cwidget -I/usr/include/sigc++-2.0 -I/usr/lib/x86_64-linux-gnu/sigc++-2.0/include     -g -O2 -ffile-prefix-map=/build/reproducible-path/aptitude-0.8.13=. -fstack-protector-strong -fstack-clash-protection -Wformat -Werror=format-security -fcf-protection  -D_REENTRANT -std=gnu++17 -Wall  -c -o solution_item.o ../../src/solution_item.cc
-g++ -DLOCALEDIR=\"/usr/share/locale\" -DHAVE_CONFIG_H -I. -I../../src -I..  -I.. -I../../src -I../.. -I../../src -I/usr/include -Wdate-time -D_FORTIFY_SOURCE=2 -DHELPDIR=\"/usr/share/aptitude\" -DPKGDATADIR=\"/usr/share/aptitude\"  -I/usr/include/sigc++-2.0 -I/usr/lib/x86_64-linux-gnu/sigc++-2.0/include  -I/usr/include/cwidget -I/usr/lib/x86_64-linux-gnu/cwidget -I/usr/include/sigc++-2.0 -I/usr/lib/x86_64-linux-gnu/sigc++-2.0/include     -g -O2 -ffile-prefix-map=/build/reproducible-path/aptitude-0.8.13=. -fstack-protector-strong -fstack-clash-protection -Wformat -Werror=format-security -fcf-protection  -D_REENTRANT -std=gnu++17 -Wall  -c -o solution_screen.o ../../src/solution_screen.cc
-g++ -DLOCALEDIR=\"/usr/share/locale\" -DHAVE_CONFIG_H -I. -I../../src -I..  -I.. -I../../src -I../.. -I../../src -I/usr/include -Wdate-time -D_FORTIFY_SOURCE=2 -DHELPDIR=\"/usr/share/aptitude\" -DPKGDATADIR=\"/usr/share/aptitude\"  -I/usr/include/sigc++-2.0 -I/usr/lib/x86_64-linux-gnu/sigc++-2.0/include  -I/usr/include/cwidget -I/usr/lib/x86_64-linux-gnu/cwidget -I/usr/include/sigc++-2.0 -I/usr/lib/x86_64-linux-gnu/sigc++-2.0/include     -g -O2 -ffile-prefix-map=/build/reproducible-path/aptitude-0.8.13=. -fstack-protector-strong -fstack-clash-protection -Wformat -Werror=format-security -fcf-protection  -D_REENTRANT -std=gnu++17 -Wall  -c -o trust.o ../../src/trust.cc
-In file included from ../../src/pkg_ver_item.h:34,
-                 from ../../src/reason_fragment.cc:10:
-../../src/pkg_item_with_subtree.h:78:38: warning: template-id not allowed for constructor in C++20 [-Wtemplate-id-cdtor]
-   78 |   pkg_item_with_subtree<child,sorter>(const pkgCache::PkgIterator &_package,
-      |                                      ^
-../../src/pkg_item_with_subtree.h:78:38: note: remove the '< >'
-g++ -DLOCALEDIR=\"/usr/share/locale\" -DHAVE_CONFIG_H -I. -I../../src -I..  -I.. -I../../src -I../.. -I../../src -I/usr/include -Wdate-time -D_FORTIFY_SOURCE=2 -DHELPDIR=\"/usr/share/aptitude\" -DPKGDATADIR=\"/usr/share/aptitude\"  -I/usr/include/sigc++-2.0 -I/usr/lib/x86_64-linux-gnu/sigc++-2.0/include  -I/usr/include/cwidget -I/usr/lib/x86_64-linux-gnu/cwidget -I/usr/include/sigc++-2.0 -I/usr/lib/x86_64-linux-gnu/sigc++-2.0/include     -g -O2 -ffile-prefix-map=/build/reproducible-path/aptitude-0.8.13=. -fstack-protector-strong -fstack-clash-protection -Wformat -Werror=format-security -fcf-protection  -D_REENTRANT -std=gnu++17 -Wall  -c -o ui.o ../../src/ui.cc
-g++ -DLOCALEDIR=\"/usr/share/locale\" -DHAVE_CONFIG_H -I. -I../../src -I..  -I.. -I../../src -I../.. -I../../src -I/usr/include -Wdate-time -D_FORTIFY_SOURCE=2 -DHELPDIR=\"/usr/share/aptitude\" -DPKGDATADIR=\"/usr/share/aptitude\"  -I/usr/include/sigc++-2.0 -I/usr/lib/x86_64-linux-gnu/sigc++-2.0/include  -I/usr/include/cwidget -I/usr/lib/x86_64-linux-gnu/cwidget -I/usr/include/sigc++-2.0 -I/usr/lib/x86_64-linux-gnu/sigc++-2.0/include     -g -O2 -ffile-prefix-map=/build/reproducible-path/aptitude-0.8.13=. -fstack-protector-strong -fstack-clash-protection -Wformat -Werror=format-security -fcf-protection  -D_REENTRANT -std=gnu++17 -Wall  -c -o ui_download_manager.o ../../src/ui_download_manager.cc
-g++ -DLOCALEDIR=\"/usr/share/locale\" -DHAVE_CONFIG_H -I. -I../../src -I..  -I.. -I../../src -I../.. -I../../src -I/usr/include -Wdate-time -D_FORTIFY_SOURCE=2 -DHELPDIR=\"/usr/share/aptitude\" -DPKGDATADIR=\"/usr/share/aptitude\"  -I/usr/include/sigc++-2.0 -I/usr/lib/x86_64-linux-gnu/sigc++-2.0/include  -I/usr/include/cwidget -I/usr/lib/x86_64-linux-gnu/cwidget -I/usr/include/sigc++-2.0 -I/usr/lib/x86_64-linux-gnu/sigc++-2.0/include     -g -O2 -ffile-prefix-map=/build/reproducible-path/aptitude-0.8.13=. -fstack-protector-strong -fstack-clash-protection -Wformat -Werror=format-security -fcf-protection  -D_REENTRANT -std=gnu++17 -Wall  -c -o view_changelog.o ../../src/view_changelog.cc
 In file included from ../../src/pkg_info_screen.h:25,
                  from ../../src/solution_item.cc:25:
 ../../src/pkg_grouppolicy.h:96:28: warning: 'virtual pkg_grouppolicy* pkg_grouppolicy_factory::instantiate(pkg_signal*, desc_signal*)' was hidden [-Woverloaded-virtual=]
@@ -1741,9 +1777,9 @@
 make[5]: Entering directory '/build/reproducible-path/aptitude-0.8.13/build/doc/cs'
 rm -fr output-man/
 rm -fr output-readme/ README.cs
+rm -fr output-html/
 /usr/bin/xsltproc -o output-man/aptitude.8 ../../../doc/aptitude-man.xsl ../../../doc/cs/aptitude.xml
 /usr/bin/xsltproc -o output-readme/index.html ../../../doc/aptitude-txt.xsl ../../../doc/cs/aptitude.xml
-rm -fr output-html/
 /usr/bin/xsltproc -o output-html/ ../../../doc/aptitude-html.xsl ../../../doc/cs/aptitude.xml
 Warn: AUTHOR sect.: no personblurb|contrib for Daniel Burrows      
 Note: AUTHOR sect.: see http://www.docbook.org/tdg5/en/html/contr  
@@ -1803,11 +1839,11 @@
 make[5]: Entering directory '/build/reproducible-path/aptitude-0.8.13/build/doc/en'
 rm -fr output-man/
 rm -fr output-readme/ README
-rm -fr output-html/
 /usr/bin/xsltproc -o output-man/aptitude.8 ../../../doc/aptitude-man.xsl ../../../doc/en/aptitude.xml
 /usr/bin/xsltproc -o output-readme/index.html ../../../doc/aptitude-txt.xsl ../../../doc/en/aptitude.xml
-/usr/bin/xsltproc -o output-html/ ../../../doc/aptitude-html.xsl ../../../doc/en/aptitude.xml
+rm -fr output-html/
 /usr/bin/rsvg-convert -x 1.5 -y 1.5 -f png -o images/safety-cost-level-diagram.png ../../../doc/en/images/safety-cost-level-diagram.svg
+/usr/bin/xsltproc -o output-html/ ../../../doc/aptitude-html.xsl ../../../doc/en/aptitude.xml
 Note: Writing aptitude.8
 Note: Writing aptitude-create-state-bundle.1
 Note: Writing aptitude-run-state-bundle.1
@@ -1843,9 +1879,9 @@
 /usr/bin/po4a --translate-only=es/aptitude.xml --srcdir=../../../doc --destdir=../../doc ../../../doc/po4a/po4a.cfg
 /usr/bin/po4a --translate-only=es/manpage.xml --srcdir=../../../doc --destdir=../../doc ../../../doc/po4a/po4a.cfg
 rm -fr output-man/
-/usr/bin/xsltproc -o output-man/aptitude.8 ../../../doc/aptitude-man.xsl aptitude.xml
 rm -fr output-readme/ README.es
 rm -fr output-html/
+/usr/bin/xsltproc -o output-man/aptitude.8 ../../../doc/aptitude-man.xsl aptitude.xml
 /usr/bin/xsltproc -o output-readme/index.html ../../../doc/aptitude-txt.xsl aptitude.xml
 /usr/bin/xsltproc -o output-html/ ../../../doc/aptitude-html.xsl aptitude.xml
 Note: Writing aptitude.8
@@ -1882,9 +1918,9 @@
 make[5]: Entering directory '/build/reproducible-path/aptitude-0.8.13/build/doc/fi'
 rm -fr output-man/
 rm -fr output-readme/ README.fi
+rm -fr output-html/
 /usr/bin/xsltproc -o output-man/aptitude.8 ../../../doc/aptitude-man.xsl ../../../doc/fi/aptitude.xml
 /usr/bin/xsltproc -o output-readme/index.html ../../../doc/aptitude-txt.xsl ../../../doc/fi/aptitude.xml
-rm -fr output-html/
 /usr/bin/xsltproc -o output-html/ ../../../doc/aptitude-html.xsl ../../../doc/fi/aptitude.xml
 Note: meta source : no *info/productname or alternative            aptitude
 Note: meta source : see http://www.docbook.org/tdg5/en/html/produ  aptitude
@@ -1909,10 +1945,10 @@
 touch docbook-readme-stamp
 touch docbook-html-stamp
 rm -f output-html/aptitude.css
-cp ../../../doc/aptitude.css output-html/
 mkdir output-html/images/
-touch docbook-css-stamp
+cp ../../../doc/aptitude.css output-html/
 cp -f ../../../doc/fi/images/become-root-snapshot.png ../../../doc/fi/images/broken-snapshot.png ../../../doc/fi/images/colors-snapshot.png ../../../doc/fi/images/dselect-theme.png ../../../doc/fi/images/expand-once-snapshot.png ../../../doc/fi/images/expand-thrice-snapshot.png ../../../doc/fi/images/expand-twice-snapshot.png ../../../doc/fi/images/info-snapshot.png ../../../doc/fi/images/install-snapshot.png ../../../doc/fi/images/limit-result-snapshot.png ../../../doc/fi/images/limit-snapshot.png ../../../doc/fi/images/menu-snapshot.png ../../../doc/fi/images/mine-snapshot.png ../../../doc/fi/images/mine-snapshot2.png ../../../doc/fi/images/mine-snapshot3.png ../../../doc/fi/images/mine-snapshot4.png ../../../doc/fi/images/mine-snapshot5.png ../../../doc/fi/images/preview-snapshot.png ../../../doc/fi/images/search-snapshot.png ../../../doc/fi/images/solution-dialog-snapshot.png ../../../doc/fi/images/start-snapshot.png ../../../doc/fi/images/trust-snapshot.png ../../../doc/fi/images/vertical-split-theme.png ../../../doc/fi/images/views-tab-bar.png output-html/images/
+touch docbook-css-stamp
 for x in caution important note tip warning; do \
   ln -s /usr/share/xml/docbook/stylesheet/nwalsh/images/$x.png \
       output-html/images/; \
@@ -1935,9 +1971,9 @@
 /usr/bin/po4a --translate-only=fr/aptitude.xml --srcdir=../../../doc --destdir=../../doc ../../../doc/po4a/po4a.cfg
 /usr/bin/po4a --translate-only=fr/manpage.xml --srcdir=../../../doc --destdir=../../doc ../../../doc/po4a/po4a.cfg
 rm -fr output-man/
-/usr/bin/xsltproc -o output-man/aptitude.8 ../../../doc/aptitude-man.xsl aptitude.xml
 rm -fr output-readme/ README.fr
 rm -fr output-html/
+/usr/bin/xsltproc -o output-man/aptitude.8 ../../../doc/aptitude-man.xsl aptitude.xml
 /usr/bin/xsltproc -o output-readme/index.html ../../../doc/aptitude-txt.xsl aptitude.xml
 /usr/bin/xsltproc -o output-html/ ../../../doc/aptitude-html.xsl aptitude.xml
 Note: Writing aptitude.8
@@ -1977,9 +2013,9 @@
 /usr/bin/po4a --translate-only=it/manpage.xml --srcdir=../../../doc --destdir=../../doc ../../../doc/po4a/po4a.cfg
 rm -fr output-man/
 rm -fr output-readme/ README.it
+rm -fr output-html/
 /usr/bin/xsltproc -o output-man/aptitude.8 ../../../doc/aptitude-man.xsl aptitude.xml
 /usr/bin/xsltproc -o output-readme/index.html ../../../doc/aptitude-txt.xsl aptitude.xml
-rm -fr output-html/
 /usr/bin/xsltproc -o output-html/ ../../../doc/aptitude-html.xsl aptitude.xml
 Note: Writing aptitude.8
 Note: Writing aptitude-create-state-bundle.1
@@ -2017,9 +2053,9 @@
 /usr/bin/po4a --translate-only=ja/manpage.xml --srcdir=../../../doc --destdir=../../doc ../../../doc/po4a/po4a.cfg
 rm -fr output-man/
 rm -fr output-readme/ README.ja
+rm -fr output-html/
 /usr/bin/xsltproc -o output-man/aptitude.8 ../../../doc/aptitude-man.xsl aptitude.xml
 /usr/bin/xsltproc -o output-readme/index.html ../../../doc/aptitude-txt.xsl aptitude.xml
-rm -fr output-html/
 /usr/bin/xsltproc -o output-html/ ../../../doc/ja/aptitude-html-ja.xsl aptitude.xml
 Note: Writing aptitude.8
 Note: Writing aptitude-create-state-bundle.1
@@ -2056,10 +2092,10 @@
 /usr/bin/po4a --translate-only=nl/aptitude.xml --srcdir=../../../doc --destdir=../../doc ../../../doc/po4a/po4a.cfg
 /usr/bin/po4a --translate-only=nl/manpage.xml --srcdir=../../../doc --destdir=../../doc ../../../doc/po4a/po4a.cfg
 rm -fr output-man/
-/usr/bin/xsltproc -o output-man/aptitude.8 ../../../doc/aptitude-man.xsl aptitude.xml
 rm -fr output-readme/ README.nl
-/usr/bin/xsltproc -o output-readme/index.html ../../../doc/aptitude-txt.xsl aptitude.xml
 rm -fr output-html/
+/usr/bin/xsltproc -o output-man/aptitude.8 ../../../doc/aptitude-man.xsl aptitude.xml
+/usr/bin/xsltproc -o output-readme/index.html ../../../doc/aptitude-txt.xsl aptitude.xml
 /usr/bin/xsltproc -o output-html/ ../../../doc/aptitude-html.xsl aptitude.xml
 Note: Writing aptitude.8
 Note: Writing aptitude-create-state-bundle.1
@@ -2113,9 +2149,9 @@
 /usr/bin/po4a --translate-only=ru/manpage.xml --srcdir=../../../doc --destdir=../../doc ../../../doc/po4a/po4a.cfg
 rm -fr output-man/
 rm -fr output-readme/ README.ru
+rm -fr output-html/
 /usr/bin/xsltproc -o output-man/aptitude.8 ../../../doc/aptitude-man.xsl aptitude.xml
 /usr/bin/xsltproc -o output-readme/index.html ../../../doc/aptitude-txt.xsl aptitude.xml
-rm -fr output-html/
 /usr/bin/xsltproc -o output-html/ ../../../doc/aptitude-html.xsl aptitude.xml
 Note: Writing aptitude.8
 Note: Writing aptitude-create-state-bundle.1
@@ -2237,29 +2273,34 @@
 g++  -I/usr/include/sigc++-2.0 -I/usr/lib/x86_64-linux-gnu/sigc++-2.0/include  -I/usr/include/cwidget -I/usr/lib/x86_64-linux-gnu/cwidget -I/usr/include/sigc++-2.0 -I/usr/lib/x86_64-linux-gnu/sigc++-2.0/include     -g -O2 -ffile-prefix-map=/build/reproducible-path/aptitude-0.8.13=. -fstack-protector-strong -fstack-clash-protection -Wformat -Werror=format-security -fcf-protection  -D_REENTRANT -std=gnu++17 -Wall   -L/usr/lib/x86_64-linux-gnu -Wl,-z,relro -Wl,-z,now -o cppunit_test cppunit_test_main.o test_choice.o test_choice_set.o test_config_pusher.o test_dense_setset.o test_incremental_expression.o test_matching.o test_misc.o test_parsers.o test_promotion_set.o test_resolver.o test_resolver_costs.o test_resolver_hints.o test_setset.o test_temp.o test_wtree.o ../src/loggers.o ../src/generic/apt/matching/libgeneric-matching.a ../src/cmdline/libcmdline.a ../src/generic/apt/libgeneric-apt.a ../src/generic/controllers/libgeneric-controllers.a ../src/generic/apt/matching/libgeneric-matching.a ../src/generic/apt/libgeneric-apt.a ../src/generic/problemresolver/libgeneric-problemresolver.a ../src/cmdline/mocks/libcmdline-mocks.a ../src/cmdline/libcmdline.a ../src/generic/util/libgeneric-util.a ../src/generic/views/libgeneric-views.a ../src/generic/views/mocks/libgeneric-views-mocks.a -lcppunit -lboost_unit_test_framework -lgmock -lgtest -lstdc++fs -lapt-pkg -lncursesw  -lgmock -lsigc-2.0  -lcwidget -lncursesw -lsigc-2.0   -lsqlite3  -lboost_iostreams -lboost_system -L/usr/lib/x86_64-linux-gnu -lxapian -lpthread
 g++ -DHAVE_CONFIG_H -I. -I../../tests -I..  -I.. -I../.. -I../../src -I../../tests -DBOOST_TEST_DYN_LINK -DSRCDIR=\"../../tests\" -I/usr/include -Wdate-time -D_FORTIFY_SOURCE=2 -DHELPDIR=\"/usr/share/aptitude\" -DPKGDATADIR=\"/usr/share/aptitude\"  -I/usr/include/sigc++-2.0 -I/usr/lib/x86_64-linux-gnu/sigc++-2.0/include  -I/usr/include/cwidget -I/usr/lib/x86_64-linux-gnu/cwidget -I/usr/include/sigc++-2.0 -I/usr/lib/x86_64-linux-gnu/sigc++-2.0/include     -g -O2 -ffile-prefix-map=/build/reproducible-path/aptitude-0.8.13=. -fstack-protector-strong -fstack-clash-protection -Wformat -Werror=format-security -fcf-protection  -D_REENTRANT -std=gnu++17 -Wall  -c -o boost_test_main.o ../../tests/boost_test_main.cc
 g++ -DHAVE_CONFIG_H -I. -I../../tests -I..  -I.. -I../.. -I../../src -I../../tests -DBOOST_TEST_DYN_LINK -DSRCDIR=\"../../tests\" -I/usr/include -Wdate-time -D_FORTIFY_SOURCE=2 -DHELPDIR=\"/usr/share/aptitude\" -DPKGDATADIR=\"/usr/share/aptitude\"  -I/usr/include/sigc++-2.0 -I/usr/lib/x86_64-linux-gnu/sigc++-2.0/include  -I/usr/include/cwidget -I/usr/lib/x86_64-linux-gnu/cwidget -I/usr/include/sigc++-2.0 -I/usr/lib/x86_64-linux-gnu/sigc++-2.0/include     -g -O2 -ffile-prefix-map=/build/reproducible-path/aptitude-0.8.13=. -fstack-protector-strong -fstack-clash-protection -Wformat -Werror=format-security -fcf-protection  -D_REENTRANT -std=gnu++17 -Wall  -c -o test_dynamic_list.o ../../tests/test_dynamic_list.cc
-../../tests/test_dynamic_list.cc:970:1: fatal error: error writing to /tmp/ccwz1JaD.s: No space left on device
-  970 | }
-      | ^
-compilation terminated.
-make[3]: *** [Makefile:881: test_dynamic_list.o] Error 1
+g++ -DHAVE_CONFIG_H -I. -I../../tests -I..  -I.. -I../.. -I../../src -I../../tests -DBOOST_TEST_DYN_LINK -DSRCDIR=\"../../tests\" -I/usr/include -Wdate-time -D_FORTIFY_SOURCE=2 -DHELPDIR=\"/usr/share/aptitude\" -DPKGDATADIR=\"/usr/share/aptitude\"  -I/usr/include/sigc++-2.0 -I/usr/lib/x86_64-linux-gnu/sigc++-2.0/include  -I/usr/include/cwidget -I/usr/lib/x86_64-linux-gnu/cwidget -I/usr/include/sigc++-2.0 -I/usr/lib/x86_64-linux-gnu/sigc++-2.0/include     -g -O2 -ffile-prefix-map=/build/reproducible-path/aptitude-0.8.13=. -fstack-protector-strong -fstack-clash-protection -Wformat -Werror=format-security -fcf-protection  -D_REENTRANT -std=gnu++17 -Wall  -c -o test_dynamic_set.o ../../tests/test_dynamic_set.cc
+g++ -DHAVE_CONFIG_H -I. -I../../tests -I..  -I.. -I../.. -I../../src -I../../tests -DBOOST_TEST_DYN_LINK -DSRCDIR=\"../../tests\" -I/usr/include -Wdate-time -D_FORTIFY_SOURCE=2 -DHELPDIR=\"/usr/share/aptitude\" -DPKGDATADIR=\"/usr/share/aptitude\"  -I/usr/include/sigc++-2.0 -I/usr/lib/x86_64-linux-gnu/sigc++-2.0/include  -I/usr/include/cwidget -I/usr/lib/x86_64-linux-gnu/cwidget -I/usr/include/sigc++-2.0 -I/usr/lib/x86_64-linux-gnu/sigc++-2.0/include     -g -O2 -ffile-prefix-map=/build/reproducible-path/aptitude-0.8.13=. -fstack-protector-strong -fstack-clash-protection -Wformat -Werror=format-security -fcf-protection  -D_REENTRANT -std=gnu++17 -Wall  -c -o test_enumerator.o ../../tests/test_enumerator.cc
+g++ -DHAVE_CONFIG_H -I. -I../../tests -I..  -I.. -I../.. -I../../src -I../../tests -DBOOST_TEST_DYN_LINK -DSRCDIR=\"../../tests\" -I/usr/include -Wdate-time -D_FORTIFY_SOURCE=2 -DHELPDIR=\"/usr/share/aptitude\" -DPKGDATADIR=\"/usr/share/aptitude\"  -I/usr/include/sigc++-2.0 -I/usr/lib/x86_64-linux-gnu/sigc++-2.0/include  -I/usr/include/cwidget -I/usr/lib/x86_64-linux-gnu/cwidget -I/usr/include/sigc++-2.0 -I/usr/lib/x86_64-linux-gnu/sigc++-2.0/include     -g -O2 -ffile-prefix-map=/build/reproducible-path/aptitude-0.8.13=. -fstack-protector-strong -fstack-clash-protection -Wformat -Werror=format-security -fcf-protection  -D_REENTRANT -std=gnu++17 -Wall  -c -o test_file_cache.o ../../tests/test_file_cache.cc
+g++ -DHAVE_CONFIG_H -I. -I../../tests -I..  -I.. -I../.. -I../../src -I../../tests -DBOOST_TEST_DYN_LINK -DSRCDIR=\"../../tests\" -I/usr/include -Wdate-time -D_FORTIFY_SOURCE=2 -DHELPDIR=\"/usr/share/aptitude\" -DPKGDATADIR=\"/usr/share/aptitude\"  -I/usr/include/sigc++-2.0 -I/usr/lib/x86_64-linux-gnu/sigc++-2.0/include  -I/usr/include/cwidget -I/usr/lib/x86_64-linux-gnu/cwidget -I/usr/include/sigc++-2.0 -I/usr/lib/x86_64-linux-gnu/sigc++-2.0/include     -g -O2 -ffile-prefix-map=/build/reproducible-path/aptitude-0.8.13=. -fstack-protector-strong -fstack-clash-protection -Wformat -Werror=format-security -fcf-protection  -D_REENTRANT -std=gnu++17 -Wall  -c -o test_search_input_controller.o ../../tests/test_search_input_controller.cc
+g++ -DHAVE_CONFIG_H -I. -I../../tests -I..  -I.. -I../.. -I../../src -I../../tests -DBOOST_TEST_DYN_LINK -DSRCDIR=\"../../tests\" -I/usr/include -Wdate-time -D_FORTIFY_SOURCE=2 -DHELPDIR=\"/usr/share/aptitude\" -DPKGDATADIR=\"/usr/share/aptitude\"  -I/usr/include/sigc++-2.0 -I/usr/lib/x86_64-linux-gnu/sigc++-2.0/include  -I/usr/include/cwidget -I/usr/lib/x86_64-linux-gnu/cwidget -I/usr/include/sigc++-2.0 -I/usr/lib/x86_64-linux-gnu/sigc++-2.0/include     -g -O2 -ffile-prefix-map=/build/reproducible-path/aptitude-0.8.13=. -fstack-protector-strong -fstack-clash-protection -Wformat -Werror=format-security -fcf-protection  -D_REENTRANT -std=gnu++17 -Wall  -c -o test_sqlite.o ../../tests/test_sqlite.cc
+g++  -I/usr/include/sigc++-2.0 -I/usr/lib/x86_64-linux-gnu/sigc++-2.0/include  -I/usr/include/cwidget -I/usr/lib/x86_64-linux-gnu/cwidget -I/usr/include/sigc++-2.0 -I/usr/lib/x86_64-linux-gnu/sigc++-2.0/include     -g -O2 -ffile-prefix-map=/build/reproducible-path/aptitude-0.8.13=. -fstack-protector-strong -fstack-clash-protection -Wformat -Werror=format-security -fcf-protection  -D_REENTRANT -std=gnu++17 -Wall   -L/usr/lib/x86_64-linux-gnu -Wl,-z,relro -Wl,-z,now -o boost_test boost_test_main.o test_dynamic_list.o test_dynamic_set.o test_enumerator.o test_file_cache.o test_logging.o test_search_input_controller.o test_sqlite.o ../src/loggers.o ../src/generic/apt/matching/libgeneric-matching.a ../src/cmdline/libcmdline.a ../src/generic/apt/libgeneric-apt.a ../src/generic/controllers/libgeneric-controllers.a ../src/generic/apt/matching/libgeneric-matching.a ../src/generic/apt/libgeneric-apt.a ../src/generic/problemresolver/libgeneric-problemresolver.a ../src/cmdline/mocks/libcmdline-mocks.a ../src/cmdline/libcmdline.a ../src/generic/util/libgeneric-util.a ../src/generic/views/libgeneric-views.a ../src/generic/views/mocks/libgeneric-views-mocks.a -lcppunit -lboost_unit_test_framework -lgmock -lgtest -lstdc++fs -lapt-pkg -lncursesw  -lgmock -lsigc-2.0  -lcwidget -lncursesw -lsigc-2.0   -lsqlite3  -lboost_iostreams -lboost_system -L/usr/lib/x86_64-linux-gnu -lxapian -lpthread
+make[3]: 'gtest_test' is up to date.
+make[3]: Leaving directory '/build/reproducible-path/aptitude-0.8.13/build/tests'
+/usr/bin/make  check-TESTS
+make[3]: Entering directory '/build/reproducible-path/aptitude-0.8.13/build/tests'
+make[4]: Entering directory '/build/reproducible-path/aptitude-0.8.13/build/tests'
+PASS: gtest_test
+PASS: cppunit_test
+PASS: boost_test
+============================================================================
+Testsuite summary for aptitude 0.8.13
+============================================================================
+# TOTAL: 4
+# PASS:  4
+# SKIP:  0
+# XFAIL: 0
+# FAIL:  0
+# XPASS: 0
+# ERROR: 0
+============================================================================
+make[4]: Leaving directory '/build/reproducible-path/aptitude-0.8.13/build/tests'
 make[3]: Leaving directory '/build/reproducible-path/aptitude-0.8.13/build/tests'
-make[2]: *** [Makefile:1206: check-am] Error 2
 make[2]: Leaving directory '/build/reproducible-path/aptitude-0.8.13/build/tests'
-.............................................................................................................{(T(nop, advance: 30): {Install(b v2)}), (T(nop, advance: 75): {Install(a v1), Install(b v2)}), (T(nop, advance: 100): {Install(a v1 <source: a v2 -> {}>)}), (T(nop, advance: 125): {Break(b v2 -> {c v2})}), (T(nop, advance: 125, advance: 10): {Install(c v3), Break(b v2 -> {c v2})})}
-{(T(nop, advance: 100): {Install(a v1 <source: a v2 -> {}>)}), (T(nop, advance: 75): {Install(a v1), Install(b v2)}), (T(nop, advance: 30): {Install(b v2)}), (T(nop, advance: 125): {Break(b v2 -> {c v2})}), (T(nop, advance: 125, advance: 10): {Install(c v3), Break(b v2 -> {c v2})})}
-.{(T(nop, advance: 30): {Install(b v2)}), (T(nop, advance: 75): {Install(a v1), Install(b v2)}), (T(nop, advance: 100): {Install(a v1 <source: a v2 -> {}>)}), (T(nop, advance: 125): {Break(b v2 -> {c v2})}), (T(nop, advance: 125, advance: 10): {Install(c v3), Break(b v2 -> {c v2})})}
-{(T(nop, advance: 100): {Install(a v1 <source: a v2 -> {}>)}), (T(nop, advance: 75): {Install(a v1), Install(b v2)}), (T(nop, advance: 30): {Install(b v2)}), (T(nop, advance: 125): {Break(b v2 -> {c v2})}), (T(nop, advance: 125, advance: 10): {Install(c v3), Break(b v2 -> {c v2})})}
-........aptitude_resolver.cc:440 ERROR - Invalid hint "": expected an action, but found nothing.
-aptitude_resolver.cc:537 ERROR - Invalid hint "823": expected a target, but found nothing.
-aptitude_resolver.cc:683 ERROR - Invalid hint "badact target": the action "badact" should be "approve", "reject", or a number.
-aptitude_resolver.cc:564 ERROR - Invalid hint "approve ?version(423 1234)": invalid target: Match pattern ends unexpectedly (expected ')').
-aptitude_resolver.cc:564 ERROR - Invalid hint "approve ?version(3425": invalid target: Match pattern ends unexpectedly (expected ')').
-.................................................................................
-
-
-OK (199 tests)
-
-
 make[1]: Leaving directory '/build/reproducible-path/aptitude-0.8.13'
    create-stamp debian/debhelper-build-stamp
    dh_testroot -O--builddirectory=build -O--dbgsym-migration=aptitude-dbg
@@ -2268,7 +2309,7 @@
    debian/rules override_dh_auto_install
 make[1]: Entering directory '/build/reproducible-path/aptitude-0.8.13'
 dh_auto_install
-	cd build && make -j20 install DESTDIR=/build/reproducible-path/aptitude-0.8.13/debian/tmp AM_UPDATE_INFO_DIR=no
+	cd build && make -j42 install DESTDIR=/build/reproducible-path/aptitude-0.8.13/debian/tmp AM_UPDATE_INFO_DIR=no
 make[2]: Entering directory '/build/reproducible-path/aptitude-0.8.13/build'
 Making install in buildlib
 make[3]: Entering directory '/build/reproducible-path/aptitude-0.8.13/build/buildlib'
@@ -2404,10 +2445,10 @@
 touch docbook-stamp
 make[6]: Entering directory '/build/reproducible-path/aptitude-0.8.13/build/doc/cs'
 make[6]: Nothing to be done for 'install-exec-am'.
- /usr/bin/mkdir -p '/build/reproducible-path/aptitude-0.8.13/debian/tmp/usr/share/man/cs/man8'
  /usr/bin/mkdir -p '/build/reproducible-path/aptitude-0.8.13/debian/tmp/usr/share/aptitude'
- /usr/bin/install -c -m 644 'aptitude.8' '/build/reproducible-path/aptitude-0.8.13/debian/tmp/usr/share/man/cs/man8/aptitude-curses.8'
+ /usr/bin/mkdir -p '/build/reproducible-path/aptitude-0.8.13/debian/tmp/usr/share/man/cs/man8'
  /usr/bin/install -c -m 644 README.cs '/build/reproducible-path/aptitude-0.8.13/debian/tmp/usr/share/aptitude'
+ /usr/bin/install -c -m 644 'aptitude.8' '/build/reproducible-path/aptitude-0.8.13/debian/tmp/usr/share/man/cs/man8/aptitude-curses.8'
 make  install-data-hook
 make[7]: Entering directory '/build/reproducible-path/aptitude-0.8.13/build/doc/cs'
  /usr/bin/mkdir -p '/build/reproducible-path/aptitude-0.8.13/debian/tmp/usr/share/doc/aptitude/html/cs'
@@ -2450,11 +2491,11 @@
 make[6]: Nothing to be done for 'install-exec-am'.
  /usr/bin/mkdir -p '/build/reproducible-path/aptitude-0.8.13/debian/tmp/usr/share/man/man1'
  /usr/bin/mkdir -p '/build/reproducible-path/aptitude-0.8.13/debian/tmp/usr/share/man/man8'
- /usr/bin/install -c -m 644 aptitude-create-state-bundle.1 aptitude-run-state-bundle.1 '/build/reproducible-path/aptitude-0.8.13/debian/tmp/usr/share/man/man1'
  /usr/bin/mkdir -p '/build/reproducible-path/aptitude-0.8.13/debian/tmp/usr/share/aptitude'
  /usr/bin/install -c -m 644 README '/build/reproducible-path/aptitude-0.8.13/debian/tmp/usr/share/aptitude'
- /usr/bin/mkdir -p '/build/reproducible-path/aptitude-0.8.13/debian/tmp/usr/share/man/man1'
+ /usr/bin/install -c -m 644 aptitude-create-state-bundle.1 aptitude-run-state-bundle.1 '/build/reproducible-path/aptitude-0.8.13/debian/tmp/usr/share/man/man1'
  /usr/bin/mkdir -p '/build/reproducible-path/aptitude-0.8.13/debian/tmp/usr/share/man/man8'
+ /usr/bin/mkdir -p '/build/reproducible-path/aptitude-0.8.13/debian/tmp/usr/share/man/man1'
  /usr/bin/install -c -m 644 'aptitude.8' '/build/reproducible-path/aptitude-0.8.13/debian/tmp/usr/share/man/man8/aptitude-curses.8'
 make  install-data-hook
 make[7]: Entering directory '/build/reproducible-path/aptitude-0.8.13/build/doc/en'
@@ -2515,10 +2556,10 @@
 touch docbook-stamp
 make[6]: Entering directory '/build/reproducible-path/aptitude-0.8.13/build/doc/fi'
 make[6]: Nothing to be done for 'install-exec-am'.
- /usr/bin/mkdir -p '/build/reproducible-path/aptitude-0.8.13/debian/tmp/usr/share/man/fi/man8'
  /usr/bin/mkdir -p '/build/reproducible-path/aptitude-0.8.13/debian/tmp/usr/share/aptitude'
- /usr/bin/install -c -m 644 'aptitude.8' '/build/reproducible-path/aptitude-0.8.13/debian/tmp/usr/share/man/fi/man8/aptitude-curses.8'
+ /usr/bin/mkdir -p '/build/reproducible-path/aptitude-0.8.13/debian/tmp/usr/share/man/fi/man8'
  /usr/bin/install -c -m 644 README.fi '/build/reproducible-path/aptitude-0.8.13/debian/tmp/usr/share/aptitude'
+ /usr/bin/install -c -m 644 'aptitude.8' '/build/reproducible-path/aptitude-0.8.13/debian/tmp/usr/share/man/fi/man8/aptitude-curses.8'
 make  install-data-hook
 make[7]: Entering directory '/build/reproducible-path/aptitude-0.8.13/build/doc/fi'
  /usr/bin/mkdir -p '/build/reproducible-path/aptitude-0.8.13/debian/tmp/usr/share/doc/aptitude/html/fi'
@@ -2543,8 +2584,8 @@
 touch docbook-stamp
 make[6]: Entering directory '/build/reproducible-path/aptitude-0.8.13/build/doc/fr'
 make[6]: Nothing to be done for 'install-exec-am'.
- /usr/bin/mkdir -p '/build/reproducible-path/aptitude-0.8.13/debian/tmp/usr/share/man/fr/man8'
  /usr/bin/mkdir -p '/build/reproducible-path/aptitude-0.8.13/debian/tmp/usr/share/aptitude'
+ /usr/bin/mkdir -p '/build/reproducible-path/aptitude-0.8.13/debian/tmp/usr/share/man/fr/man8'
  /usr/bin/install -c -m 644 README.fr '/build/reproducible-path/aptitude-0.8.13/debian/tmp/usr/share/aptitude'
  /usr/bin/install -c -m 644 'aptitude.8' '/build/reproducible-path/aptitude-0.8.13/debian/tmp/usr/share/man/fr/man8/aptitude-curses.8'
 make  install-data-hook
@@ -2573,8 +2614,8 @@
 make[6]: Entering directory '/build/reproducible-path/aptitude-0.8.13/build/doc/it'
 make[6]: Nothing to be done for 'install-exec-am'.
  /usr/bin/mkdir -p '/build/reproducible-path/aptitude-0.8.13/debian/tmp/usr/share/man/it/man1'
- /usr/bin/mkdir -p '/build/reproducible-path/aptitude-0.8.13/debian/tmp/usr/share/man/it/man8'
  /usr/bin/mkdir -p '/build/reproducible-path/aptitude-0.8.13/debian/tmp/usr/share/aptitude'
+ /usr/bin/mkdir -p '/build/reproducible-path/aptitude-0.8.13/debian/tmp/usr/share/man/it/man8'
  /usr/bin/install -c -m 644 README.it '/build/reproducible-path/aptitude-0.8.13/debian/tmp/usr/share/aptitude'
  /usr/bin/install -c -m 644 aptitude-create-state-bundle.1 aptitude-run-state-bundle.1 '/build/reproducible-path/aptitude-0.8.13/debian/tmp/usr/share/man/it/man1'
  /usr/bin/mkdir -p '/build/reproducible-path/aptitude-0.8.13/debian/tmp/usr/share/man/it/man8'
@@ -2605,8 +2646,8 @@
 touch docbook-stamp
 make[6]: Entering directory '/build/reproducible-path/aptitude-0.8.13/build/doc/ja'
 make[6]: Nothing to be done for 'install-exec-am'.
- /usr/bin/mkdir -p '/build/reproducible-path/aptitude-0.8.13/debian/tmp/usr/share/man/ja/man8'
  /usr/bin/mkdir -p '/build/reproducible-path/aptitude-0.8.13/debian/tmp/usr/share/aptitude'
+ /usr/bin/mkdir -p '/build/reproducible-path/aptitude-0.8.13/debian/tmp/usr/share/man/ja/man8'
  /usr/bin/install -c -m 644 README.ja '/build/reproducible-path/aptitude-0.8.13/debian/tmp/usr/share/aptitude'
  /usr/bin/install -c -m 644 'aptitude.8' '/build/reproducible-path/aptitude-0.8.13/debian/tmp/usr/share/man/ja/man8/aptitude-curses.8'
 make  install-data-hook
@@ -2635,11 +2676,11 @@
 make[6]: Entering directory '/build/reproducible-path/aptitude-0.8.13/build/doc/nl'
 make[6]: Nothing to be done for 'install-exec-am'.
  /usr/bin/mkdir -p '/build/reproducible-path/aptitude-0.8.13/debian/tmp/usr/share/man/nl/man1'
- /usr/bin/mkdir -p '/build/reproducible-path/aptitude-0.8.13/debian/tmp/usr/share/man/nl/man8'
  /usr/bin/mkdir -p '/build/reproducible-path/aptitude-0.8.13/debian/tmp/usr/share/aptitude'
+ /usr/bin/mkdir -p '/build/reproducible-path/aptitude-0.8.13/debian/tmp/usr/share/man/nl/man8'
  /usr/bin/install -c -m 644 README.nl '/build/reproducible-path/aptitude-0.8.13/debian/tmp/usr/share/aptitude'
- /usr/bin/install -c -m 644 aptitude-create-state-bundle.1 aptitude-run-state-bundle.1 '/build/reproducible-path/aptitude-0.8.13/debian/tmp/usr/share/man/nl/man1'
  /usr/bin/install -c -m 644 'aptitude.8' '/build/reproducible-path/aptitude-0.8.13/debian/tmp/usr/share/man/nl/man8/aptitude-curses.8'
+ /usr/bin/install -c -m 644 aptitude-create-state-bundle.1 aptitude-run-state-bundle.1 '/build/reproducible-path/aptitude-0.8.13/debian/tmp/usr/share/man/nl/man1'
 make  install-data-hook
 make[7]: Entering directory '/build/reproducible-path/aptitude-0.8.13/build/doc/nl'
  /usr/bin/mkdir -p '/build/reproducible-path/aptitude-0.8.13/debian/tmp/usr/share/doc/aptitude/html/nl'
@@ -2681,11 +2722,11 @@
 make[6]: Entering directory '/build/reproducible-path/aptitude-0.8.13/build/doc/ru'
 make[6]: Nothing to be done for 'install-exec-am'.
  /usr/bin/mkdir -p '/build/reproducible-path/aptitude-0.8.13/debian/tmp/usr/share/man/ru/man1'
- /usr/bin/mkdir -p '/build/reproducible-path/aptitude-0.8.13/debian/tmp/usr/share/man/ru/man8'
  /usr/bin/mkdir -p '/build/reproducible-path/aptitude-0.8.13/debian/tmp/usr/share/aptitude'
+ /usr/bin/mkdir -p '/build/reproducible-path/aptitude-0.8.13/debian/tmp/usr/share/man/ru/man8'
+ /usr/bin/install -c -m 644 README.ru '/build/reproducible-path/aptitude-0.8.13/debian/tmp/usr/share/aptitude'
  /usr/bin/install -c -m 644 'aptitude.8' '/build/reproducible-path/aptitude-0.8.13/debian/tmp/usr/share/man/ru/man8/aptitude-curses.8'
  /usr/bin/install -c -m 644 aptitude-create-state-bundle.1 aptitude-run-state-bundle.1 '/build/reproducible-path/aptitude-0.8.13/debian/tmp/usr/share/man/ru/man1'
- /usr/bin/install -c -m 644 README.ru '/build/reproducible-path/aptitude-0.8.13/debian/tmp/usr/share/aptitude'
 make  install-data-hook
 make[7]: Entering directory '/build/reproducible-path/aptitude-0.8.13/build/doc/ru'
  /usr/bin/mkdir -p '/build/reproducible-path/aptitude-0.8.13/debian/tmp/usr/share/doc/aptitude/html/ru'
@@ -2851,18 +2892,18 @@
 make[3]: Leaving directory '/build/reproducible-path/aptitude-0.8.13/build/tests'
 make[3]: Entering directory '/build/reproducible-path/aptitude-0.8.13/build'
 make[4]: Entering directory '/build/reproducible-path/aptitude-0.8.13/build'
-[ -d /build/reproducible-path/aptitude-0.8.13/debian/tmp/var/lib/aptitude ] || /bin/bash ../mkinstalldirs /build/reproducible-path/aptitude-0.8.13/debian/tmp/var/lib/aptitude
+[ -d /build/reproducible-path/aptitude-0.8.13/debian/tmp/var/lib/aptitude ] || /bin/sh ../mkinstalldirs /build/reproducible-path/aptitude-0.8.13/debian/tmp/var/lib/aptitude
  /usr/bin/mkdir -p '/build/reproducible-path/aptitude-0.8.13/debian/tmp/usr/bin'
  /usr/bin/mkdir -p '/build/reproducible-path/aptitude-0.8.13/debian/tmp/usr/share/aptitude'
- /usr/bin/install -c ../aptitude-changelog-parser ../aptitude-create-state-bundle ../aptitude-run-state-bundle '/build/reproducible-path/aptitude-0.8.13/debian/tmp/usr/bin'
 mkdir -p -- /build/reproducible-path/aptitude-0.8.13/debian/tmp/var/lib/aptitude
+ /usr/bin/install -c ../aptitude-changelog-parser ../aptitude-create-state-bundle ../aptitude-run-state-bundle '/build/reproducible-path/aptitude-0.8.13/debian/tmp/usr/bin'
 for l in gl; do \
-  /bin/bash ../mkinstalldirs /build/reproducible-path/aptitude-0.8.13/debian/tmp/usr/share/man/$l/man8; \
+  /bin/sh ../mkinstalldirs /build/reproducible-path/aptitude-0.8.13/debian/tmp/usr/share/man/$l/man8; \
   /usr/bin/install -c -m 644 ../aptitude.$l.8 /build/reproducible-path/aptitude-0.8.13/debian/tmp/usr/share/man/$l/man8/aptitude.8; \
 done
  /usr/bin/install -c -m 644 ../help.txt ../help-cs.txt ../help-de.txt ../help-es.txt ../help-eu.txt ../help-fi.txt ../help-fr.txt ../help-gl.txt ../help-it.txt ../help-ja.txt ../help-nb.txt ../help-pl.txt ../help-ru.txt ../help-sk.txt ../help-sv.txt ../help-tr.txt ../help-uk.txt ../help-pt_BR.txt ../help-zh_CN.txt ../help-zh_TW.txt ../COPYING ../NEWS ../FAQ ../aptitude-defaults ../section-descriptions ../aptitude-defaults.ar ../aptitude-defaults.bs ../aptitude-defaults.ca ../aptitude-defaults.cs ../aptitude-defaults.da ../aptitude-defaults.de ../aptitude-defaults.el ../aptitude-defaults.es ../aptitude-defaults.eu ../aptitude-defaults.fi ../aptitude-defaults.fr ../aptitude-defaults.gl ../aptitude-defaults.hu ../aptitude-defaults.it ../aptitude-defaults.ja '/build/reproducible-path/aptitude-0.8.13/debian/tmp/usr/share/aptitude'
- /usr/bin/install -c -m 644 ../aptitude-defaults.km ../aptitude-defaults.ku ../aptitude-defaults.lt ../aptitude-defaults.mr ../aptitude-defaults.nb ../aptitude-defaults.nl ../aptitude-defaults.nn ../aptitude-defaults.pl ../aptitude-defaults.pt ../aptitude-defaults.ro ../aptitude-defaults.ru ../aptitude-defaults.sk ../aptitude-defaults.sv ../aptitude-defaults.tl ../aptitude-defaults.tr ../aptitude-defaults.vi ../aptitude-defaults.pt_BR ../aptitude-defaults.zh_CN ../aptitude-defaults.zh_TW '/build/reproducible-path/aptitude-0.8.13/debian/tmp/usr/share/aptitude'
 mkdir -p -- /build/reproducible-path/aptitude-0.8.13/debian/tmp/usr/share/man/gl/man8
+ /usr/bin/install -c -m 644 ../aptitude-defaults.km ../aptitude-defaults.ku ../aptitude-defaults.lt ../aptitude-defaults.mr ../aptitude-defaults.nb ../aptitude-defaults.nl ../aptitude-defaults.nn ../aptitude-defaults.pl ../aptitude-defaults.pt ../aptitude-defaults.ro ../aptitude-defaults.ru ../aptitude-defaults.sk ../aptitude-defaults.sv ../aptitude-defaults.tl ../aptitude-defaults.tr ../aptitude-defaults.vi ../aptitude-defaults.pt_BR ../aptitude-defaults.zh_CN ../aptitude-defaults.zh_TW '/build/reproducible-path/aptitude-0.8.13/debian/tmp/usr/share/aptitude'
 make[4]: Leaving directory '/build/reproducible-path/aptitude-0.8.13/build'
 make[3]: Leaving directory '/build/reproducible-path/aptitude-0.8.13/build'
 make[2]: Leaving directory '/build/reproducible-path/aptitude-0.8.13/build'
@@ -2897,46 +2938,46 @@
    dh_perl -O--builddirectory=build -O--dbgsym-migration=aptitude-dbg
    dh_link -O--builddirectory=build -O--dbgsym-migration=aptitude-dbg
    dh_strip_nondeterminism -O--builddirectory=build -O--dbgsym-migration=aptitude-dbg
-	Normalized debian/aptitude-common/usr/share/locale/bs/LC_MESSAGES/aptitude.mo
-	Normalized debian/aptitude-common/usr/share/locale/gl/LC_MESSAGES/aptitude.mo
 	Normalized debian/aptitude-common/usr/share/locale/th/LC_MESSAGES/aptitude.mo
-	Normalized debian/aptitude-common/usr/share/locale/dz/LC_MESSAGES/aptitude.mo
-	Normalized debian/aptitude-common/usr/share/locale/ja/LC_MESSAGES/aptitude.mo
-	Normalized debian/aptitude-common/usr/share/locale/hu/LC_MESSAGES/aptitude.mo
-	Normalized debian/aptitude-common/usr/share/locale/km/LC_MESSAGES/aptitude.mo
-	Normalized debian/aptitude-common/usr/share/locale/tl/LC_MESSAGES/aptitude.mo
-	Normalized debian/aptitude-common/usr/share/locale/mr/LC_MESSAGES/aptitude.mo
-	Normalized debian/aptitude-common/usr/share/locale/vi/LC_MESSAGES/aptitude.mo
-	Normalized debian/aptitude-common/usr/share/locale/hr/LC_MESSAGES/aptitude.mo
-	Normalized debian/aptitude-common/usr/share/locale/ar/LC_MESSAGES/aptitude.mo
-	Normalized debian/aptitude-common/usr/share/locale/fi/LC_MESSAGES/aptitude.mo
 	Normalized debian/aptitude-common/usr/share/locale/fr/LC_MESSAGES/aptitude.mo
-	Normalized debian/aptitude-common/usr/share/locale/el/LC_MESSAGES/aptitude.mo
-	Normalized debian/aptitude-common/usr/share/locale/es/LC_MESSAGES/aptitude.mo
-	Normalized debian/aptitude-common/usr/share/locale/sv/LC_MESSAGES/aptitude.mo
-	Normalized debian/aptitude-common/usr/share/locale/cs/LC_MESSAGES/aptitude.mo
-	Normalized debian/aptitude-common/usr/share/locale/ne/LC_MESSAGES/aptitude.mo
-	Normalized debian/aptitude-common/usr/share/locale/nb/LC_MESSAGES/aptitude.mo
-	Normalized debian/aptitude-common/usr/share/locale/tr/LC_MESSAGES/aptitude.mo
-	Normalized debian/aptitude-common/usr/share/locale/eu/LC_MESSAGES/aptitude.mo
-	Normalized debian/aptitude-common/usr/share/locale/de/LC_MESSAGES/aptitude.mo
-	Normalized debian/aptitude-common/usr/share/locale/nn/LC_MESSAGES/aptitude.mo
-	Normalized debian/aptitude-common/usr/share/locale/zh_CN/LC_MESSAGES/aptitude.mo
-	Normalized debian/aptitude-common/usr/share/locale/zh_TW/LC_MESSAGES/aptitude.mo
-	Normalized debian/aptitude-common/usr/share/locale/ast/LC_MESSAGES/aptitude.mo
+	Normalized debian/aptitude-common/usr/share/locale/fi/LC_MESSAGES/aptitude.mo
 	Normalized debian/aptitude-common/usr/share/locale/uk/LC_MESSAGES/aptitude.mo
-	Normalized debian/aptitude-common/usr/share/locale/pt_BR/LC_MESSAGES/aptitude.mo
+	Normalized debian/aptitude-common/usr/share/locale/pt/LC_MESSAGES/aptitude.mo
 	Normalized debian/aptitude-common/usr/share/locale/nl/LC_MESSAGES/aptitude.mo
-	Normalized debian/aptitude-common/usr/share/locale/ru/LC_MESSAGES/aptitude.mo
-	Normalized debian/aptitude-common/usr/share/locale/ku/LC_MESSAGES/aptitude.mo
+	Normalized debian/aptitude-common/usr/share/locale/zh_CN/LC_MESSAGES/aptitude.mo
+	Normalized debian/aptitude-common/usr/share/locale/tr/LC_MESSAGES/aptitude.mo
+	Normalized debian/aptitude-common/usr/share/locale/nb/LC_MESSAGES/aptitude.mo
+	Normalized debian/aptitude-common/usr/share/locale/hu/LC_MESSAGES/aptitude.mo
+	Normalized debian/aptitude-common/usr/share/locale/sv/LC_MESSAGES/aptitude.mo
+	Normalized debian/aptitude-common/usr/share/locale/es/LC_MESSAGES/aptitude.mo
 	Normalized debian/aptitude-common/usr/share/locale/lt/LC_MESSAGES/aptitude.mo
+	Normalized debian/aptitude-common/usr/share/locale/mr/LC_MESSAGES/aptitude.mo
 	Normalized debian/aptitude-common/usr/share/locale/ro/LC_MESSAGES/aptitude.mo
+	Normalized debian/aptitude-common/usr/share/locale/ne/LC_MESSAGES/aptitude.mo
+	Normalized debian/aptitude-common/usr/share/locale/de/LC_MESSAGES/aptitude.mo
+	Normalized debian/aptitude-common/usr/share/locale/ast/LC_MESSAGES/aptitude.mo
+	Normalized debian/aptitude-common/usr/share/locale/zh_TW/LC_MESSAGES/aptitude.mo
+	Normalized debian/aptitude-common/usr/share/locale/nn/LC_MESSAGES/aptitude.mo
 	Normalized debian/aptitude-common/usr/share/locale/pl/LC_MESSAGES/aptitude.mo
 	Normalized debian/aptitude-common/usr/share/locale/ca/LC_MESSAGES/aptitude.mo
-	Normalized debian/aptitude-common/usr/share/locale/it/LC_MESSAGES/aptitude.mo
+	Normalized debian/aptitude-common/usr/share/locale/ar/LC_MESSAGES/aptitude.mo
+	Normalized debian/aptitude-common/usr/share/locale/gl/LC_MESSAGES/aptitude.mo
 	Normalized debian/aptitude-common/usr/share/locale/sk/LC_MESSAGES/aptitude.mo
+	Normalized debian/aptitude-common/usr/share/locale/ja/LC_MESSAGES/aptitude.mo
+	Normalized debian/aptitude-common/usr/share/locale/it/LC_MESSAGES/aptitude.mo
+	Normalized debian/aptitude-common/usr/share/locale/ku/LC_MESSAGES/aptitude.mo
+	Normalized debian/aptitude-common/usr/share/locale/dz/LC_MESSAGES/aptitude.mo
+	Normalized debian/aptitude-common/usr/share/locale/tl/LC_MESSAGES/aptitude.mo
 	Normalized debian/aptitude-common/usr/share/locale/da/LC_MESSAGES/aptitude.mo
-	Normalized debian/aptitude-common/usr/share/locale/pt/LC_MESSAGES/aptitude.mo
+	Normalized debian/aptitude-common/usr/share/locale/km/LC_MESSAGES/aptitude.mo
+	Normalized debian/aptitude-common/usr/share/locale/bs/LC_MESSAGES/aptitude.mo
+	Normalized debian/aptitude-common/usr/share/locale/cs/LC_MESSAGES/aptitude.mo
+	Normalized debian/aptitude-common/usr/share/locale/el/LC_MESSAGES/aptitude.mo
+	Normalized debian/aptitude-common/usr/share/locale/eu/LC_MESSAGES/aptitude.mo
+	Normalized debian/aptitude-common/usr/share/locale/vi/LC_MESSAGES/aptitude.mo
+	Normalized debian/aptitude-common/usr/share/locale/hr/LC_MESSAGES/aptitude.mo
+	Normalized debian/aptitude-common/usr/share/locale/pt_BR/LC_MESSAGES/aptitude.mo
+	Normalized debian/aptitude-common/usr/share/locale/ru/LC_MESSAGES/aptitude.mo
    dh_compress -O--builddirectory=build -O--dbgsym-migration=aptitude-dbg
    dh_fixperms -O--builddirectory=build -O--dbgsym-migration=aptitude-dbg
    dh_dwz -a -O--builddirectory=build -O--dbgsym-migration=aptitude-dbg
@@ -2948,18 +2989,18 @@
 dpkg-gencontrol: warning: package aptitude-common: substitution variable ${perl:Depends} unused, but is defined
    dh_md5sums -O--builddirectory=build -O--dbgsym-migration=aptitude-dbg
    dh_builddeb -O--builddirectory=build -O--dbgsym-migration=aptitude-dbg
+dpkg-deb: building package 'aptitude' in '../aptitude_0.8.13-7_amd64.deb'.
 dpkg-deb: building package 'aptitude-dbgsym' in '../aptitude-dbgsym_0.8.13-7_amd64.deb'.
-dpkg-deb: building package 'aptitude-doc-it' in '../aptitude-doc-it_0.8.13-7_all.deb'.
+dpkg-deb: building package 'aptitude-common' in '../aptitude-common_0.8.13-7_all.deb'.
 dpkg-deb: building package 'aptitude-doc-cs' in '../aptitude-doc-cs_0.8.13-7_all.deb'.
-dpkg-deb: building package 'aptitude' in '../aptitude_0.8.13-7_amd64.deb'.
 dpkg-deb: building package 'aptitude-doc-en' in '../aptitude-doc-en_0.8.13-7_all.deb'.
 dpkg-deb: building package 'aptitude-doc-es' in '../aptitude-doc-es_0.8.13-7_all.deb'.
 dpkg-deb: building package 'aptitude-doc-fi' in '../aptitude-doc-fi_0.8.13-7_all.deb'.
-dpkg-deb: building package 'aptitude-common' in '../aptitude-common_0.8.13-7_all.deb'.
 dpkg-deb: building package 'aptitude-doc-fr' in '../aptitude-doc-fr_0.8.13-7_all.deb'.
-dpkg-deb: building package 'aptitude-doc-ru' in '../aptitude-doc-ru_0.8.13-7_all.deb'.
 dpkg-deb: building package 'aptitude-doc-ja' in '../aptitude-doc-ja_0.8.13-7_all.deb'.
+dpkg-deb: building package 'aptitude-doc-it' in '../aptitude-doc-it_0.8.13-7_all.deb'.
 dpkg-deb: building package 'aptitude-doc-nl' in '../aptitude-doc-nl_0.8.13-7_all.deb'.
+dpkg-deb: building package 'aptitude-doc-ru' in '../aptitude-doc-ru_0.8.13-7_all.deb'.
  dpkg-genbuildinfo --build=binary -O../aptitude_0.8.13-7_amd64.buildinfo
  dpkg-genchanges --build=binary -O../aptitude_0.8.13-7_amd64.changes
 dpkg-genchanges: info: binary-only upload (no source code included)
@@ -2967,12 +3008,14 @@
 dpkg-buildpackage: info: binary-only upload (no source included)
 dpkg-genchanges: info: not including original source code in upload
 I: copying local configuration
+I: user script /srv/workspace/pbuilder/685150/tmp/hooks/B01_cleanup starting
+I: user script /srv/workspace/pbuilder/685150/tmp/hooks/B01_cleanup finished
 I: unmounting dev/ptmx filesystem
 I: unmounting dev/pts filesystem
 I: unmounting dev/shm filesystem
 I: unmounting proc filesystem
 I: unmounting sys filesystem
 I: cleaning the build env 
-I: removing directory /srv/workspace/pbuilder/3615403 and its subdirectories
-I: Current time: Sat Mar 15 17:16:01 -12 2025
-I: pbuilder-time-stamp: 1742102161
+I: removing directory /srv/workspace/pbuilder/685150 and its subdirectories
+I: Current time: Sun Apr 19 00:25:14 +14 2026
+I: pbuilder-time-stamp: 1776507914