Diff of the two buildlogs:

--
--- b1/build.log	2025-03-09 17:51:41.440601351 +0000
+++ b2/build.log	2025-03-09 17:56:13.372348621 +0000
@@ -1,6 +1,6 @@
 I: pbuilder: network access will be disabled during build
-I: Current time: Sun Mar  9 05:45:01 -12 2025
-I: pbuilder-time-stamp: 1741542301
+I: Current time: Mon Mar 10 07:52:12 +14 2025
+I: pbuilder-time-stamp: 1741542732
 I: Building the build Environment
 I: extracting base tarball [/var/cache/pbuilder/trixie-reproducible-base.tgz]
 I: copying local configuration
@@ -24,52 +24,84 @@
 dpkg-source: info: applying cross.patch
 I: Not using root during the build.
 I: Installing the build-deps
-I: user script /srv/workspace/pbuilder/21839/tmp/hooks/D02_print_environment starting
+I: user script /srv/workspace/pbuilder/1421/tmp/hooks/D01_modify_environment starting
+debug: Running on virt64b.
+I: Changing host+domainname to test build reproducibility
+I: Adding a custom variable just for the fun of it...
+I: Changing /bin/sh to bash
+'/bin/sh' -> '/bin/bash'
+lrwxrwxrwx 1 root root 9 Mar  9 17:52 /bin/sh -> /bin/bash
+I: Setting pbuilder2's login shell to /bin/bash
+I: Setting pbuilder2's GECOS to second user,second room,second work-phone,second home-phone,second other
+I: user script /srv/workspace/pbuilder/1421/tmp/hooks/D01_modify_environment finished
+I: user script /srv/workspace/pbuilder/1421/tmp/hooks/D02_print_environment starting
 I: set
-  BUILDDIR='/build/reproducible-path'
-  BUILDUSERGECOS='first user,first room,first work-phone,first home-phone,first other'
-  BUILDUSERNAME='pbuilder1'
-  BUILD_ARCH='armhf'
-  DEBIAN_FRONTEND='noninteractive'
-  DEB_BUILD_OPTIONS='buildinfo=+all reproducible=+all parallel=3 '
-  DISTRIBUTION='trixie'
-  HOME='/root'
-  HOST_ARCH='armhf'
+  BASH=/bin/sh
+  BASHOPTS=checkwinsize:cmdhist:complete_fullquote:extquote:force_fignore:globasciiranges:globskipdots:hostcomplete:interactive_comments:patsub_replacement:progcomp:promptvars:sourcepath
+  BASH_ALIASES=()
+  BASH_ARGC=()
+  BASH_ARGV=()
+  BASH_CMDS=()
+  BASH_LINENO=([0]="12" [1]="0")
+  BASH_LOADABLES_PATH=/usr/local/lib/bash:/usr/lib/bash:/opt/local/lib/bash:/usr/pkg/lib/bash:/opt/pkg/lib/bash:.
+  BASH_SOURCE=([0]="/tmp/hooks/D02_print_environment" [1]="/tmp/hooks/D02_print_environment")
+  BASH_VERSINFO=([0]="5" [1]="2" [2]="37" [3]="1" [4]="release" [5]="arm-unknown-linux-gnueabihf")
+  BASH_VERSION='5.2.37(1)-release'
+  BUILDDIR=/build/reproducible-path
+  BUILDUSERGECOS='second user,second room,second work-phone,second home-phone,second other'
+  BUILDUSERNAME=pbuilder2
+  BUILD_ARCH=armhf
+  DEBIAN_FRONTEND=noninteractive
+  DEB_BUILD_OPTIONS='buildinfo=+all reproducible=+all parallel=4 '
+  DIRSTACK=()
+  DISTRIBUTION=trixie
+  EUID=0
+  FUNCNAME=([0]="Echo" [1]="main")
+  GROUPS=()
+  HOME=/root
+  HOSTNAME=i-capture-the-hostname
+  HOSTTYPE=arm
+  HOST_ARCH=armhf
   IFS=' 	
   '
-  INVOCATION_ID='28bf0c4a1c724b059099fc4f799654d2'
-  LANG='C'
-  LANGUAGE='en_US:en'
-  LC_ALL='C'
-  MAIL='/var/mail/root'
-  OPTIND='1'
-  PATH='/usr/sbin:/usr/bin:/sbin:/bin:/usr/games'
-  PBCURRENTCOMMANDLINEOPERATION='build'
-  PBUILDER_OPERATION='build'
-  PBUILDER_PKGDATADIR='/usr/share/pbuilder'
-  PBUILDER_PKGLIBDIR='/usr/lib/pbuilder'
-  PBUILDER_SYSCONFDIR='/etc'
-  PPID='21839'
-  PS1='# '
-  PS2='> '
+  INVOCATION_ID=08cd61950baa4693ae832828fe6775cc
+  LANG=C
+  LANGUAGE=it_CH:it
+  LC_ALL=C
+  MACHTYPE=arm-unknown-linux-gnueabihf
+  MAIL=/var/mail/root
+  OPTERR=1
+  OPTIND=1
+  OSTYPE=linux-gnueabihf
+  PATH=/usr/sbin:/usr/bin:/sbin:/bin:/usr/games:/i/capture/the/path
+  PBCURRENTCOMMANDLINEOPERATION=build
+  PBUILDER_OPERATION=build
+  PBUILDER_PKGDATADIR=/usr/share/pbuilder
+  PBUILDER_PKGLIBDIR=/usr/lib/pbuilder
+  PBUILDER_SYSCONFDIR=/etc
+  PIPESTATUS=([0]="0")
+  POSIXLY_CORRECT=y
+  PPID=1421
   PS4='+ '
-  PWD='/'
-  SHELL='/bin/bash'
-  SHLVL='2'
-  SUDO_COMMAND='/usr/bin/timeout -k 18.1h 18h /usr/bin/ionice -c 3 /usr/bin/nice /usr/sbin/pbuilder --build --configfile /srv/reproducible-results/rbuild-debian/r-b-build.0CDs1juO/pbuilderrc_Ktn3 --distribution trixie --hookdir /etc/pbuilder/first-build-hooks --debbuildopts -b --basetgz /var/cache/pbuilder/trixie-reproducible-base.tgz --buildresult /srv/reproducible-results/rbuild-debian/r-b-build.0CDs1juO/b1 --logfile b1/build.log samplv1_1.3.0-1.dsc'
-  SUDO_GID='113'
-  SUDO_UID='107'
-  SUDO_USER='jenkins'
-  TERM='unknown'
-  TZ='/usr/share/zoneinfo/Etc/GMT+12'
-  USER='root'
-  _='/usr/bin/systemd-run'
-  http_proxy='http://10.0.0.15:3142/'
+  PWD=/
+  SHELL=/bin/bash
+  SHELLOPTS=braceexpand:errexit:hashall:interactive-comments:posix
+  SHLVL=3
+  SUDO_COMMAND='/usr/bin/timeout -k 24.1h 24h /usr/bin/ionice -c 3 /usr/bin/nice -n 11 /usr/bin/unshare --uts -- /usr/sbin/pbuilder --build --configfile /srv/reproducible-results/rbuild-debian/r-b-build.0CDs1juO/pbuilderrc_nEL5 --distribution trixie --hookdir /etc/pbuilder/rebuild-hooks --debbuildopts -b --basetgz /var/cache/pbuilder/trixie-reproducible-base.tgz --buildresult /srv/reproducible-results/rbuild-debian/r-b-build.0CDs1juO/b2 --logfile b2/build.log samplv1_1.3.0-1.dsc'
+  SUDO_GID=113
+  SUDO_UID=107
+  SUDO_USER=jenkins
+  TERM=unknown
+  TZ=/usr/share/zoneinfo/Etc/GMT-14
+  UID=0
+  USER=root
+  _='I: set'
+  http_proxy=http://10.0.0.15:3142/
 I: uname -a
-  Linux ff4a 6.1.0-31-armmp-lpae #1 SMP Debian 6.1.128-1 (2025-02-07) armv7l GNU/Linux
+  Linux i-capture-the-hostname 6.1.0-31-arm64 #1 SMP Debian 6.1.128-1 (2025-02-07) aarch64 GNU/Linux
 I: ls -l /bin
   lrwxrwxrwx 1 root root 7 Nov 22 14:40 /bin -> usr/bin
-I: user script /srv/workspace/pbuilder/21839/tmp/hooks/D02_print_environment finished
+I: user script /srv/workspace/pbuilder/1421/tmp/hooks/D02_print_environment finished
  -> Attempting to satisfy build-dependencies
  -> Creating pbuilder-satisfydepends-dummy package
 Package: pbuilder-satisfydepends-dummy
@@ -369,7 +401,7 @@
 Get: 239 http://deb.debian.org/debian trixie/main armhf qt6-l10n-tools armhf 6.7.2-6 [420 kB]
 Get: 240 http://deb.debian.org/debian trixie/main armhf qt6-svg-dev armhf 6.7.2-6 [19.7 kB]
 Get: 241 http://deb.debian.org/debian trixie/main armhf qt6-tools-dev-tools armhf 6.7.2-6 [231 kB]
-Fetched 165 MB in 10s (17.0 MB/s)
+Fetched 165 MB in 4s (46.8 MB/s)
 Preconfiguring packages ...
 Selecting previously unselected package libpython3.13-minimal:armhf.
 (Reading database ... 
(Reading database ... 5%
(Reading database ... 10%
(Reading database ... 15%
(Reading database ... 20%
(Reading database ... 25%
(Reading database ... 30%
(Reading database ... 35%
(Reading database ... 40%
(Reading database ... 45%
(Reading database ... 50%
(Reading database ... 55%
(Reading database ... 60%
(Reading database ... 65%
(Reading database ... 70%
(Reading database ... 75%
(Reading database ... 80%
(Reading database ... 85%
(Reading database ... 90%
(Reading database ... 95%
(Reading database ... 100%
(Reading database ... 19525 files and directories currently installed.)
@@ -1158,8 +1190,8 @@
 Setting up tzdata (2025a-2) ...
 
 Current default time zone: 'Etc/UTC'
-Local time is now:      Sun Mar  9 17:47:13 UTC 2025.
-Universal Time is now:  Sun Mar  9 17:47:13 UTC 2025.
+Local time is now:      Sun Mar  9 17:53:33 UTC 2025.
+Universal Time is now:  Sun Mar  9 17:53:33 UTC 2025.
 Run 'dpkg-reconfigure tzdata' if you wish to change it.
 
 Setting up libxcb-present0:armhf (1.17.0-2+b1) ...
@@ -1364,7 +1396,11 @@
 Building tag database...
  -> Finished parsing the build-deps
 I: Building the package
-I: Running cd /build/reproducible-path/samplv1-1.3.0/ && env PATH="/usr/sbin:/usr/bin:/sbin:/bin:/usr/games" HOME="/nonexistent/first-build" dpkg-buildpackage -us -uc -b && env PATH="/usr/sbin:/usr/bin:/sbin:/bin:/usr/games" HOME="/nonexistent/first-build" dpkg-genchanges -S  > ../samplv1_1.3.0-1_source.changes
+I: user script /srv/workspace/pbuilder/1421/tmp/hooks/A99_set_merged_usr starting
+Not re-configuring usrmerge for trixie
+I: user script /srv/workspace/pbuilder/1421/tmp/hooks/A99_set_merged_usr finished
+hostname: Name or service not known
+I: Running cd /build/reproducible-path/samplv1-1.3.0/ && env PATH="/usr/sbin:/usr/bin:/sbin:/bin:/usr/games:/i/capture/the/path" HOME="/nonexistent/second-build" dpkg-buildpackage -us -uc -b && env PATH="/usr/sbin:/usr/bin:/sbin:/bin:/usr/games:/i/capture/the/path" HOME="/nonexistent/second-build" dpkg-genchanges -S  > ../samplv1_1.3.0-1_source.changes
 dpkg-buildpackage: info: source package samplv1
 dpkg-buildpackage: info: source version 1.3.0-1
 dpkg-buildpackage: info: source distribution unstable
@@ -1485,8 +1521,8 @@
 
   Install prefix . . . . . . . . . . . . . . . . . .: /usr
 
--- Configuring done (11.3s)
--- Generating done (0.3s)
+-- Configuring done (7.3s)
+-- Generating done (0.2s)
 CMake Warning:
   Manually-specified variables were not used by the project:
 
@@ -1498,7 +1534,7 @@
 -- Build files have been written to: /build/reproducible-path/samplv1-1.3.0/obj-arm-linux-gnueabihf
 make[1]: Leaving directory '/build/reproducible-path/samplv1-1.3.0'
    dh_auto_build
-	cd obj-arm-linux-gnueabihf && make -j3 "INSTALL=install --strip-program=true" VERBOSE=1
+	cd obj-arm-linux-gnueabihf && make -j4 "INSTALL=install --strip-program=true" VERBOSE=1
 make[1]: Entering directory '/build/reproducible-path/samplv1-1.3.0/obj-arm-linux-gnueabihf'
 /usr/bin/cmake -S/build/reproducible-path/samplv1-1.3.0 -B/build/reproducible-path/samplv1-1.3.0/obj-arm-linux-gnueabihf --check-build-system CMakeFiles/Makefile.cmake 0
 /usr/bin/cmake -E cmake_progress_start /build/reproducible-path/samplv1-1.3.0/obj-arm-linux-gnueabihf/CMakeFiles /build/reproducible-path/samplv1-1.3.0/obj-arm-linux-gnueabihf//CMakeFiles/progress.marks
@@ -1568,13 +1604,13 @@
 make[3]: Leaving directory '/build/reproducible-path/samplv1-1.3.0/obj-arm-linux-gnueabihf'
 make  -f src/CMakeFiles/samplv1.dir/build.make src/CMakeFiles/samplv1.dir/build
 make[3]: Entering directory '/build/reproducible-path/samplv1-1.3.0/obj-arm-linux-gnueabihf'
-[  7%] Building CXX object src/CMakeFiles/samplv1.dir/samplv1_config.cpp.o
 [  7%] Building CXX object src/CMakeFiles/samplv1.dir/samplv1_autogen/mocs_compilation.cpp.o
 [  7%] Building CXX object src/CMakeFiles/samplv1.dir/samplv1.cpp.o
+[  7%] Building CXX object src/CMakeFiles/samplv1.dir/samplv1_config.cpp.o
+[  9%] Building CXX object src/CMakeFiles/samplv1.dir/samplv1_formant.cpp.o
 cd /build/reproducible-path/samplv1-1.3.0/obj-arm-linux-gnueabihf/src && /usr/bin/c++ -DQT_CORE_LIB -DQT_NO_DEBUG -DQT_XML_LIB -I/build/reproducible-path/samplv1-1.3.0/obj-arm-linux-gnueabihf/src -I/build/reproducible-path/samplv1-1.3.0/src -I/build/reproducible-path/samplv1-1.3.0/obj-arm-linux-gnueabihf/src/samplv1_autogen/include -I/build/reproducible-path/samplv1-1.3.0/src/lv2 -isystem /usr/include/arm-linux-gnueabihf/qt6/QtCore -isystem /usr/include/arm-linux-gnueabihf/qt6 -isystem /usr/lib/arm-linux-gnueabihf/qt6/mkspecs/linux-g++ -isystem /usr/include/arm-linux-gnueabihf/qt6/QtXml -isystem /usr/include/opus -g -O2 -ffile-prefix-map=/build/reproducible-path/samplv1-1.3.0=. -fstack-protector-strong -fstack-clash-protection -Wformat -Werror=format-security -D_LARGEFILE_SOURCE -D_FILE_OFFSET_BITS=64 -D_TIME_BITS=64 -Wdate-time -D_FORTIFY_SOURCE=2 -O3 -DNDEBUG -std=gnu++17 -fvisibility=hidden -fvisibility-inlines-hidden -ffast-math -fPIC -MD -MT src/CMakeFiles/samplv1.dir/samplv1.cpp.o -MF CMakeFiles/samplv1.dir/samplv1.cpp.o.d -o CMakeFiles/samplv1.dir/samplv1.cpp.o -c /build/reproducible-path/samplv1-1.3.0/src/samplv1.cpp
 cd /build/reproducible-path/samplv1-1.3.0/obj-arm-linux-gnueabihf/src && /usr/bin/c++ -DQT_CORE_LIB -DQT_NO_DEBUG -DQT_XML_LIB -I/build/reproducible-path/samplv1-1.3.0/obj-arm-linux-gnueabihf/src -I/build/reproducible-path/samplv1-1.3.0/src -I/build/reproducible-path/samplv1-1.3.0/obj-arm-linux-gnueabihf/src/samplv1_autogen/include -I/build/reproducible-path/samplv1-1.3.0/src/lv2 -isystem /usr/include/arm-linux-gnueabihf/qt6/QtCore -isystem /usr/include/arm-linux-gnueabihf/qt6 -isystem /usr/lib/arm-linux-gnueabihf/qt6/mkspecs/linux-g++ -isystem /usr/include/arm-linux-gnueabihf/qt6/QtXml -isystem /usr/include/opus -g -O2 -ffile-prefix-map=/build/reproducible-path/samplv1-1.3.0=. -fstack-protector-strong -fstack-clash-protection -Wformat -Werror=format-security -D_LARGEFILE_SOURCE -D_FILE_OFFSET_BITS=64 -D_TIME_BITS=64 -Wdate-time -D_FORTIFY_SOURCE=2 -O3 -DNDEBUG -std=gnu++17 -fvisibility=hidden -fvisibility-inlines-hidden -ffast-math -fPIC -MD -MT src/CMakeFiles/samplv1.dir/samplv1_autogen/mocs_compilation.cpp.o -MF CMakeFiles/samplv1.dir/samplv1_autogen/mocs_compilation.cpp.o.d -o CMakeFiles/samplv1.dir/samplv1_autogen/mocs_compilation.cpp.o -c /build/reproducible-path/samplv1-1.3.0/obj-arm-linux-gnueabihf/src/samplv1_autogen/mocs_compilation.cpp
 cd /build/reproducible-path/samplv1-1.3.0/obj-arm-linux-gnueabihf/src && /usr/bin/c++ -DQT_CORE_LIB -DQT_NO_DEBUG -DQT_XML_LIB -I/build/reproducible-path/samplv1-1.3.0/obj-arm-linux-gnueabihf/src -I/build/reproducible-path/samplv1-1.3.0/src -I/build/reproducible-path/samplv1-1.3.0/obj-arm-linux-gnueabihf/src/samplv1_autogen/include -I/build/reproducible-path/samplv1-1.3.0/src/lv2 -isystem /usr/include/arm-linux-gnueabihf/qt6/QtCore -isystem /usr/include/arm-linux-gnueabihf/qt6 -isystem /usr/lib/arm-linux-gnueabihf/qt6/mkspecs/linux-g++ -isystem /usr/include/arm-linux-gnueabihf/qt6/QtXml -isystem /usr/include/opus -g -O2 -ffile-prefix-map=/build/reproducible-path/samplv1-1.3.0=. -fstack-protector-strong -fstack-clash-protection -Wformat -Werror=format-security -D_LARGEFILE_SOURCE -D_FILE_OFFSET_BITS=64 -D_TIME_BITS=64 -Wdate-time -D_FORTIFY_SOURCE=2 -O3 -DNDEBUG -std=gnu++17 -fvisibility=hidden -fvisibility-inlines-hidden -ffast-math -fPIC -MD -MT src/CMakeFiles/samplv1.dir/samplv1_config.cpp.o -MF CMakeFiles/samplv1.dir/samplv1_config.cpp.o.d -o CMakeFiles/samplv1.dir/samplv1_config.cpp.o -c /build/reproducible-path/samplv1-1.3.0/src/samplv1_config.cpp
-[  9%] Building CXX object src/CMakeFiles/samplv1.dir/samplv1_formant.cpp.o
 cd /build/reproducible-path/samplv1-1.3.0/obj-arm-linux-gnueabihf/src && /usr/bin/c++ -DQT_CORE_LIB -DQT_NO_DEBUG -DQT_XML_LIB -I/build/reproducible-path/samplv1-1.3.0/obj-arm-linux-gnueabihf/src -I/build/reproducible-path/samplv1-1.3.0/src -I/build/reproducible-path/samplv1-1.3.0/obj-arm-linux-gnueabihf/src/samplv1_autogen/include -I/build/reproducible-path/samplv1-1.3.0/src/lv2 -isystem /usr/include/arm-linux-gnueabihf/qt6/QtCore -isystem /usr/include/arm-linux-gnueabihf/qt6 -isystem /usr/lib/arm-linux-gnueabihf/qt6/mkspecs/linux-g++ -isystem /usr/include/arm-linux-gnueabihf/qt6/QtXml -isystem /usr/include/opus -g -O2 -ffile-prefix-map=/build/reproducible-path/samplv1-1.3.0=. -fstack-protector-strong -fstack-clash-protection -Wformat -Werror=format-security -D_LARGEFILE_SOURCE -D_FILE_OFFSET_BITS=64 -D_TIME_BITS=64 -Wdate-time -D_FORTIFY_SOURCE=2 -O3 -DNDEBUG -std=gnu++17 -fvisibility=hidden -fvisibility-inlines-hidden -ffast-math -fPIC -MD -MT src/CMakeFiles/samplv1.dir/samplv1_formant.cpp.o -MF CMakeFiles/samplv1.dir/samplv1_formant.cpp.o.d -o CMakeFiles/samplv1.dir/samplv1_formant.cpp.o -c /build/reproducible-path/samplv1-1.3.0/src/samplv1_formant.cpp
 [ 11%] Building CXX object src/CMakeFiles/samplv1.dir/samplv1_pshifter.cpp.o
 cd /build/reproducible-path/samplv1-1.3.0/obj-arm-linux-gnueabihf/src && /usr/bin/c++ -DQT_CORE_LIB -DQT_NO_DEBUG -DQT_XML_LIB -I/build/reproducible-path/samplv1-1.3.0/obj-arm-linux-gnueabihf/src -I/build/reproducible-path/samplv1-1.3.0/src -I/build/reproducible-path/samplv1-1.3.0/obj-arm-linux-gnueabihf/src/samplv1_autogen/include -I/build/reproducible-path/samplv1-1.3.0/src/lv2 -isystem /usr/include/arm-linux-gnueabihf/qt6/QtCore -isystem /usr/include/arm-linux-gnueabihf/qt6 -isystem /usr/lib/arm-linux-gnueabihf/qt6/mkspecs/linux-g++ -isystem /usr/include/arm-linux-gnueabihf/qt6/QtXml -isystem /usr/include/opus -g -O2 -ffile-prefix-map=/build/reproducible-path/samplv1-1.3.0=. -fstack-protector-strong -fstack-clash-protection -Wformat -Werror=format-security -D_LARGEFILE_SOURCE -D_FILE_OFFSET_BITS=64 -D_TIME_BITS=64 -Wdate-time -D_FORTIFY_SOURCE=2 -O3 -DNDEBUG -std=gnu++17 -fvisibility=hidden -fvisibility-inlines-hidden -ffast-math -fPIC -MD -MT src/CMakeFiles/samplv1.dir/samplv1_pshifter.cpp.o -MF CMakeFiles/samplv1.dir/samplv1_pshifter.cpp.o.d -o CMakeFiles/samplv1.dir/samplv1_pshifter.cpp.o -c /build/reproducible-path/samplv1-1.3.0/src/samplv1_pshifter.cpp
@@ -1742,13 +1778,13 @@
 make[3]: Leaving directory '/build/reproducible-path/samplv1-1.3.0/obj-arm-linux-gnueabihf'
 make  -f src/CMakeFiles/samplv1_ui.dir/build.make src/CMakeFiles/samplv1_ui.dir/build
 make[3]: Entering directory '/build/reproducible-path/samplv1-1.3.0/obj-arm-linux-gnueabihf'
+[ 40%] Building CXX object src/CMakeFiles/samplv1_ui.dir/samplv1widget.cpp.o
 [ 40%] Building CXX object src/CMakeFiles/samplv1_ui.dir/samplv1_ui_autogen/mocs_compilation.cpp.o
 [ 40%] Building CXX object src/CMakeFiles/samplv1_ui.dir/samplv1_ui.cpp.o
-[ 40%] Building CXX object src/CMakeFiles/samplv1_ui.dir/samplv1widget.cpp.o
-cd /build/reproducible-path/samplv1-1.3.0/obj-arm-linux-gnueabihf/src && /usr/bin/c++ -DQT_CORE_LIB -DQT_GUI_LIB -DQT_NO_DEBUG -DQT_SVG_LIB -DQT_WIDGETS_LIB -DQT_XML_LIB -I/build/reproducible-path/samplv1-1.3.0/obj-arm-linux-gnueabihf/src -I/build/reproducible-path/samplv1-1.3.0/src -I/build/reproducible-path/samplv1-1.3.0/obj-arm-linux-gnueabihf/src/samplv1_ui_autogen/include -I/build/reproducible-path/samplv1-1.3.0/src/lv2 -isystem /usr/include/arm-linux-gnueabihf/qt6/QtWidgets -isystem /usr/include/arm-linux-gnueabihf/qt6 -isystem /usr/include/arm-linux-gnueabihf/qt6/QtCore -isystem /usr/lib/arm-linux-gnueabihf/qt6/mkspecs/linux-g++ -isystem /usr/include/arm-linux-gnueabihf/qt6/QtGui -isystem /usr/include/arm-linux-gnueabihf/qt6/QtSvg -isystem /usr/include/arm-linux-gnueabihf/qt6/QtXml -g -O2 -ffile-prefix-map=/build/reproducible-path/samplv1-1.3.0=. -fstack-protector-strong -fstack-clash-protection -Wformat -Werror=format-security -D_LARGEFILE_SOURCE -D_FILE_OFFSET_BITS=64 -D_TIME_BITS=64 -Wdate-time -D_FORTIFY_SOURCE=2 -O3 -DNDEBUG -std=gnu++17 -fvisibility=hidden -fvisibility-inlines-hidden -ffast-math -fPIC -MD -MT src/CMakeFiles/samplv1_ui.dir/samplv1_ui_autogen/mocs_compilation.cpp.o -MF CMakeFiles/samplv1_ui.dir/samplv1_ui_autogen/mocs_compilation.cpp.o.d -o CMakeFiles/samplv1_ui.dir/samplv1_ui_autogen/mocs_compilation.cpp.o -c /build/reproducible-path/samplv1-1.3.0/obj-arm-linux-gnueabihf/src/samplv1_ui_autogen/mocs_compilation.cpp
+[ 42%] Building CXX object src/CMakeFiles/samplv1_ui.dir/samplv1widget_env.cpp.o
 cd /build/reproducible-path/samplv1-1.3.0/obj-arm-linux-gnueabihf/src && /usr/bin/c++ -DQT_CORE_LIB -DQT_GUI_LIB -DQT_NO_DEBUG -DQT_SVG_LIB -DQT_WIDGETS_LIB -DQT_XML_LIB -I/build/reproducible-path/samplv1-1.3.0/obj-arm-linux-gnueabihf/src -I/build/reproducible-path/samplv1-1.3.0/src -I/build/reproducible-path/samplv1-1.3.0/obj-arm-linux-gnueabihf/src/samplv1_ui_autogen/include -I/build/reproducible-path/samplv1-1.3.0/src/lv2 -isystem /usr/include/arm-linux-gnueabihf/qt6/QtWidgets -isystem /usr/include/arm-linux-gnueabihf/qt6 -isystem /usr/include/arm-linux-gnueabihf/qt6/QtCore -isystem /usr/lib/arm-linux-gnueabihf/qt6/mkspecs/linux-g++ -isystem /usr/include/arm-linux-gnueabihf/qt6/QtGui -isystem /usr/include/arm-linux-gnueabihf/qt6/QtSvg -isystem /usr/include/arm-linux-gnueabihf/qt6/QtXml -g -O2 -ffile-prefix-map=/build/reproducible-path/samplv1-1.3.0=. -fstack-protector-strong -fstack-clash-protection -Wformat -Werror=format-security -D_LARGEFILE_SOURCE -D_FILE_OFFSET_BITS=64 -D_TIME_BITS=64 -Wdate-time -D_FORTIFY_SOURCE=2 -O3 -DNDEBUG -std=gnu++17 -fvisibility=hidden -fvisibility-inlines-hidden -ffast-math -fPIC -MD -MT src/CMakeFiles/samplv1_ui.dir/samplv1_ui.cpp.o -MF CMakeFiles/samplv1_ui.dir/samplv1_ui.cpp.o.d -o CMakeFiles/samplv1_ui.dir/samplv1_ui.cpp.o -c /build/reproducible-path/samplv1-1.3.0/src/samplv1_ui.cpp
+cd /build/reproducible-path/samplv1-1.3.0/obj-arm-linux-gnueabihf/src && /usr/bin/c++ -DQT_CORE_LIB -DQT_GUI_LIB -DQT_NO_DEBUG -DQT_SVG_LIB -DQT_WIDGETS_LIB -DQT_XML_LIB -I/build/reproducible-path/samplv1-1.3.0/obj-arm-linux-gnueabihf/src -I/build/reproducible-path/samplv1-1.3.0/src -I/build/reproducible-path/samplv1-1.3.0/obj-arm-linux-gnueabihf/src/samplv1_ui_autogen/include -I/build/reproducible-path/samplv1-1.3.0/src/lv2 -isystem /usr/include/arm-linux-gnueabihf/qt6/QtWidgets -isystem /usr/include/arm-linux-gnueabihf/qt6 -isystem /usr/include/arm-linux-gnueabihf/qt6/QtCore -isystem /usr/lib/arm-linux-gnueabihf/qt6/mkspecs/linux-g++ -isystem /usr/include/arm-linux-gnueabihf/qt6/QtGui -isystem /usr/include/arm-linux-gnueabihf/qt6/QtSvg -isystem /usr/include/arm-linux-gnueabihf/qt6/QtXml -g -O2 -ffile-prefix-map=/build/reproducible-path/samplv1-1.3.0=. -fstack-protector-strong -fstack-clash-protection -Wformat -Werror=format-security -D_LARGEFILE_SOURCE -D_FILE_OFFSET_BITS=64 -D_TIME_BITS=64 -Wdate-time -D_FORTIFY_SOURCE=2 -O3 -DNDEBUG -std=gnu++17 -fvisibility=hidden -fvisibility-inlines-hidden -ffast-math -fPIC -MD -MT src/CMakeFiles/samplv1_ui.dir/samplv1_ui_autogen/mocs_compilation.cpp.o -MF CMakeFiles/samplv1_ui.dir/samplv1_ui_autogen/mocs_compilation.cpp.o.d -o CMakeFiles/samplv1_ui.dir/samplv1_ui_autogen/mocs_compilation.cpp.o -c /build/reproducible-path/samplv1-1.3.0/obj-arm-linux-gnueabihf/src/samplv1_ui_autogen/mocs_compilation.cpp
 cd /build/reproducible-path/samplv1-1.3.0/obj-arm-linux-gnueabihf/src && /usr/bin/c++ -DQT_CORE_LIB -DQT_GUI_LIB -DQT_NO_DEBUG -DQT_SVG_LIB -DQT_WIDGETS_LIB -DQT_XML_LIB -I/build/reproducible-path/samplv1-1.3.0/obj-arm-linux-gnueabihf/src -I/build/reproducible-path/samplv1-1.3.0/src -I/build/reproducible-path/samplv1-1.3.0/obj-arm-linux-gnueabihf/src/samplv1_ui_autogen/include -I/build/reproducible-path/samplv1-1.3.0/src/lv2 -isystem /usr/include/arm-linux-gnueabihf/qt6/QtWidgets -isystem /usr/include/arm-linux-gnueabihf/qt6 -isystem /usr/include/arm-linux-gnueabihf/qt6/QtCore -isystem /usr/lib/arm-linux-gnueabihf/qt6/mkspecs/linux-g++ -isystem /usr/include/arm-linux-gnueabihf/qt6/QtGui -isystem /usr/include/arm-linux-gnueabihf/qt6/QtSvg -isystem /usr/include/arm-linux-gnueabihf/qt6/QtXml -g -O2 -ffile-prefix-map=/build/reproducible-path/samplv1-1.3.0=. -fstack-protector-strong -fstack-clash-protection -Wformat -Werror=format-security -D_LARGEFILE_SOURCE -D_FILE_OFFSET_BITS=64 -D_TIME_BITS=64 -Wdate-time -D_FORTIFY_SOURCE=2 -O3 -DNDEBUG -std=gnu++17 -fvisibility=hidden -fvisibility-inlines-hidden -ffast-math -fPIC -MD -MT src/CMakeFiles/samplv1_ui.dir/samplv1widget.cpp.o -MF CMakeFiles/samplv1_ui.dir/samplv1widget.cpp.o.d -o CMakeFiles/samplv1_ui.dir/samplv1widget.cpp.o -c /build/reproducible-path/samplv1-1.3.0/src/samplv1widget.cpp
-[ 42%] Building CXX object src/CMakeFiles/samplv1_ui.dir/samplv1widget_env.cpp.o
 cd /build/reproducible-path/samplv1-1.3.0/obj-arm-linux-gnueabihf/src && /usr/bin/c++ -DQT_CORE_LIB -DQT_GUI_LIB -DQT_NO_DEBUG -DQT_SVG_LIB -DQT_WIDGETS_LIB -DQT_XML_LIB -I/build/reproducible-path/samplv1-1.3.0/obj-arm-linux-gnueabihf/src -I/build/reproducible-path/samplv1-1.3.0/src -I/build/reproducible-path/samplv1-1.3.0/obj-arm-linux-gnueabihf/src/samplv1_ui_autogen/include -I/build/reproducible-path/samplv1-1.3.0/src/lv2 -isystem /usr/include/arm-linux-gnueabihf/qt6/QtWidgets -isystem /usr/include/arm-linux-gnueabihf/qt6 -isystem /usr/include/arm-linux-gnueabihf/qt6/QtCore -isystem /usr/lib/arm-linux-gnueabihf/qt6/mkspecs/linux-g++ -isystem /usr/include/arm-linux-gnueabihf/qt6/QtGui -isystem /usr/include/arm-linux-gnueabihf/qt6/QtSvg -isystem /usr/include/arm-linux-gnueabihf/qt6/QtXml -g -O2 -ffile-prefix-map=/build/reproducible-path/samplv1-1.3.0=. -fstack-protector-strong -fstack-clash-protection -Wformat -Werror=format-security -D_LARGEFILE_SOURCE -D_FILE_OFFSET_BITS=64 -D_TIME_BITS=64 -Wdate-time -D_FORTIFY_SOURCE=2 -O3 -DNDEBUG -std=gnu++17 -fvisibility=hidden -fvisibility-inlines-hidden -ffast-math -fPIC -MD -MT src/CMakeFiles/samplv1_ui.dir/samplv1widget_env.cpp.o -MF CMakeFiles/samplv1_ui.dir/samplv1widget_env.cpp.o.d -o CMakeFiles/samplv1_ui.dir/samplv1widget_env.cpp.o -c /build/reproducible-path/samplv1-1.3.0/src/samplv1widget_env.cpp
 [ 44%] Building CXX object src/CMakeFiles/samplv1_ui.dir/samplv1widget_filt.cpp.o
 cd /build/reproducible-path/samplv1-1.3.0/obj-arm-linux-gnueabihf/src && /usr/bin/c++ -DQT_CORE_LIB -DQT_GUI_LIB -DQT_NO_DEBUG -DQT_SVG_LIB -DQT_WIDGETS_LIB -DQT_XML_LIB -I/build/reproducible-path/samplv1-1.3.0/obj-arm-linux-gnueabihf/src -I/build/reproducible-path/samplv1-1.3.0/src -I/build/reproducible-path/samplv1-1.3.0/obj-arm-linux-gnueabihf/src/samplv1_ui_autogen/include -I/build/reproducible-path/samplv1-1.3.0/src/lv2 -isystem /usr/include/arm-linux-gnueabihf/qt6/QtWidgets -isystem /usr/include/arm-linux-gnueabihf/qt6 -isystem /usr/include/arm-linux-gnueabihf/qt6/QtCore -isystem /usr/lib/arm-linux-gnueabihf/qt6/mkspecs/linux-g++ -isystem /usr/include/arm-linux-gnueabihf/qt6/QtGui -isystem /usr/include/arm-linux-gnueabihf/qt6/QtSvg -isystem /usr/include/arm-linux-gnueabihf/qt6/QtXml -g -O2 -ffile-prefix-map=/build/reproducible-path/samplv1-1.3.0=. -fstack-protector-strong -fstack-clash-protection -Wformat -Werror=format-security -D_LARGEFILE_SOURCE -D_FILE_OFFSET_BITS=64 -D_TIME_BITS=64 -Wdate-time -D_FORTIFY_SOURCE=2 -O3 -DNDEBUG -std=gnu++17 -fvisibility=hidden -fvisibility-inlines-hidden -ffast-math -fPIC -MD -MT src/CMakeFiles/samplv1_ui.dir/samplv1widget_filt.cpp.o -MF CMakeFiles/samplv1_ui.dir/samplv1widget_filt.cpp.o.d -o CMakeFiles/samplv1_ui.dir/samplv1widget_filt.cpp.o -c /build/reproducible-path/samplv1-1.3.0/src/samplv1widget_filt.cpp
@@ -1793,25 +1829,25 @@
 cd /build/reproducible-path/samplv1-1.3.0/obj-arm-linux-gnueabihf && /usr/bin/cmake -E cmake_depends "Unix Makefiles" /build/reproducible-path/samplv1-1.3.0 /build/reproducible-path/samplv1-1.3.0/src /build/reproducible-path/samplv1-1.3.0/obj-arm-linux-gnueabihf /build/reproducible-path/samplv1-1.3.0/obj-arm-linux-gnueabihf/src /build/reproducible-path/samplv1-1.3.0/obj-arm-linux-gnueabihf/src/CMakeFiles/samplv1_jack_autogen_timestamp_deps.dir/DependInfo.cmake "--color="
 make[3]: Leaving directory '/build/reproducible-path/samplv1-1.3.0/obj-arm-linux-gnueabihf'
 make[3]: Leaving directory '/build/reproducible-path/samplv1-1.3.0/obj-arm-linux-gnueabihf'
-make  -f src/CMakeFiles/samplv1_lv2_autogen_timestamp_deps.dir/build.make src/CMakeFiles/samplv1_lv2_autogen_timestamp_deps.dir/build
 make  -f src/CMakeFiles/samplv1_jack_autogen_timestamp_deps.dir/build.make src/CMakeFiles/samplv1_jack_autogen_timestamp_deps.dir/build
+make  -f src/CMakeFiles/samplv1_lv2_autogen_timestamp_deps.dir/build.make src/CMakeFiles/samplv1_lv2_autogen_timestamp_deps.dir/build
 make[3]: Entering directory '/build/reproducible-path/samplv1-1.3.0/obj-arm-linux-gnueabihf'
-make[3]: Nothing to be done for 'src/CMakeFiles/samplv1_lv2_autogen_timestamp_deps.dir/build'.
+make[3]: Nothing to be done for 'src/CMakeFiles/samplv1_jack_autogen_timestamp_deps.dir/build'.
 make[3]: Leaving directory '/build/reproducible-path/samplv1-1.3.0/obj-arm-linux-gnueabihf'
 make[3]: Entering directory '/build/reproducible-path/samplv1-1.3.0/obj-arm-linux-gnueabihf'
-make[3]: Nothing to be done for 'src/CMakeFiles/samplv1_jack_autogen_timestamp_deps.dir/build'.
+make[3]: Nothing to be done for 'src/CMakeFiles/samplv1_lv2_autogen_timestamp_deps.dir/build'.
 make[3]: Leaving directory '/build/reproducible-path/samplv1-1.3.0/obj-arm-linux-gnueabihf'
 [ 73%] Built target samplv1_lv2_autogen_timestamp_deps
 [ 73%] Built target samplv1_jack_autogen_timestamp_deps
 make  -f src/CMakeFiles/samplv1_lv2_autogen.dir/build.make src/CMakeFiles/samplv1_lv2_autogen.dir/depend
 make  -f src/CMakeFiles/samplv1_jack_autogen.dir/build.make src/CMakeFiles/samplv1_jack_autogen.dir/depend
 make[3]: Entering directory '/build/reproducible-path/samplv1-1.3.0/obj-arm-linux-gnueabihf'
-cd /build/reproducible-path/samplv1-1.3.0/obj-arm-linux-gnueabihf && /usr/bin/cmake -E cmake_depends "Unix Makefiles" /build/reproducible-path/samplv1-1.3.0 /build/reproducible-path/samplv1-1.3.0/src /build/reproducible-path/samplv1-1.3.0/obj-arm-linux-gnueabihf /build/reproducible-path/samplv1-1.3.0/obj-arm-linux-gnueabihf/src /build/reproducible-path/samplv1-1.3.0/obj-arm-linux-gnueabihf/src/CMakeFiles/samplv1_jack_autogen.dir/DependInfo.cmake "--color="
-make[3]: Entering directory '/build/reproducible-path/samplv1-1.3.0/obj-arm-linux-gnueabihf'
 cd /build/reproducible-path/samplv1-1.3.0/obj-arm-linux-gnueabihf && /usr/bin/cmake -E cmake_depends "Unix Makefiles" /build/reproducible-path/samplv1-1.3.0 /build/reproducible-path/samplv1-1.3.0/src /build/reproducible-path/samplv1-1.3.0/obj-arm-linux-gnueabihf /build/reproducible-path/samplv1-1.3.0/obj-arm-linux-gnueabihf/src /build/reproducible-path/samplv1-1.3.0/obj-arm-linux-gnueabihf/src/CMakeFiles/samplv1_lv2_autogen.dir/DependInfo.cmake "--color="
+make[3]: Entering directory '/build/reproducible-path/samplv1-1.3.0/obj-arm-linux-gnueabihf'
+cd /build/reproducible-path/samplv1-1.3.0/obj-arm-linux-gnueabihf && /usr/bin/cmake -E cmake_depends "Unix Makefiles" /build/reproducible-path/samplv1-1.3.0 /build/reproducible-path/samplv1-1.3.0/src /build/reproducible-path/samplv1-1.3.0/obj-arm-linux-gnueabihf /build/reproducible-path/samplv1-1.3.0/obj-arm-linux-gnueabihf/src /build/reproducible-path/samplv1-1.3.0/obj-arm-linux-gnueabihf/src/CMakeFiles/samplv1_jack_autogen.dir/DependInfo.cmake "--color="
 make[3]: Leaving directory '/build/reproducible-path/samplv1-1.3.0/obj-arm-linux-gnueabihf'
-make  -f src/CMakeFiles/samplv1_lv2_autogen.dir/build.make src/CMakeFiles/samplv1_lv2_autogen.dir/build
 make[3]: Leaving directory '/build/reproducible-path/samplv1-1.3.0/obj-arm-linux-gnueabihf'
+make  -f src/CMakeFiles/samplv1_lv2_autogen.dir/build.make src/CMakeFiles/samplv1_lv2_autogen.dir/build
 make  -f src/CMakeFiles/samplv1_jack_autogen.dir/build.make src/CMakeFiles/samplv1_jack_autogen.dir/build
 make[3]: Entering directory '/build/reproducible-path/samplv1-1.3.0/obj-arm-linux-gnueabihf'
 make[3]: Entering directory '/build/reproducible-path/samplv1-1.3.0/obj-arm-linux-gnueabihf'
@@ -1821,16 +1857,16 @@
 cd /build/reproducible-path/samplv1-1.3.0/obj-arm-linux-gnueabihf/src && /usr/bin/cmake -E cmake_autogen /build/reproducible-path/samplv1-1.3.0/obj-arm-linux-gnueabihf/src/CMakeFiles/samplv1_jack_autogen.dir/AutogenInfo.json Release
 AutoGen: Refreshing parse cache because it doesn't exist.
 AutoGen: Refreshing parse cache because it doesn't exist.
-AutoMoc: Generating "SRC:/obj-arm-linux-gnueabihf/src/samplv1_jack_autogen/moc_predefs.h", because it doesn't exist.
-/usr/bin/c++ -std=gnu++17 -dM -E -c /usr/share/cmake-3.31/Modules/CMakeCXXCompilerABI.cpp -DQT_CORE_LIB -DQT_GUI_LIB -DQT_NO_DEBUG -DQT_SVG_LIB -DQT_WIDGETS_LIB -DQT_XML_LIB -I/build/reproducible-path/samplv1-1.3.0/obj-arm-linux-gnueabihf/src -I/build/reproducible-path/samplv1-1.3.0/src -I/build/reproducible-path/samplv1-1.3.0/src/lv2 -I/usr/include/arm-linux-gnueabihf/qt6/QtWidgets -I/usr/include/arm-linux-gnueabihf/qt6 -I/usr/include/arm-linux-gnueabihf/qt6/QtCore -I/usr/lib/arm-linux-gnueabihf/qt6/mkspecs/linux-g++ -I/usr/include/arm-linux-gnueabihf/qt6/QtGui -I/usr/include/arm-linux-gnueabihf/qt6/QtSvg -I/usr/include/arm-linux-gnueabihf/qt6/QtXml -I/usr/include -I/usr/include/c++/14 -I/usr/include/arm-linux-gnueabihf/c++/14 -I/usr/include/c++/14/backward -I/usr/lib/gcc/arm-linux-gnueabihf/14/include -I/usr/local/include -I/usr/include/arm-linux-gnueabihf
 AutoMoc: Generating "SRC:/obj-arm-linux-gnueabihf/src/samplv1_lv2_autogen/moc_predefs.h", because it doesn't exist.
 /usr/bin/c++ -std=gnu++17 -dM -E -c /usr/share/cmake-3.31/Modules/CMakeCXXCompilerABI.cpp -DQT_CORE_LIB -DQT_GUI_LIB -DQT_NO_DEBUG -DQT_SVG_LIB -DQT_WIDGETS_LIB -DQT_XML_LIB -Dsamplv1_lv2_EXPORTS -I/build/reproducible-path/samplv1-1.3.0/obj-arm-linux-gnueabihf/src -I/build/reproducible-path/samplv1-1.3.0/src -I/build/reproducible-path/samplv1-1.3.0/src/lv2 -I/usr/include/arm-linux-gnueabihf/qt6/QtWidgets -I/usr/include/arm-linux-gnueabihf/qt6 -I/usr/include/arm-linux-gnueabihf/qt6/QtCore -I/usr/lib/arm-linux-gnueabihf/qt6/mkspecs/linux-g++ -I/usr/include/arm-linux-gnueabihf/qt6/QtGui -I/usr/include/arm-linux-gnueabihf/qt6/QtSvg -I/usr/include/arm-linux-gnueabihf/qt6/QtXml -I/usr/include -I/usr/include/c++/14 -I/usr/include/arm-linux-gnueabihf/c++/14 -I/usr/include/c++/14/backward -I/usr/lib/gcc/arm-linux-gnueabihf/14/include -I/usr/local/include -I/usr/include/arm-linux-gnueabihf
+AutoMoc: Generating "SRC:/obj-arm-linux-gnueabihf/src/samplv1_jack_autogen/moc_predefs.h", because it doesn't exist.
+/usr/bin/c++ -std=gnu++17 -dM -E -c /usr/share/cmake-3.31/Modules/CMakeCXXCompilerABI.cpp -DQT_CORE_LIB -DQT_GUI_LIB -DQT_NO_DEBUG -DQT_SVG_LIB -DQT_WIDGETS_LIB -DQT_XML_LIB -I/build/reproducible-path/samplv1-1.3.0/obj-arm-linux-gnueabihf/src -I/build/reproducible-path/samplv1-1.3.0/src -I/build/reproducible-path/samplv1-1.3.0/src/lv2 -I/usr/include/arm-linux-gnueabihf/qt6/QtWidgets -I/usr/include/arm-linux-gnueabihf/qt6 -I/usr/include/arm-linux-gnueabihf/qt6/QtCore -I/usr/lib/arm-linux-gnueabihf/qt6/mkspecs/linux-g++ -I/usr/include/arm-linux-gnueabihf/qt6/QtGui -I/usr/include/arm-linux-gnueabihf/qt6/QtSvg -I/usr/include/arm-linux-gnueabihf/qt6/QtXml -I/usr/include -I/usr/include/c++/14 -I/usr/include/arm-linux-gnueabihf/c++/14 -I/usr/include/c++/14/backward -I/usr/lib/gcc/arm-linux-gnueabihf/14/include -I/usr/local/include -I/usr/include/arm-linux-gnueabihf
 AutoGen: Parsing "SRC:/src/samplv1_lv2.h"
 AutoGen: Parsing "SRC:/src/samplv1_jack.h"
 AutoGen: Parsing "SRC:/src/samplv1_lv2ui.h"
 AutoGen: Parsing "SRC:/src/samplv1_nsm.h"
-AutoGen: Parsing "SRC:/src/samplv1widget_jack.h"
 AutoGen: Parsing "SRC:/src/samplv1widget_lv2.h"
+AutoGen: Parsing "SRC:/src/samplv1widget_jack.h"
 AutoGen: Parsing "SRC:/src/samplv1_jack.cpp"
 AutoGen: Parsing "SRC:/src/samplv1_lv2.cpp"
 AutoGen: Parsing "SRC:/src/samplv1_nsm.cpp"
@@ -1854,140 +1890,62 @@
 make[3]: Leaving directory '/build/reproducible-path/samplv1-1.3.0/obj-arm-linux-gnueabihf'
 make  -f src/CMakeFiles/samplv1_lv2.dir/build.make src/CMakeFiles/samplv1_lv2.dir/build
 make[3]: Entering directory '/build/reproducible-path/samplv1-1.3.0/obj-arm-linux-gnueabihf'
-[ 80%] Building CXX object src/CMakeFiles/samplv1_lv2.dir/samplv1_lv2.cpp.o
-[ 80%] Building CXX object src/CMakeFiles/samplv1_lv2.dir/samplv1_lv2_autogen/mocs_compilation.cpp.o
-cd /build/reproducible-path/samplv1-1.3.0/obj-arm-linux-gnueabihf/src && /usr/bin/c++ -DQT_CORE_LIB -DQT_GUI_LIB -DQT_NO_DEBUG -DQT_SVG_LIB -DQT_WIDGETS_LIB -DQT_XML_LIB -Dsamplv1_lv2_EXPORTS -I/build/reproducible-path/samplv1-1.3.0/obj-arm-linux-gnueabihf/src -I/build/reproducible-path/samplv1-1.3.0/src -I/build/reproducible-path/samplv1-1.3.0/obj-arm-linux-gnueabihf/src/samplv1_lv2_autogen/include -I/build/reproducible-path/samplv1-1.3.0/src/lv2 -isystem /usr/include/arm-linux-gnueabihf/qt6/QtWidgets -isystem /usr/include/arm-linux-gnueabihf/qt6 -isystem /usr/include/arm-linux-gnueabihf/qt6/QtCore -isystem /usr/lib/arm-linux-gnueabihf/qt6/mkspecs/linux-g++ -isystem /usr/include/arm-linux-gnueabihf/qt6/QtGui -isystem /usr/include/arm-linux-gnueabihf/qt6/QtSvg -isystem /usr/include/arm-linux-gnueabihf/qt6/QtXml -g -O2 -ffile-prefix-map=/build/reproducible-path/samplv1-1.3.0=. -fstack-protector-strong -fstack-clash-protection -Wformat -Werror=format-security -D_LARGEFILE_SOURCE -D_FILE_OFFSET_BITS=64 -D_TIME_BITS=64 -Wdate-time -D_FORTIFY_SOURCE=2 -O3 -DNDEBUG -std=gnu++17 -fPIC -fvisibility=hidden -fvisibility-inlines-hidden -ffast-math -MD -MT src/CMakeFiles/samplv1_lv2.dir/samplv1_lv2_autogen/mocs_compilation.cpp.o -MF CMakeFiles/samplv1_lv2.dir/samplv1_lv2_autogen/mocs_compilation.cpp.o.d -o CMakeFiles/samplv1_lv2.dir/samplv1_lv2_autogen/mocs_compilation.cpp.o -c /build/reproducible-path/samplv1-1.3.0/obj-arm-linux-gnueabihf/src/samplv1_lv2_autogen/mocs_compilation.cpp
-cd /build/reproducible-path/samplv1-1.3.0/obj-arm-linux-gnueabihf/src && /usr/bin/c++ -DQT_CORE_LIB -DQT_GUI_LIB -DQT_NO_DEBUG -DQT_SVG_LIB -DQT_WIDGETS_LIB -DQT_XML_LIB -Dsamplv1_lv2_EXPORTS -I/build/reproducible-path/samplv1-1.3.0/obj-arm-linux-gnueabihf/src -I/build/reproducible-path/samplv1-1.3.0/src -I/build/reproducible-path/samplv1-1.3.0/obj-arm-linux-gnueabihf/src/samplv1_lv2_autogen/include -I/build/reproducible-path/samplv1-1.3.0/src/lv2 -isystem /usr/include/arm-linux-gnueabihf/qt6/QtWidgets -isystem /usr/include/arm-linux-gnueabihf/qt6 -isystem /usr/include/arm-linux-gnueabihf/qt6/QtCore -isystem /usr/lib/arm-linux-gnueabihf/qt6/mkspecs/linux-g++ -isystem /usr/include/arm-linux-gnueabihf/qt6/QtGui -isystem /usr/include/arm-linux-gnueabihf/qt6/QtSvg -isystem /usr/include/arm-linux-gnueabihf/qt6/QtXml -g -O2 -ffile-prefix-map=/build/reproducible-path/samplv1-1.3.0=. -fstack-protector-strong -fstack-clash-protection -Wformat -Werror=format-security -D_LARGEFILE_SOURCE -D_FILE_OFFSET_BITS=64 -D_TIME_BITS=64 -Wdate-time -D_FORTIFY_SOURCE=2 -O3 -DNDEBUG -std=gnu++17 -fPIC -fvisibility=hidden -fvisibility-inlines-hidden -ffast-math -MD -MT src/CMakeFiles/samplv1_lv2.dir/samplv1_lv2.cpp.o -MF CMakeFiles/samplv1_lv2.dir/samplv1_lv2.cpp.o.d -o CMakeFiles/samplv1_lv2.dir/samplv1_lv2.cpp.o -c /build/reproducible-path/samplv1-1.3.0/src/samplv1_lv2.cpp
+[ 82%] Building CXX object src/CMakeFiles/samplv1_lv2.dir/samplv1_lv2_autogen/mocs_compilation.cpp.o
 [ 82%] Building CXX object src/CMakeFiles/samplv1_lv2.dir/samplv1_lv2ui.cpp.o
+[ 82%] Building CXX object src/CMakeFiles/samplv1_lv2.dir/samplv1_lv2.cpp.o
+cd /build/reproducible-path/samplv1-1.3.0/obj-arm-linux-gnueabihf/src && /usr/bin/c++ -DQT_CORE_LIB -DQT_GUI_LIB -DQT_NO_DEBUG -DQT_SVG_LIB -DQT_WIDGETS_LIB -DQT_XML_LIB -Dsamplv1_lv2_EXPORTS -I/build/reproducible-path/samplv1-1.3.0/obj-arm-linux-gnueabihf/src -I/build/reproducible-path/samplv1-1.3.0/src -I/build/reproducible-path/samplv1-1.3.0/obj-arm-linux-gnueabihf/src/samplv1_lv2_autogen/include -I/build/reproducible-path/samplv1-1.3.0/src/lv2 -isystem /usr/include/arm-linux-gnueabihf/qt6/QtWidgets -isystem /usr/include/arm-linux-gnueabihf/qt6 -isystem /usr/include/arm-linux-gnueabihf/qt6/QtCore -isystem /usr/lib/arm-linux-gnueabihf/qt6/mkspecs/linux-g++ -isystem /usr/include/arm-linux-gnueabihf/qt6/QtGui -isystem /usr/include/arm-linux-gnueabihf/qt6/QtSvg -isystem /usr/include/arm-linux-gnueabihf/qt6/QtXml -g -O2 -ffile-prefix-map=/build/reproducible-path/samplv1-1.3.0=. -fstack-protector-strong -fstack-clash-protection -Wformat -Werror=format-security -D_LARGEFILE_SOURCE -D_FILE_OFFSET_BITS=64 -D_TIME_BITS=64 -Wdate-time -D_FORTIFY_SOURCE=2 -O3 -DNDEBUG -std=gnu++17 -fPIC -fvisibility=hidden -fvisibility-inlines-hidden -ffast-math -MD -MT src/CMakeFiles/samplv1_lv2.dir/samplv1_lv2.cpp.o -MF CMakeFiles/samplv1_lv2.dir/samplv1_lv2.cpp.o.d -o CMakeFiles/samplv1_lv2.dir/samplv1_lv2.cpp.o -c /build/reproducible-path/samplv1-1.3.0/src/samplv1_lv2.cpp
+cd /build/reproducible-path/samplv1-1.3.0/obj-arm-linux-gnueabihf/src && /usr/bin/c++ -DQT_CORE_LIB -DQT_GUI_LIB -DQT_NO_DEBUG -DQT_SVG_LIB -DQT_WIDGETS_LIB -DQT_XML_LIB -Dsamplv1_lv2_EXPORTS -I/build/reproducible-path/samplv1-1.3.0/obj-arm-linux-gnueabihf/src -I/build/reproducible-path/samplv1-1.3.0/src -I/build/reproducible-path/samplv1-1.3.0/obj-arm-linux-gnueabihf/src/samplv1_lv2_autogen/include -I/build/reproducible-path/samplv1-1.3.0/src/lv2 -isystem /usr/include/arm-linux-gnueabihf/qt6/QtWidgets -isystem /usr/include/arm-linux-gnueabihf/qt6 -isystem /usr/include/arm-linux-gnueabihf/qt6/QtCore -isystem /usr/lib/arm-linux-gnueabihf/qt6/mkspecs/linux-g++ -isystem /usr/include/arm-linux-gnueabihf/qt6/QtGui -isystem /usr/include/arm-linux-gnueabihf/qt6/QtSvg -isystem /usr/include/arm-linux-gnueabihf/qt6/QtXml -g -O2 -ffile-prefix-map=/build/reproducible-path/samplv1-1.3.0=. -fstack-protector-strong -fstack-clash-protection -Wformat -Werror=format-security -D_LARGEFILE_SOURCE -D_FILE_OFFSET_BITS=64 -D_TIME_BITS=64 -Wdate-time -D_FORTIFY_SOURCE=2 -O3 -DNDEBUG -std=gnu++17 -fPIC -fvisibility=hidden -fvisibility-inlines-hidden -ffast-math -MD -MT src/CMakeFiles/samplv1_lv2.dir/samplv1_lv2_autogen/mocs_compilation.cpp.o -MF CMakeFiles/samplv1_lv2.dir/samplv1_lv2_autogen/mocs_compilation.cpp.o.d -o CMakeFiles/samplv1_lv2.dir/samplv1_lv2_autogen/mocs_compilation.cpp.o -c /build/reproducible-path/samplv1-1.3.0/obj-arm-linux-gnueabihf/src/samplv1_lv2_autogen/mocs_compilation.cpp
 cd /build/reproducible-path/samplv1-1.3.0/obj-arm-linux-gnueabihf/src && /usr/bin/c++ -DQT_CORE_LIB -DQT_GUI_LIB -DQT_NO_DEBUG -DQT_SVG_LIB -DQT_WIDGETS_LIB -DQT_XML_LIB -Dsamplv1_lv2_EXPORTS -I/build/reproducible-path/samplv1-1.3.0/obj-arm-linux-gnueabihf/src -I/build/reproducible-path/samplv1-1.3.0/src -I/build/reproducible-path/samplv1-1.3.0/obj-arm-linux-gnueabihf/src/samplv1_lv2_autogen/include -I/build/reproducible-path/samplv1-1.3.0/src/lv2 -isystem /usr/include/arm-linux-gnueabihf/qt6/QtWidgets -isystem /usr/include/arm-linux-gnueabihf/qt6 -isystem /usr/include/arm-linux-gnueabihf/qt6/QtCore -isystem /usr/lib/arm-linux-gnueabihf/qt6/mkspecs/linux-g++ -isystem /usr/include/arm-linux-gnueabihf/qt6/QtGui -isystem /usr/include/arm-linux-gnueabihf/qt6/QtSvg -isystem /usr/include/arm-linux-gnueabihf/qt6/QtXml -g -O2 -ffile-prefix-map=/build/reproducible-path/samplv1-1.3.0=. -fstack-protector-strong -fstack-clash-protection -Wformat -Werror=format-security -D_LARGEFILE_SOURCE -D_FILE_OFFSET_BITS=64 -D_TIME_BITS=64 -Wdate-time -D_FORTIFY_SOURCE=2 -O3 -DNDEBUG -std=gnu++17 -fPIC -fvisibility=hidden -fvisibility-inlines-hidden -ffast-math -MD -MT src/CMakeFiles/samplv1_lv2.dir/samplv1_lv2ui.cpp.o -MF CMakeFiles/samplv1_lv2.dir/samplv1_lv2ui.cpp.o.d -o CMakeFiles/samplv1_lv2.dir/samplv1_lv2ui.cpp.o -c /build/reproducible-path/samplv1-1.3.0/src/samplv1_lv2ui.cpp
+[ 84%] Building CXX object src/CMakeFiles/samplv1_lv2.dir/samplv1widget_lv2.cpp.o
+cd /build/reproducible-path/samplv1-1.3.0/obj-arm-linux-gnueabihf/src && /usr/bin/c++ -DQT_CORE_LIB -DQT_GUI_LIB -DQT_NO_DEBUG -DQT_SVG_LIB -DQT_WIDGETS_LIB -DQT_XML_LIB -Dsamplv1_lv2_EXPORTS -I/build/reproducible-path/samplv1-1.3.0/obj-arm-linux-gnueabihf/src -I/build/reproducible-path/samplv1-1.3.0/src -I/build/reproducible-path/samplv1-1.3.0/obj-arm-linux-gnueabihf/src/samplv1_lv2_autogen/include -I/build/reproducible-path/samplv1-1.3.0/src/lv2 -isystem /usr/include/arm-linux-gnueabihf/qt6/QtWidgets -isystem /usr/include/arm-linux-gnueabihf/qt6 -isystem /usr/include/arm-linux-gnueabihf/qt6/QtCore -isystem /usr/lib/arm-linux-gnueabihf/qt6/mkspecs/linux-g++ -isystem /usr/include/arm-linux-gnueabihf/qt6/QtGui -isystem /usr/include/arm-linux-gnueabihf/qt6/QtSvg -isystem /usr/include/arm-linux-gnueabihf/qt6/QtXml -g -O2 -ffile-prefix-map=/build/reproducible-path/samplv1-1.3.0=. -fstack-protector-strong -fstack-clash-protection -Wformat -Werror=format-security -D_LARGEFILE_SOURCE -D_FILE_OFFSET_BITS=64 -D_TIME_BITS=64 -Wdate-time -D_FORTIFY_SOURCE=2 -O3 -DNDEBUG -std=gnu++17 -fPIC -fvisibility=hidden -fvisibility-inlines-hidden -ffast-math -MD -MT src/CMakeFiles/samplv1_lv2.dir/samplv1widget_lv2.cpp.o -MF CMakeFiles/samplv1_lv2.dir/samplv1widget_lv2.cpp.o.d -o CMakeFiles/samplv1_lv2.dir/samplv1widget_lv2.cpp.o -c /build/reproducible-path/samplv1-1.3.0/src/samplv1widget_lv2.cpp
 AutoMoc: Reading dependencies from "SRC:/obj-arm-linux-gnueabihf/src/samplv1_jack_autogen/EWIEGA46WW/moc_samplv1_jack.cpp.d"
 AutoMoc: Generating "SRC:/obj-arm-linux-gnueabihf/src/samplv1_jack_autogen/EWIEGA46WW/moc_samplv1_nsm.cpp", because it doesn't exist, from "SRC:/src/samplv1_nsm.h"
 /usr/lib/qt6/libexec/moc -DQT_CORE_LIB -DQT_GUI_LIB -DQT_NO_DEBUG -DQT_SVG_LIB -DQT_WIDGETS_LIB -DQT_XML_LIB -I/build/reproducible-path/samplv1-1.3.0/obj-arm-linux-gnueabihf/src -I/build/reproducible-path/samplv1-1.3.0/src -I/build/reproducible-path/samplv1-1.3.0/src/lv2 -I/usr/include/arm-linux-gnueabihf/qt6/QtWidgets -I/usr/include/arm-linux-gnueabihf/qt6 -I/usr/include/arm-linux-gnueabihf/qt6/QtCore -I/usr/lib/arm-linux-gnueabihf/qt6/mkspecs/linux-g++ -I/usr/include/arm-linux-gnueabihf/qt6/QtGui -I/usr/include/arm-linux-gnueabihf/qt6/QtSvg -I/usr/include/arm-linux-gnueabihf/qt6/QtXml -I/usr/include -I/usr/include/c++/14 -I/usr/include/arm-linux-gnueabihf/c++/14 -I/usr/include/c++/14/backward -I/usr/lib/gcc/arm-linux-gnueabihf/14/include -I/usr/local/include -I/usr/include/arm-linux-gnueabihf --include /build/reproducible-path/samplv1-1.3.0/obj-arm-linux-gnueabihf/src/samplv1_jack_autogen/moc_predefs.h --output-dep-file -o /build/reproducible-path/samplv1-1.3.0/obj-arm-linux-gnueabihf/src/samplv1_jack_autogen/EWIEGA46WW/moc_samplv1_nsm.cpp /build/reproducible-path/samplv1-1.3.0/src/samplv1_nsm.h
-AutoMoc: Reading dependencies from "SRC:/obj-arm-linux-gnueabihf/src/samplv1_jack_autogen/EWIEGA46WW/moc_samplv1_nsm.cpp.d"
-AutoMoc: Generating MOC compilation "SRC:/obj-arm-linux-gnueabihf/src/samplv1_jack_autogen/mocs_compilation.cpp"
-AutoMoc: Merging MOC dependencies into "SRC:/obj-arm-linux-gnueabihf/src/samplv1_jack_autogen/deps"
-AutoGen: Writing the parse cache file "SRC:/obj-arm-linux-gnueabihf/src/CMakeFiles/samplv1_jack_autogen.dir/ParseCache.txt"
-AutoGen: Writing the settings file "SRC:/obj-arm-linux-gnueabihf/src/CMakeFiles/samplv1_jack_autogen.dir/AutogenUsed.txt"
-cd /build/reproducible-path/samplv1-1.3.0/obj-arm-linux-gnueabihf/src && /usr/bin/cmake -E touch /build/reproducible-path/samplv1-1.3.0/obj-arm-linux-gnueabihf/src/samplv1_jack_autogen/timestamp
-make[3]: Leaving directory '/build/reproducible-path/samplv1-1.3.0/obj-arm-linux-gnueabihf'
-[ 82%] Built target samplv1_jack_autogen
-make  -f src/CMakeFiles/samplv1_jack.dir/build.make src/CMakeFiles/samplv1_jack.dir/depend
-make[3]: Entering directory '/build/reproducible-path/samplv1-1.3.0/obj-arm-linux-gnueabihf'
-cd /build/reproducible-path/samplv1-1.3.0/obj-arm-linux-gnueabihf && /usr/bin/cmake -E cmake_depends "Unix Makefiles" /build/reproducible-path/samplv1-1.3.0 /build/reproducible-path/samplv1-1.3.0/src /build/reproducible-path/samplv1-1.3.0/obj-arm-linux-gnueabihf /build/reproducible-path/samplv1-1.3.0/obj-arm-linux-gnueabihf/src /build/reproducible-path/samplv1-1.3.0/obj-arm-linux-gnueabihf/src/CMakeFiles/samplv1_jack.dir/DependInfo.cmake "--color="
-Dependencies file "src/samplv1_jack_autogen/deps" is newer than depends file "/build/reproducible-path/samplv1-1.3.0/obj-arm-linux-gnueabihf/src/CMakeFiles/samplv1_jack.dir/compiler_depend.internal".
-Consolidate compiler generated dependencies of target samplv1_jack
-make[3]: Leaving directory '/build/reproducible-path/samplv1-1.3.0/obj-arm-linux-gnueabihf'
-make  -f src/CMakeFiles/samplv1_jack.dir/build.make src/CMakeFiles/samplv1_jack.dir/build
-make[3]: Entering directory '/build/reproducible-path/samplv1-1.3.0/obj-arm-linux-gnueabihf'
-[ 84%] Building CXX object src/CMakeFiles/samplv1_jack.dir/samplv1_jack_autogen/mocs_compilation.cpp.o
-cd /build/reproducible-path/samplv1-1.3.0/obj-arm-linux-gnueabihf/src && /usr/bin/c++ -DQT_CORE_LIB -DQT_GUI_LIB -DQT_NO_DEBUG -DQT_SVG_LIB -DQT_WIDGETS_LIB -DQT_XML_LIB -I/build/reproducible-path/samplv1-1.3.0/obj-arm-linux-gnueabihf/src -I/build/reproducible-path/samplv1-1.3.0/src -I/build/reproducible-path/samplv1-1.3.0/obj-arm-linux-gnueabihf/src/samplv1_jack_autogen/include -I/build/reproducible-path/samplv1-1.3.0/src/lv2 -isystem /usr/include/arm-linux-gnueabihf/qt6/QtWidgets -isystem /usr/include/arm-linux-gnueabihf/qt6 -isystem /usr/include/arm-linux-gnueabihf/qt6/QtCore -isystem /usr/lib/arm-linux-gnueabihf/qt6/mkspecs/linux-g++ -isystem /usr/include/arm-linux-gnueabihf/qt6/QtGui -isystem /usr/include/arm-linux-gnueabihf/qt6/QtSvg -isystem /usr/include/arm-linux-gnueabihf/qt6/QtXml -g -O2 -ffile-prefix-map=/build/reproducible-path/samplv1-1.3.0=. -fstack-protector-strong -fstack-clash-protection -Wformat -Werror=format-security -D_LARGEFILE_SOURCE -D_FILE_OFFSET_BITS=64 -D_TIME_BITS=64 -Wdate-time -D_FORTIFY_SOURCE=2 -O3 -DNDEBUG -std=gnu++17 -fvisibility=hidden -fvisibility-inlines-hidden -ffast-math -MD -MT src/CMakeFiles/samplv1_jack.dir/samplv1_jack_autogen/mocs_compilation.cpp.o -MF CMakeFiles/samplv1_jack.dir/samplv1_jack_autogen/mocs_compilation.cpp.o.d -o CMakeFiles/samplv1_jack.dir/samplv1_jack_autogen/mocs_compilation.cpp.o -c /build/reproducible-path/samplv1-1.3.0/obj-arm-linux-gnueabihf/src/samplv1_jack_autogen/mocs_compilation.cpp
-[ 86%] Building CXX object src/CMakeFiles/samplv1_lv2.dir/samplv1widget_lv2.cpp.o
-cd /build/reproducible-path/samplv1-1.3.0/obj-arm-linux-gnueabihf/src && /usr/bin/c++ -DQT_CORE_LIB -DQT_GUI_LIB -DQT_NO_DEBUG -DQT_SVG_LIB -DQT_WIDGETS_LIB -DQT_XML_LIB -Dsamplv1_lv2_EXPORTS -I/build/reproducible-path/samplv1-1.3.0/obj-arm-linux-gnueabihf/src -I/build/reproducible-path/samplv1-1.3.0/src -I/build/reproducible-path/samplv1-1.3.0/obj-arm-linux-gnueabihf/src/samplv1_lv2_autogen/include -I/build/reproducible-path/samplv1-1.3.0/src/lv2 -isystem /usr/include/arm-linux-gnueabihf/qt6/QtWidgets -isystem /usr/include/arm-linux-gnueabihf/qt6 -isystem /usr/include/arm-linux-gnueabihf/qt6/QtCore -isystem /usr/lib/arm-linux-gnueabihf/qt6/mkspecs/linux-g++ -isystem /usr/include/arm-linux-gnueabihf/qt6/QtGui -isystem /usr/include/arm-linux-gnueabihf/qt6/QtSvg -isystem /usr/include/arm-linux-gnueabihf/qt6/QtXml -g -O2 -ffile-prefix-map=/build/reproducible-path/samplv1-1.3.0=. -fstack-protector-strong -fstack-clash-protection -Wformat -Werror=format-security -D_LARGEFILE_SOURCE -D_FILE_OFFSET_BITS=64 -D_TIME_BITS=64 -Wdate-time -D_FORTIFY_SOURCE=2 -O3 -DNDEBUG -std=gnu++17 -fPIC -fvisibility=hidden -fvisibility-inlines-hidden -ffast-math -MD -MT src/CMakeFiles/samplv1_lv2.dir/samplv1widget_lv2.cpp.o -MF CMakeFiles/samplv1_lv2.dir/samplv1widget_lv2.cpp.o.d -o CMakeFiles/samplv1_lv2.dir/samplv1widget_lv2.cpp.o -c /build/reproducible-path/samplv1-1.3.0/src/samplv1widget_lv2.cpp
-[ 88%] Building CXX object src/CMakeFiles/samplv1_jack.dir/samplv1_nsm.cpp.o
-cd /build/reproducible-path/samplv1-1.3.0/obj-arm-linux-gnueabihf/src && /usr/bin/c++ -DQT_CORE_LIB -DQT_GUI_LIB -DQT_NO_DEBUG -DQT_SVG_LIB -DQT_WIDGETS_LIB -DQT_XML_LIB -I/build/reproducible-path/samplv1-1.3.0/obj-arm-linux-gnueabihf/src -I/build/reproducible-path/samplv1-1.3.0/src -I/build/reproducible-path/samplv1-1.3.0/obj-arm-linux-gnueabihf/src/samplv1_jack_autogen/include -I/build/reproducible-path/samplv1-1.3.0/src/lv2 -isystem /usr/include/arm-linux-gnueabihf/qt6/QtWidgets -isystem /usr/include/arm-linux-gnueabihf/qt6 -isystem /usr/include/arm-linux-gnueabihf/qt6/QtCore -isystem /usr/lib/arm-linux-gnueabihf/qt6/mkspecs/linux-g++ -isystem /usr/include/arm-linux-gnueabihf/qt6/QtGui -isystem /usr/include/arm-linux-gnueabihf/qt6/QtSvg -isystem /usr/include/arm-linux-gnueabihf/qt6/QtXml -g -O2 -ffile-prefix-map=/build/reproducible-path/samplv1-1.3.0=. -fstack-protector-strong -fstack-clash-protection -Wformat -Werror=format-security -D_LARGEFILE_SOURCE -D_FILE_OFFSET_BITS=64 -D_TIME_BITS=64 -Wdate-time -D_FORTIFY_SOURCE=2 -O3 -DNDEBUG -std=gnu++17 -fvisibility=hidden -fvisibility-inlines-hidden -ffast-math -MD -MT src/CMakeFiles/samplv1_jack.dir/samplv1_nsm.cpp.o -MF CMakeFiles/samplv1_jack.dir/samplv1_nsm.cpp.o.d -o CMakeFiles/samplv1_jack.dir/samplv1_nsm.cpp.o -c /build/reproducible-path/samplv1-1.3.0/src/samplv1_nsm.cpp
-[ 90%] Building CXX object src/CMakeFiles/samplv1_jack.dir/samplv1_jack.cpp.o
-cd /build/reproducible-path/samplv1-1.3.0/obj-arm-linux-gnueabihf/src && /usr/bin/c++ -DQT_CORE_LIB -DQT_GUI_LIB -DQT_NO_DEBUG -DQT_SVG_LIB -DQT_WIDGETS_LIB -DQT_XML_LIB -I/build/reproducible-path/samplv1-1.3.0/obj-arm-linux-gnueabihf/src -I/build/reproducible-path/samplv1-1.3.0/src -I/build/reproducible-path/samplv1-1.3.0/obj-arm-linux-gnueabihf/src/samplv1_jack_autogen/include -I/build/reproducible-path/samplv1-1.3.0/src/lv2 -isystem /usr/include/arm-linux-gnueabihf/qt6/QtWidgets -isystem /usr/include/arm-linux-gnueabihf/qt6 -isystem /usr/include/arm-linux-gnueabihf/qt6/QtCore -isystem /usr/lib/arm-linux-gnueabihf/qt6/mkspecs/linux-g++ -isystem /usr/include/arm-linux-gnueabihf/qt6/QtGui -isystem /usr/include/arm-linux-gnueabihf/qt6/QtSvg -isystem /usr/include/arm-linux-gnueabihf/qt6/QtXml -g -O2 -ffile-prefix-map=/build/reproducible-path/samplv1-1.3.0=. -fstack-protector-strong -fstack-clash-protection -Wformat -Werror=format-security -D_LARGEFILE_SOURCE -D_FILE_OFFSET_BITS=64 -D_TIME_BITS=64 -Wdate-time -D_FORTIFY_SOURCE=2 -O3 -DNDEBUG -std=gnu++17 -fvisibility=hidden -fvisibility-inlines-hidden -ffast-math -MD -MT src/CMakeFiles/samplv1_jack.dir/samplv1_jack.cpp.o -MF CMakeFiles/samplv1_jack.dir/samplv1_jack.cpp.o.d -o CMakeFiles/samplv1_jack.dir/samplv1_jack.cpp.o -c /build/reproducible-path/samplv1-1.3.0/src/samplv1_jack.cpp
-[ 92%] Building CXX object src/CMakeFiles/samplv1_jack.dir/samplv1widget_jack.cpp.o
-cd /build/reproducible-path/samplv1-1.3.0/obj-arm-linux-gnueabihf/src && /usr/bin/c++ -DQT_CORE_LIB -DQT_GUI_LIB -DQT_NO_DEBUG -DQT_SVG_LIB -DQT_WIDGETS_LIB -DQT_XML_LIB -I/build/reproducible-path/samplv1-1.3.0/obj-arm-linux-gnueabihf/src -I/build/reproducible-path/samplv1-1.3.0/src -I/build/reproducible-path/samplv1-1.3.0/obj-arm-linux-gnueabihf/src/samplv1_jack_autogen/include -I/build/reproducible-path/samplv1-1.3.0/src/lv2 -isystem /usr/include/arm-linux-gnueabihf/qt6/QtWidgets -isystem /usr/include/arm-linux-gnueabihf/qt6 -isystem /usr/include/arm-linux-gnueabihf/qt6/QtCore -isystem /usr/lib/arm-linux-gnueabihf/qt6/mkspecs/linux-g++ -isystem /usr/include/arm-linux-gnueabihf/qt6/QtGui -isystem /usr/include/arm-linux-gnueabihf/qt6/QtSvg -isystem /usr/include/arm-linux-gnueabihf/qt6/QtXml -g -O2 -ffile-prefix-map=/build/reproducible-path/samplv1-1.3.0=. -fstack-protector-strong -fstack-clash-protection -Wformat -Werror=format-security -D_LARGEFILE_SOURCE -D_FILE_OFFSET_BITS=64 -D_TIME_BITS=64 -Wdate-time -D_FORTIFY_SOURCE=2 -O3 -DNDEBUG -std=gnu++17 -fvisibility=hidden -fvisibility-inlines-hidden -ffast-math -MD -MT src/CMakeFiles/samplv1_jack.dir/samplv1widget_jack.cpp.o -MF CMakeFiles/samplv1_jack.dir/samplv1widget_jack.cpp.o.d -o CMakeFiles/samplv1_jack.dir/samplv1widget_jack.cpp.o -c /build/reproducible-path/samplv1-1.3.0/src/samplv1widget_jack.cpp
-[ 94%] Linking CXX shared module libsamplv1_lv2.so
+
+AutoMoc subprocess error
+------------------------
+The moc process failed to compile
+  "SRC:/src/samplv1_nsm.h"
+into
+  "SRC:/obj-arm-linux-gnueabihf/src/samplv1_jack_autogen/EWIEGA46WW/moc_samplv1_nsm.cpp"
+Process was terminated by signal 11
+
+Command
+-------
+/usr/lib/qt6/libexec/moc -DQT_CORE_LIB -DQT_GUI_LIB -DQT_NO_DEBUG -DQT_SVG_LIB -DQT_WIDGETS_LIB -DQT_XML_LIB -I/build/reproducible-path/samplv1-1.3.0/obj-arm-linux-gnueabihf/src -I/build/reproducible-path/samplv1-1.3.0/src -I/build/reproducible-path/samplv1-1.3.0/src/lv2 -I/usr/include/arm-linux-gnueabihf/qt6/QtWidgets -I/usr/include/arm-linux-gnueabihf/qt6 -I/usr/include/arm-linux-gnueabihf/qt6/QtCore -I/usr/lib/arm-linux-gnueabihf/qt6/mkspecs/linux-g++ -I/usr/include/arm-linux-gnueabihf/qt6/QtGui -I/usr/include/arm-linux-gnueabihf/qt6/QtSvg -I/usr/include/arm-linux-gnueabihf/qt6/QtXml -I/usr/include -I/usr/include/c++/14 -I/usr/include/arm-linux-gnueabihf/c++/14 -I/usr/include/c++/14/backward -I/usr/lib/gcc/arm-linux-gnueabihf/14/include -I/usr/local/include -I/usr/include/arm-linux-gnueabihf --include /build/reproducible-path/samplv1-1.3.0/obj-arm-linux-gnueabihf/src/samplv1_jack_autogen/moc_predefs.h --output-dep-file -o /build/reproducible-path/samplv1-1.3.0/obj-arm-linux-gnueabihf/src/samplv1_jack_autogen/EWIEGA46WW/moc_samplv1_nsm.cpp /build/reproducible-path/samplv1-1.3.0/src/samplv1_nsm.h
+
+Output
+------
+
+
+make[3]: *** [src/CMakeFiles/samplv1_jack_autogen.dir/build.make:78: src/samplv1_jack_autogen/timestamp] Error 1
+make[3]: Leaving directory '/build/reproducible-path/samplv1-1.3.0/obj-arm-linux-gnueabihf'
+make[2]: *** [CMakeFiles/Makefile2:491: src/CMakeFiles/samplv1_jack_autogen.dir/all] Error 2
+make[2]: *** Waiting for unfinished jobs....
+[ 86%] Linking CXX shared module libsamplv1_lv2.so
 cd /build/reproducible-path/samplv1-1.3.0/obj-arm-linux-gnueabihf/src && /usr/bin/cmake -E cmake_link_script CMakeFiles/samplv1_lv2.dir/link.txt --verbose=1
 /usr/bin/c++ -fPIC -g -O2 -ffile-prefix-map=/build/reproducible-path/samplv1-1.3.0=. -fstack-protector-strong -fstack-clash-protection -Wformat -Werror=format-security -D_LARGEFILE_SOURCE -D_FILE_OFFSET_BITS=64 -D_TIME_BITS=64 -Wdate-time -D_FORTIFY_SOURCE=2 -O3 -DNDEBUG -Wl,--dependency-file=CMakeFiles/samplv1_lv2.dir/link.d -Wl,-z,relro -Wl,-z,now -shared  -o libsamplv1_lv2.so CMakeFiles/samplv1_lv2.dir/samplv1_lv2_autogen/mocs_compilation.cpp.o CMakeFiles/samplv1_lv2.dir/samplv1_lv2.cpp.o CMakeFiles/samplv1_lv2.dir/samplv1_lv2ui.cpp.o CMakeFiles/samplv1_lv2.dir/samplv1widget_lv2.cpp.o  libsamplv1_ui.a /usr/lib/arm-linux-gnueabihf/libQt6Widgets.so.6.7.2 /usr/lib/arm-linux-gnueabihf/libQt6Svg.so.6.7.2 /usr/lib/arm-linux-gnueabihf/libQt6Gui.so.6.7.2 /usr/lib/arm-linux-gnueabihf/libGLX.so /usr/lib/arm-linux-gnueabihf/libOpenGL.so libsamplv1.a /usr/lib/arm-linux-gnueabihf/libQt6Xml.so.6.7.2 /usr/lib/arm-linux-gnueabihf/libQt6Core.so.6.7.2 /usr/lib/arm-linux-gnueabihf/libsndfile.so
 cd /build/reproducible-path/samplv1-1.3.0/obj-arm-linux-gnueabihf/src && /bin/true libsamplv1_lv2.so
 make[3]: Leaving directory '/build/reproducible-path/samplv1-1.3.0/obj-arm-linux-gnueabihf'
-[ 96%] Built target samplv1_lv2
-[ 98%] Linking CXX executable samplv1_jack
-cd /build/reproducible-path/samplv1-1.3.0/obj-arm-linux-gnueabihf/src && /usr/bin/cmake -E cmake_link_script CMakeFiles/samplv1_jack.dir/link.txt --verbose=1
-/usr/bin/c++ -g -O2 -ffile-prefix-map=/build/reproducible-path/samplv1-1.3.0=. -fstack-protector-strong -fstack-clash-protection -Wformat -Werror=format-security -D_LARGEFILE_SOURCE -D_FILE_OFFSET_BITS=64 -D_TIME_BITS=64 -Wdate-time -D_FORTIFY_SOURCE=2 -O3 -DNDEBUG -Wl,-z,relro -Wl,-z,now -Wl,--dependency-file=CMakeFiles/samplv1_jack.dir/link.d CMakeFiles/samplv1_jack.dir/samplv1_jack_autogen/mocs_compilation.cpp.o CMakeFiles/samplv1_jack.dir/samplv1_nsm.cpp.o CMakeFiles/samplv1_jack.dir/samplv1_jack.cpp.o CMakeFiles/samplv1_jack.dir/samplv1widget_jack.cpp.o -o samplv1_jack  libsamplv1_ui.a /usr/lib/arm-linux-gnueabihf/libQt6Widgets.so.6.7.2 /usr/lib/arm-linux-gnueabihf/libQt6Svg.so.6.7.2 /usr/lib/arm-linux-gnueabihf/libQt6Gui.so.6.7.2 /usr/lib/arm-linux-gnueabihf/libGLX.so /usr/lib/arm-linux-gnueabihf/libOpenGL.so libsamplv1.a /usr/lib/arm-linux-gnueabihf/libQt6Xml.so.6.7.2 /usr/lib/arm-linux-gnueabihf/libQt6Core.so.6.7.2 /usr/lib/arm-linux-gnueabihf/libsndfile.so /usr/lib/arm-linux-gnueabihf/libjack.so /usr/lib/arm-linux-gnueabihf/libpthread.a /usr/lib/arm-linux-gnueabihf/libasound.so /usr/lib/arm-linux-gnueabihf/liblo.so
-cd /build/reproducible-path/samplv1-1.3.0/obj-arm-linux-gnueabihf/src && /bin/true samplv1_jack
-make[3]: Leaving directory '/build/reproducible-path/samplv1-1.3.0/obj-arm-linux-gnueabihf'
-[100%] Built target samplv1_jack
+[ 88%] Built target samplv1_lv2
 make[2]: Leaving directory '/build/reproducible-path/samplv1-1.3.0/obj-arm-linux-gnueabihf'
-/usr/bin/cmake -E cmake_progress_start /build/reproducible-path/samplv1-1.3.0/obj-arm-linux-gnueabihf/CMakeFiles 0
+make[1]: *** [Makefile:139: all] Error 2
 make[1]: Leaving directory '/build/reproducible-path/samplv1-1.3.0/obj-arm-linux-gnueabihf'
-   dh_auto_test
-   create-stamp debian/debhelper-build-stamp
-   dh_prep
-   debian/rules override_dh_auto_install
-make[1]: Entering directory '/build/reproducible-path/samplv1-1.3.0'
-cp  /build/reproducible-path/samplv1-1.3.0/src/man1/samplv1.1 /build/reproducible-path/samplv1-1.3.0/src/man1/samplv1_jack.1
-cp  /build/reproducible-path/samplv1-1.3.0/src/man1/samplv1.fr.1 /build/reproducible-path/samplv1-1.3.0/src/man1/samplv1_jack.fr.1
-dh_auto_install
-	cd obj-arm-linux-gnueabihf && make -j3 install DESTDIR=/build/reproducible-path/samplv1-1.3.0/debian/tmp AM_UPDATE_INFO_DIR=no "INSTALL=install --strip-program=true"
-make[2]: Entering directory '/build/reproducible-path/samplv1-1.3.0/obj-arm-linux-gnueabihf'
-/usr/bin/cmake -S/build/reproducible-path/samplv1-1.3.0 -B/build/reproducible-path/samplv1-1.3.0/obj-arm-linux-gnueabihf --check-build-system CMakeFiles/Makefile.cmake 0
-make  -f CMakeFiles/Makefile2 preinstall
-make[3]: Entering directory '/build/reproducible-path/samplv1-1.3.0/obj-arm-linux-gnueabihf'
-make[3]: Nothing to be done for 'preinstall'.
-make[3]: Leaving directory '/build/reproducible-path/samplv1-1.3.0/obj-arm-linux-gnueabihf'
-Install the project...
-/usr/bin/cmake -P cmake_install.cmake
--- Install configuration: "Release"
--- Installing: /build/reproducible-path/samplv1-1.3.0/debian/tmp/usr/lib/arm-linux-gnueabihf/lv2/samplv1.lv2/samplv1.so
--- Installing: /build/reproducible-path/samplv1-1.3.0/debian/tmp/usr/lib/arm-linux-gnueabihf/lv2/samplv1.lv2/manifest.ttl
--- Installing: /build/reproducible-path/samplv1-1.3.0/debian/tmp/usr/lib/arm-linux-gnueabihf/lv2/samplv1.lv2/samplv1.ttl
--- Installing: /build/reproducible-path/samplv1-1.3.0/debian/tmp/usr/lib/arm-linux-gnueabihf/lv2/samplv1.lv2/samplv1_ui.ttl
--- Installing: /build/reproducible-path/samplv1-1.3.0/debian/tmp/usr/bin/samplv1_jack
--- Installing: /build/reproducible-path/samplv1-1.3.0/debian/tmp/usr/share/icons/hicolor/32x32/apps/org.rncbc.samplv1.png
--- Installing: /build/reproducible-path/samplv1-1.3.0/debian/tmp/usr/share/icons/hicolor/scalable/apps/org.rncbc.samplv1.svg
--- Installing: /build/reproducible-path/samplv1-1.3.0/debian/tmp/usr/share/applications/org.rncbc.samplv1.desktop
--- Installing: /build/reproducible-path/samplv1-1.3.0/debian/tmp/usr/share/metainfo/org.rncbc.samplv1.metainfo.xml
--- Installing: /build/reproducible-path/samplv1-1.3.0/debian/tmp/usr/share/mime/packages/org.rncbc.samplv1.xml
--- Installing: /build/reproducible-path/samplv1-1.3.0/debian/tmp/usr/share/icons/hicolor/32x32/mimetypes/org.rncbc.samplv1.application-x-samplv1-preset.png
--- Installing: /build/reproducible-path/samplv1-1.3.0/debian/tmp/usr/share/icons/hicolor/scalable/mimetypes/org.rncbc.samplv1.application-x-samplv1-preset.svg
--- Installing: /build/reproducible-path/samplv1-1.3.0/debian/tmp/usr/share/man/man1/samplv1.1
--- Installing: /build/reproducible-path/samplv1-1.3.0/debian/tmp/usr/share/man/fr/man1/samplv1.1
--- Installing: /build/reproducible-path/samplv1-1.3.0/debian/tmp/usr/share/samplv1/palette/KXStudio.conf
--- Installing: /build/reproducible-path/samplv1-1.3.0/debian/tmp/usr/share/samplv1/palette/Wonton Soup.conf
-make[2]: Leaving directory '/build/reproducible-path/samplv1-1.3.0/obj-arm-linux-gnueabihf'
-cp /build/reproducible-path/samplv1-1.3.0/debian/tmp/usr/share/mime/packages/org.rncbc.samplv1.xml /build/reproducible-path/samplv1-1.3.0/debian/samplv1-common.sharedmimeinfo
-make[1]: Leaving directory '/build/reproducible-path/samplv1-1.3.0'
-   dh_install
-   dh_installdocs
-   dh_installchangelogs
-   dh_installman
-   dh_installmime
-   dh_icons
-   dh_perl
-   dh_link
-   dh_strip_nondeterminism
-   dh_compress
-   dh_fixperms
-   dh_missing
-   dh_dwz -a
-   dh_strip -a
-   dh_makeshlibs -a
-   dh_shlibdeps -a
-dpkg-shlibdeps: warning: diversions involved - output may be incorrect
- diversion by libc6 from: /lib/ld-linux-armhf.so.3
-dpkg-shlibdeps: warning: diversions involved - output may be incorrect
- diversion by libc6 to: /lib/ld-linux-armhf.so.3.usr-is-merged
-dpkg-shlibdeps: warning: diversions involved - output may be incorrect
- diversion by libc6 from: /lib/ld-linux-armhf.so.3
-dpkg-shlibdeps: warning: diversions involved - output may be incorrect
- diversion by libc6 to: /lib/ld-linux-armhf.so.3.usr-is-merged
-dpkg-shlibdeps: warning: debian/samplv1/usr/bin/samplv1_jack contains an unresolvable reference to symbol __aeabi_atexit@CXXABI_ARM_1.3.3: it's probably a plugin
-   dh_installdeb
-   dh_gencontrol
-   dh_md5sums
-   dh_builddeb
-dpkg-deb: building package 'samplv1' in '../samplv1_1.3.0-1_armhf.deb'.
-dpkg-deb: building package 'samplv1-lv2' in '../samplv1-lv2_1.3.0-1_armhf.deb'.
-dpkg-deb: building package 'samplv1-common' in '../samplv1-common_1.3.0-1_all.deb'.
-dpkg-deb: building package 'samplv1-lv2-dbgsym' in '../samplv1-lv2-dbgsym_1.3.0-1_armhf.deb'.
-dpkg-deb: building package 'samplv1-dbgsym' in '../samplv1-dbgsym_1.3.0-1_armhf.deb'.
- dpkg-genbuildinfo --build=binary -O../samplv1_1.3.0-1_armhf.buildinfo
- dpkg-genchanges --build=binary -O../samplv1_1.3.0-1_armhf.changes
-dpkg-genchanges: info: binary-only upload (no source code included)
- dpkg-source --after-build .
-dpkg-buildpackage: info: binary-only upload (no source included)
-dpkg-genchanges: info: including full source code in upload
+dh_auto_build: error: cd obj-arm-linux-gnueabihf && make -j4 "INSTALL=install --strip-program=true" VERBOSE=1 returned exit code 2
+make: *** [debian/rules:15: binary] Error 25
+dpkg-buildpackage: error: debian/rules binary subprocess returned exit status 2
 I: copying local configuration
+E: Failed autobuilding of package
+I: user script /srv/workspace/pbuilder/1421/tmp/hooks/C01_cleanup starting
+debug output: disk usage on i-capture-the-hostname at Sun Mar  9 17:56:05 UTC 2025
+Filesystem      Size  Used Avail Use% Mounted on
+tmpfs           3.4G     0  3.4G   0% /dev/shm
+
+I: user script /srv/workspace/pbuilder/1421/tmp/hooks/C01_cleanup finished
 I: unmounting dev/ptmx filesystem
 I: unmounting dev/pts filesystem
 I: unmounting dev/shm filesystem
 I: unmounting proc filesystem
 I: unmounting sys filesystem
 I: cleaning the build env 
-I: removing directory /srv/workspace/pbuilder/21839 and its subdirectories
-I: Current time: Sun Mar  9 05:51:37 -12 2025
-I: pbuilder-time-stamp: 1741542697
+I: removing directory /srv/workspace/pbuilder/1421 and its subdirectories