Diff of the two buildlogs:

--
--- b1/build.log	2025-01-12 09:59:59.345497447 +0000
+++ b2/build.log	2025-01-12 10:05:00.631698307 +0000
@@ -1,6 +1,6 @@
 I: pbuilder: network access will be disabled during build
-I: Current time: Sat Jan 11 21:54:00 -12 2025
-I: pbuilder-time-stamp: 1736675640
+I: Current time: Mon Jan 13 00:00:11 +14 2025
+I: pbuilder-time-stamp: 1736676011
 I: Building the build Environment
 I: extracting base tarball [/var/cache/pbuilder/trixie-reproducible-base.tgz]
 I: copying local configuration
@@ -23,52 +23,84 @@
 dpkg-source: info: unpacking plasma-nano_6.2.5-1.debian.tar.xz
 I: Not using root during the build.
 I: Installing the build-deps
-I: user script /srv/workspace/pbuilder/14988/tmp/hooks/D02_print_environment starting
+I: user script /srv/workspace/pbuilder/29870/tmp/hooks/D01_modify_environment starting
+debug: Running on virt32c.
+I: Changing host+domainname to test build reproducibility
+I: Adding a custom variable just for the fun of it...
+I: Changing /bin/sh to bash
+'/bin/sh' -> '/bin/bash'
+lrwxrwxrwx 1 root root 9 Jan 12 10:00 /bin/sh -> /bin/bash
+I: Setting pbuilder2's login shell to /bin/bash
+I: Setting pbuilder2's GECOS to second user,second room,second work-phone,second home-phone,second other
+I: user script /srv/workspace/pbuilder/29870/tmp/hooks/D01_modify_environment finished
+I: user script /srv/workspace/pbuilder/29870/tmp/hooks/D02_print_environment starting
 I: set
-  BUILDDIR='/build/reproducible-path'
-  BUILDUSERGECOS='first user,first room,first work-phone,first home-phone,first other'
-  BUILDUSERNAME='pbuilder1'
-  BUILD_ARCH='armhf'
-  DEBIAN_FRONTEND='noninteractive'
-  DEB_BUILD_OPTIONS='buildinfo=+all reproducible=+all parallel=3 '
-  DISTRIBUTION='trixie'
-  HOME='/root'
-  HOST_ARCH='armhf'
+  BASH=/bin/sh
+  BASHOPTS=checkwinsize:cmdhist:complete_fullquote:extquote:force_fignore:globasciiranges:globskipdots:hostcomplete:interactive_comments:patsub_replacement:progcomp:promptvars:sourcepath
+  BASH_ALIASES=()
+  BASH_ARGC=()
+  BASH_ARGV=()
+  BASH_CMDS=()
+  BASH_LINENO=([0]="12" [1]="0")
+  BASH_LOADABLES_PATH=/usr/local/lib/bash:/usr/lib/bash:/opt/local/lib/bash:/usr/pkg/lib/bash:/opt/pkg/lib/bash:.
+  BASH_SOURCE=([0]="/tmp/hooks/D02_print_environment" [1]="/tmp/hooks/D02_print_environment")
+  BASH_VERSINFO=([0]="5" [1]="2" [2]="37" [3]="1" [4]="release" [5]="arm-unknown-linux-gnueabihf")
+  BASH_VERSION='5.2.37(1)-release'
+  BUILDDIR=/build/reproducible-path
+  BUILDUSERGECOS='second user,second room,second work-phone,second home-phone,second other'
+  BUILDUSERNAME=pbuilder2
+  BUILD_ARCH=armhf
+  DEBIAN_FRONTEND=noninteractive
+  DEB_BUILD_OPTIONS='buildinfo=+all reproducible=+all parallel=4 '
+  DIRSTACK=()
+  DISTRIBUTION=trixie
+  EUID=0
+  FUNCNAME=([0]="Echo" [1]="main")
+  GROUPS=()
+  HOME=/root
+  HOSTNAME=i-capture-the-hostname
+  HOSTTYPE=arm
+  HOST_ARCH=armhf
   IFS=' 	
   '
-  INVOCATION_ID='1d3bd7d89b5940ef84a9acec0f8287c6'
-  LANG='C'
-  LANGUAGE='en_US:en'
-  LC_ALL='C'
-  MAIL='/var/mail/root'
-  OPTIND='1'
-  PATH='/usr/sbin:/usr/bin:/sbin:/bin:/usr/games'
-  PBCURRENTCOMMANDLINEOPERATION='build'
-  PBUILDER_OPERATION='build'
-  PBUILDER_PKGDATADIR='/usr/share/pbuilder'
-  PBUILDER_PKGLIBDIR='/usr/lib/pbuilder'
-  PBUILDER_SYSCONFDIR='/etc'
-  PPID='14988'
-  PS1='# '
-  PS2='> '
+  INVOCATION_ID=384d2ce86c394d76a60652325761256a
+  LANG=C
+  LANGUAGE=it_CH:it
+  LC_ALL=C
+  MACHTYPE=arm-unknown-linux-gnueabihf
+  MAIL=/var/mail/root
+  OPTERR=1
+  OPTIND=1
+  OSTYPE=linux-gnueabihf
+  PATH=/usr/sbin:/usr/bin:/sbin:/bin:/usr/games:/i/capture/the/path
+  PBCURRENTCOMMANDLINEOPERATION=build
+  PBUILDER_OPERATION=build
+  PBUILDER_PKGDATADIR=/usr/share/pbuilder
+  PBUILDER_PKGLIBDIR=/usr/lib/pbuilder
+  PBUILDER_SYSCONFDIR=/etc
+  PIPESTATUS=([0]="0")
+  POSIXLY_CORRECT=y
+  PPID=29870
   PS4='+ '
-  PWD='/'
-  SHELL='/bin/bash'
-  SHLVL='2'
-  SUDO_COMMAND='/usr/bin/timeout -k 18.1h 18h /usr/bin/ionice -c 3 /usr/bin/nice /usr/sbin/pbuilder --build --configfile /srv/reproducible-results/rbuild-debian/r-b-build.sv3D2ANG/pbuilderrc_7cZx --distribution trixie --hookdir /etc/pbuilder/first-build-hooks --debbuildopts -b --basetgz /var/cache/pbuilder/trixie-reproducible-base.tgz --buildresult /srv/reproducible-results/rbuild-debian/r-b-build.sv3D2ANG/b1 --logfile b1/build.log plasma-nano_6.2.5-1.dsc'
-  SUDO_GID='113'
-  SUDO_UID='107'
-  SUDO_USER='jenkins'
-  TERM='unknown'
-  TZ='/usr/share/zoneinfo/Etc/GMT+12'
-  USER='root'
-  _='/usr/bin/systemd-run'
-  http_proxy='http://10.0.0.15:3142/'
+  PWD=/
+  SHELL=/bin/bash
+  SHELLOPTS=braceexpand:errexit:hashall:interactive-comments:posix
+  SHLVL=3
+  SUDO_COMMAND='/usr/bin/timeout -k 24.1h 24h /usr/bin/ionice -c 3 /usr/bin/nice -n 11 /usr/bin/unshare --uts -- /usr/sbin/pbuilder --build --configfile /srv/reproducible-results/rbuild-debian/r-b-build.sv3D2ANG/pbuilderrc_FJXm --distribution trixie --hookdir /etc/pbuilder/rebuild-hooks --debbuildopts -b --basetgz /var/cache/pbuilder/trixie-reproducible-base.tgz --buildresult /srv/reproducible-results/rbuild-debian/r-b-build.sv3D2ANG/b2 --logfile b2/build.log plasma-nano_6.2.5-1.dsc'
+  SUDO_GID=113
+  SUDO_UID=107
+  SUDO_USER=jenkins
+  TERM=unknown
+  TZ=/usr/share/zoneinfo/Etc/GMT-14
+  UID=0
+  USER=root
+  _='I: set'
+  http_proxy=http://10.0.0.15:3142/
 I: uname -a
-  Linux virt64c 6.1.0-29-arm64 #1 SMP Debian 6.1.123-1 (2025-01-02) aarch64 GNU/Linux
+  Linux i-capture-the-hostname 6.1.0-29-armmp-lpae #1 SMP Debian 6.1.123-1 (2025-01-02) armv7l GNU/Linux
 I: ls -l /bin
   lrwxrwxrwx 1 root root 7 Nov 22 14:40 /bin -> usr/bin
-I: user script /srv/workspace/pbuilder/14988/tmp/hooks/D02_print_environment finished
+I: user script /srv/workspace/pbuilder/29870/tmp/hooks/D02_print_environment finished
  -> Attempting to satisfy build-dependencies
  -> Creating pbuilder-satisfydepends-dummy package
 Package: pbuilder-satisfydepends-dummy
@@ -578,7 +610,7 @@
 Get: 440 http://deb.debian.org/debian trixie/main armhf pkgconf-bin armhf 1.8.1-4 [29.2 kB]
 Get: 441 http://deb.debian.org/debian trixie/main armhf pkgconf armhf 1.8.1-4 [26.1 kB]
 Get: 442 http://deb.debian.org/debian trixie/main armhf qt6-svg-dev armhf 6.7.2-6 [19.7 kB]
-Fetched 202 MB in 5s (43.4 MB/s)
+Fetched 202 MB in 3s (59.4 MB/s)
 Preconfiguring packages ...
 Selecting previously unselected package libapparmor1:armhf.
 (Reading database ... 
(Reading database ... 5%
(Reading database ... 10%
(Reading database ... 15%
(Reading database ... 20%
(Reading database ... 25%
(Reading database ... 30%
(Reading database ... 35%
(Reading database ... 40%
(Reading database ... 45%
(Reading database ... 50%
(Reading database ... 55%
(Reading database ... 60%
(Reading database ... 65%
(Reading database ... 70%
(Reading database ... 75%
(Reading database ... 80%
(Reading database ... 85%
(Reading database ... 90%
(Reading database ... 95%
(Reading database ... 100%
(Reading database ... 19567 files and directories currently installed.)
@@ -2005,8 +2037,8 @@
 Setting up tzdata (2024b-4) ...
 
 Current default time zone: 'Etc/UTC'
-Local time is now:      Sun Jan 12 09:57:44 UTC 2025.
-Universal Time is now:  Sun Jan 12 09:57:44 UTC 2025.
+Local time is now:      Sun Jan 12 10:03:36 UTC 2025.
+Universal Time is now:  Sun Jan 12 10:03:36 UTC 2025.
 Run 'dpkg-reconfigure tzdata' if you wish to change it.
 
 Setting up libxcb-present0:armhf (1.17.0-2+b1) ...
@@ -2401,7 +2433,11 @@
 Building tag database...
  -> Finished parsing the build-deps
 I: Building the package
-I: Running cd /build/reproducible-path/plasma-nano-6.2.5/ && env PATH="/usr/sbin:/usr/bin:/sbin:/bin:/usr/games" HOME="/nonexistent/first-build" dpkg-buildpackage -us -uc -b && env PATH="/usr/sbin:/usr/bin:/sbin:/bin:/usr/games" HOME="/nonexistent/first-build" dpkg-genchanges -S  > ../plasma-nano_6.2.5-1_source.changes
+I: user script /srv/workspace/pbuilder/29870/tmp/hooks/A99_set_merged_usr starting
+Not re-configuring usrmerge for trixie
+I: user script /srv/workspace/pbuilder/29870/tmp/hooks/A99_set_merged_usr finished
+hostname: Name or service not known
+I: Running cd /build/reproducible-path/plasma-nano-6.2.5/ && env PATH="/usr/sbin:/usr/bin:/sbin:/bin:/usr/games:/i/capture/the/path" HOME="/nonexistent/second-build" dpkg-buildpackage -us -uc -b && env PATH="/usr/sbin:/usr/bin:/sbin:/bin:/usr/games:/i/capture/the/path" HOME="/nonexistent/second-build" dpkg-genchanges -S  > ../plasma-nano_6.2.5-1_source.changes
 dpkg-buildpackage: info: source package plasma-nano
 dpkg-buildpackage: info: source version 6.2.5-1
 dpkg-buildpackage: info: source distribution unstable
@@ -2540,7 +2576,7 @@
   CMakeLists.txt:56 (kde_clang_format)
 This warning is for project developers.  Use -Wno-dev to suppress it.
 
--- Configuring done (6.8s)
+-- Configuring done (7.6s)
 -- Generating done (0.1s)
 CMake Warning:
   Manually-specified variables were not used by the project:
@@ -2552,15 +2588,15 @@
 
 -- Build files have been written to: /build/reproducible-path/plasma-nano-6.2.5/obj-arm-linux-gnueabihf
    dh_auto_build --buildsystem=kf6
-	cd obj-arm-linux-gnueabihf && make -j3 "INSTALL=install --strip-program=true" VERBOSE=1
+	cd obj-arm-linux-gnueabihf && make -j4 "INSTALL=install --strip-program=true" VERBOSE=1
 make[1]: Entering directory '/build/reproducible-path/plasma-nano-6.2.5/obj-arm-linux-gnueabihf'
 /usr/bin/cmake -S/build/reproducible-path/plasma-nano-6.2.5 -B/build/reproducible-path/plasma-nano-6.2.5/obj-arm-linux-gnueabihf --check-build-system CMakeFiles/Makefile.cmake 0
 /usr/bin/cmake -E cmake_progress_start /build/reproducible-path/plasma-nano-6.2.5/obj-arm-linux-gnueabihf/CMakeFiles /build/reproducible-path/plasma-nano-6.2.5/obj-arm-linux-gnueabihf//CMakeFiles/progress.marks
 make  -f CMakeFiles/Makefile2 all
 make[2]: Entering directory '/build/reproducible-path/plasma-nano-6.2.5/obj-arm-linux-gnueabihf'
 make  -f CMakeFiles/pofiles-188acfff48a2dafa75ea540491e887ad.dir/build.make CMakeFiles/pofiles-188acfff48a2dafa75ea540491e887ad.dir/depend
-make  -f CMakeFiles/tsfiles-188acfff48a2dafa75ea540491e887ad.dir/build.make CMakeFiles/tsfiles-188acfff48a2dafa75ea540491e887ad.dir/depend
 make[3]: Entering directory '/build/reproducible-path/plasma-nano-6.2.5/obj-arm-linux-gnueabihf'
+make  -f CMakeFiles/tsfiles-188acfff48a2dafa75ea540491e887ad.dir/build.make CMakeFiles/tsfiles-188acfff48a2dafa75ea540491e887ad.dir/depend
 cd /build/reproducible-path/plasma-nano-6.2.5/obj-arm-linux-gnueabihf && /usr/bin/cmake -E cmake_depends "Unix Makefiles" /build/reproducible-path/plasma-nano-6.2.5 /build/reproducible-path/plasma-nano-6.2.5 /build/reproducible-path/plasma-nano-6.2.5/obj-arm-linux-gnueabihf /build/reproducible-path/plasma-nano-6.2.5/obj-arm-linux-gnueabihf /build/reproducible-path/plasma-nano-6.2.5/obj-arm-linux-gnueabihf/CMakeFiles/pofiles-188acfff48a2dafa75ea540491e887ad.dir/DependInfo.cmake "--color="
 make[3]: Entering directory '/build/reproducible-path/plasma-nano-6.2.5/obj-arm-linux-gnueabihf'
 make  -f components/CMakeFiles/plasmananoshellprivateplugin_autogen_timestamp_deps.dir/build.make components/CMakeFiles/plasmananoshellprivateplugin_autogen_timestamp_deps.dir/depend
@@ -2568,9 +2604,6 @@
 make[3]: Entering directory '/build/reproducible-path/plasma-nano-6.2.5/obj-arm-linux-gnueabihf'
 cd /build/reproducible-path/plasma-nano-6.2.5/obj-arm-linux-gnueabihf && /usr/bin/cmake -E cmake_depends "Unix Makefiles" /build/reproducible-path/plasma-nano-6.2.5 /build/reproducible-path/plasma-nano-6.2.5/components /build/reproducible-path/plasma-nano-6.2.5/obj-arm-linux-gnueabihf /build/reproducible-path/plasma-nano-6.2.5/obj-arm-linux-gnueabihf/components /build/reproducible-path/plasma-nano-6.2.5/obj-arm-linux-gnueabihf/components/CMakeFiles/plasmananoshellprivateplugin_autogen_timestamp_deps.dir/DependInfo.cmake "--color="
 make[3]: Leaving directory '/build/reproducible-path/plasma-nano-6.2.5/obj-arm-linux-gnueabihf'
-make[3]: Leaving directory '/build/reproducible-path/plasma-nano-6.2.5/obj-arm-linux-gnueabihf'
-make  -f CMakeFiles/pofiles-188acfff48a2dafa75ea540491e887ad.dir/build.make CMakeFiles/pofiles-188acfff48a2dafa75ea540491e887ad.dir/build
-make[3]: Entering directory '/build/reproducible-path/plasma-nano-6.2.5/obj-arm-linux-gnueabihf'
 make  -f CMakeFiles/tsfiles-188acfff48a2dafa75ea540491e887ad.dir/build.make CMakeFiles/tsfiles-188acfff48a2dafa75ea540491e887ad.dir/build
 make[3]: Entering directory '/build/reproducible-path/plasma-nano-6.2.5/obj-arm-linux-gnueabihf'
 make[3]: Leaving directory '/build/reproducible-path/plasma-nano-6.2.5/obj-arm-linux-gnueabihf'
@@ -2578,21 +2611,24 @@
 make[3]: Entering directory '/build/reproducible-path/plasma-nano-6.2.5/obj-arm-linux-gnueabihf'
 make[3]: Nothing to be done for 'components/CMakeFiles/plasmananoshellprivateplugin_autogen_timestamp_deps.dir/build'.
 make[3]: Leaving directory '/build/reproducible-path/plasma-nano-6.2.5/obj-arm-linux-gnueabihf'
-[ 11%] Generating mo...
-/usr/bin/cmake -DGETTEXT_MSGFMT_EXECUTABLE=/usr/bin/msgfmt -DCOPY_TO=/build/reproducible-path/plasma-nano-6.2.5/obj-arm-linux-gnueabihf/locale -DPO_DIR=/build/reproducible-path/plasma-nano-6.2.5/po -P /usr/lib/arm-linux-gnueabihf/cmake/KF6I18n/build-pofiles.cmake
-[ 22%] Generating ts...
+[ 11%] Generating ts...
 /usr/bin/cmake -DPython3_EXECUTABLE=/usr/bin/python3 -D_ki18n_pmap_compile_script=/usr/lib/arm-linux-gnueabihf/cmake/KF6I18n/ts-pmap-compile.py -DCOPY_TO=/build/reproducible-path/plasma-nano-6.2.5/obj-arm-linux-gnueabihf/locale -DPO_DIR=/build/reproducible-path/plasma-nano-6.2.5/po -P /usr/lib/arm-linux-gnueabihf/cmake/KF6I18n/build-tsfiles.cmake
-[ 22%] Built target plasmananoshellprivateplugin_autogen_timestamp_deps
+make[3]: Leaving directory '/build/reproducible-path/plasma-nano-6.2.5/obj-arm-linux-gnueabihf'
+[ 11%] Built target plasmananoshellprivateplugin_autogen_timestamp_deps
+make  -f CMakeFiles/pofiles-188acfff48a2dafa75ea540491e887ad.dir/build.make CMakeFiles/pofiles-188acfff48a2dafa75ea540491e887ad.dir/build
 make  -f components/CMakeFiles/plasmananoshellprivateplugin_autogen.dir/build.make components/CMakeFiles/plasmananoshellprivateplugin_autogen.dir/depend
 make[3]: Entering directory '/build/reproducible-path/plasma-nano-6.2.5/obj-arm-linux-gnueabihf'
+make[3]: Entering directory '/build/reproducible-path/plasma-nano-6.2.5/obj-arm-linux-gnueabihf'
 cd /build/reproducible-path/plasma-nano-6.2.5/obj-arm-linux-gnueabihf && /usr/bin/cmake -E cmake_depends "Unix Makefiles" /build/reproducible-path/plasma-nano-6.2.5 /build/reproducible-path/plasma-nano-6.2.5/components /build/reproducible-path/plasma-nano-6.2.5/obj-arm-linux-gnueabihf /build/reproducible-path/plasma-nano-6.2.5/obj-arm-linux-gnueabihf/components /build/reproducible-path/plasma-nano-6.2.5/obj-arm-linux-gnueabihf/components/CMakeFiles/plasmananoshellprivateplugin_autogen.dir/DependInfo.cmake "--color="
 make[3]: Leaving directory '/build/reproducible-path/plasma-nano-6.2.5/obj-arm-linux-gnueabihf'
 make[3]: Leaving directory '/build/reproducible-path/plasma-nano-6.2.5/obj-arm-linux-gnueabihf'
 make  -f components/CMakeFiles/plasmananoshellprivateplugin_autogen.dir/build.make components/CMakeFiles/plasmananoshellprivateplugin_autogen.dir/build
 make[3]: Entering directory '/build/reproducible-path/plasma-nano-6.2.5/obj-arm-linux-gnueabihf'
-[ 22%] Built target tsfiles-188acfff48a2dafa75ea540491e887ad
+[ 22%] Generating mo...
+/usr/bin/cmake -DGETTEXT_MSGFMT_EXECUTABLE=/usr/bin/msgfmt -DCOPY_TO=/build/reproducible-path/plasma-nano-6.2.5/obj-arm-linux-gnueabihf/locale -DPO_DIR=/build/reproducible-path/plasma-nano-6.2.5/po -P /usr/lib/arm-linux-gnueabihf/cmake/KF6I18n/build-pofiles.cmake
 [ 33%] Automatic MOC for target plasmananoshellprivateplugin
 cd /build/reproducible-path/plasma-nano-6.2.5/obj-arm-linux-gnueabihf/components && /usr/bin/cmake -E cmake_autogen /build/reproducible-path/plasma-nano-6.2.5/obj-arm-linux-gnueabihf/components/CMakeFiles/plasmananoshellprivateplugin_autogen.dir/AutogenInfo.json Debian
+[ 33%] Built target tsfiles-188acfff48a2dafa75ea540491e887ad
 AutoGen: Refreshing parse cache because it doesn't exist.
 AutoMoc: Generating "SRC:/obj-arm-linux-gnueabihf/components/plasmananoshellprivateplugin_autogen/moc_predefs.h", because it doesn't exist.
 /usr/bin/c++ -std=gnu++20 -dM -E -c /usr/share/cmake-3.31/Modules/CMakeCXXCompilerABI.cpp -DKF_DEPRECATED_WARNINGS_SINCE=0x70000 -DKF_DISABLE_DEPRECATED_BEFORE_AND_AT=0x60400 -DQT_CORE_LIB -DQT_DEPRECATED_WARNINGS_SINCE=0x70000 -DQT_DISABLE_DEPRECATED_BEFORE=0x60700 -DQT_GUI_LIB -DQT_NETWORK_LIB -DQT_NO_DEBUG -DQT_OPENGL_LIB -DQT_QMLBUILTINS_LIB -DQT_QMLINTEGRATION_LIB -DQT_QMLMODELS_LIB -DQT_QML_LIB -DQT_QUICK_LIB -D_GNU_SOURCE -D_LARGEFILE64_SOURCE -Dplasmananoshellprivateplugin_EXPORTS -I/build/reproducible-path/plasma-nano-6.2.5/obj-arm-linux-gnueabihf/components -I/build/reproducible-path/plasma-nano-6.2.5/components -I/usr/include/arm-linux-gnueabihf/qt6/QtCore -I/usr/include/arm-linux-gnueabihf/qt6 -I/usr/lib/arm-linux-gnueabihf/qt6/mkspecs/linux-g++ -I/usr/include/arm-linux-gnueabihf/qt6/QtQml -I/usr/include/arm-linux-gnueabihf/qt6/QtQmlIntegration -I/usr/include/arm-linux-gnueabihf/qt6/QtQmlBuiltins -I/usr/include/arm-linux-gnueabihf/qt6/QtNetwork -I/usr/include/arm-linux-gnueabihf/qt6/QtQuick -I/usr/include/arm-linux-gnueabihf/qt6/QtGui -I/usr/include/arm-linux-gnueabihf/qt6/QtQmlModels -I/usr/include/arm-linux-gnueabihf/qt6/QtOpenGL -I/usr/include/KF6/KWindowSystem -I/usr/include/KWayland -I/usr/include/KF6/KService -I/usr/include -I/usr/include/c++/14 -I/usr/include/arm-linux-gnueabihf/c++/14 -I/usr/include/c++/14/backward -I/usr/lib/gcc/arm-linux-gnueabihf/14/include -I/usr/local/include -I/usr/include/arm-linux-gnueabihf
@@ -2611,329 +2647,44 @@
 /usr/lib/qt6/libexec/moc -DKF_DEPRECATED_WARNINGS_SINCE=0x70000 -DKF_DISABLE_DEPRECATED_BEFORE_AND_AT=0x60400 -DQT_CORE_LIB -DQT_DEPRECATED_WARNINGS_SINCE=0x70000 -DQT_DISABLE_DEPRECATED_BEFORE=0x60700 -DQT_GUI_LIB -DQT_NETWORK_LIB -DQT_NO_DEBUG -DQT_OPENGL_LIB -DQT_QMLBUILTINS_LIB -DQT_QMLINTEGRATION_LIB -DQT_QMLMODELS_LIB -DQT_QML_LIB -DQT_QUICK_LIB -D_GNU_SOURCE -D_LARGEFILE64_SOURCE -Dplasmananoshellprivateplugin_EXPORTS -I/build/reproducible-path/plasma-nano-6.2.5/obj-arm-linux-gnueabihf/components -I/build/reproducible-path/plasma-nano-6.2.5/components -I/usr/include/arm-linux-gnueabihf/qt6/QtCore -I/usr/include/arm-linux-gnueabihf/qt6 -I/usr/lib/arm-linux-gnueabihf/qt6/mkspecs/linux-g++ -I/usr/include/arm-linux-gnueabihf/qt6/QtQml -I/usr/include/arm-linux-gnueabihf/qt6/QtQmlIntegration -I/usr/include/arm-linux-gnueabihf/qt6/QtQmlBuiltins -I/usr/include/arm-linux-gnueabihf/qt6/QtNetwork -I/usr/include/arm-linux-gnueabihf/qt6/QtQuick -I/usr/include/arm-linux-gnueabihf/qt6/QtGui -I/usr/include/arm-linux-gnueabihf/qt6/QtQmlModels -I/usr/include/arm-linux-gnueabihf/qt6/QtOpenGL -I/usr/include/KF6/KWindowSystem -I/usr/include/KWayland -I/usr/include/KF6/KService -I/usr/include -I/usr/include/c++/14 -I/usr/include/arm-linux-gnueabihf/c++/14 -I/usr/include/c++/14/backward -I/usr/lib/gcc/arm-linux-gnueabihf/14/include -I/usr/local/include -I/usr/include/arm-linux-gnueabihf --include /build/reproducible-path/plasma-nano-6.2.5/obj-arm-linux-gnueabihf/components/plasmananoshellprivateplugin_autogen/moc_predefs.h --output-dep-file -o /build/reproducible-path/plasma-nano-6.2.5/obj-arm-linux-gnueabihf/components/plasmananoshellprivateplugin_autogen/EWIEGA46WW/moc_fullscreenoverlay.cpp /build/reproducible-path/plasma-nano-6.2.5/components/fullscreenoverlay.h
 make[3]: Leaving directory '/build/reproducible-path/plasma-nano-6.2.5/obj-arm-linux-gnueabihf'
 [ 33%] Built target pofiles-188acfff48a2dafa75ea540491e887ad
-AutoMoc: Reading dependencies from "SRC:/obj-arm-linux-gnueabihf/components/plasmananoshellprivateplugin_autogen/EWIEGA46WW/moc_fullscreenoverlay.cpp.d"
-AutoMoc: Generating "SRC:/obj-arm-linux-gnueabihf/components/plasmananoshellprivateplugin_autogen/EWIEGA46WW/moc_nanoshellprivateplugin.cpp", because it doesn't exist, from "SRC:/components/nanoshellprivateplugin.h"
-/usr/lib/qt6/libexec/moc -DKF_DEPRECATED_WARNINGS_SINCE=0x70000 -DKF_DISABLE_DEPRECATED_BEFORE_AND_AT=0x60400 -DQT_CORE_LIB -DQT_DEPRECATED_WARNINGS_SINCE=0x70000 -DQT_DISABLE_DEPRECATED_BEFORE=0x60700 -DQT_GUI_LIB -DQT_NETWORK_LIB -DQT_NO_DEBUG -DQT_OPENGL_LIB -DQT_QMLBUILTINS_LIB -DQT_QMLINTEGRATION_LIB -DQT_QMLMODELS_LIB -DQT_QML_LIB -DQT_QUICK_LIB -D_GNU_SOURCE -D_LARGEFILE64_SOURCE -Dplasmananoshellprivateplugin_EXPORTS -I/build/reproducible-path/plasma-nano-6.2.5/obj-arm-linux-gnueabihf/components -I/build/reproducible-path/plasma-nano-6.2.5/components -I/usr/include/arm-linux-gnueabihf/qt6/QtCore -I/usr/include/arm-linux-gnueabihf/qt6 -I/usr/lib/arm-linux-gnueabihf/qt6/mkspecs/linux-g++ -I/usr/include/arm-linux-gnueabihf/qt6/QtQml -I/usr/include/arm-linux-gnueabihf/qt6/QtQmlIntegration -I/usr/include/arm-linux-gnueabihf/qt6/QtQmlBuiltins -I/usr/include/arm-linux-gnueabihf/qt6/QtNetwork -I/usr/include/arm-linux-gnueabihf/qt6/QtQuick -I/usr/include/arm-linux-gnueabihf/qt6/QtGui -I/usr/include/arm-linux-gnueabihf/qt6/QtQmlModels -I/usr/include/arm-linux-gnueabihf/qt6/QtOpenGL -I/usr/include/KF6/KWindowSystem -I/usr/include/KWayland -I/usr/include/KF6/KService -I/usr/include -I/usr/include/c++/14 -I/usr/include/arm-linux-gnueabihf/c++/14 -I/usr/include/c++/14/backward -I/usr/lib/gcc/arm-linux-gnueabihf/14/include -I/usr/local/include -I/usr/include/arm-linux-gnueabihf --include /build/reproducible-path/plasma-nano-6.2.5/obj-arm-linux-gnueabihf/components/plasmananoshellprivateplugin_autogen/moc_predefs.h --output-dep-file -o /build/reproducible-path/plasma-nano-6.2.5/obj-arm-linux-gnueabihf/components/plasmananoshellprivateplugin_autogen/EWIEGA46WW/moc_nanoshellprivateplugin.cpp /build/reproducible-path/plasma-nano-6.2.5/components/nanoshellprivateplugin.h
-AutoMoc: Reading dependencies from "SRC:/obj-arm-linux-gnueabihf/components/plasmananoshellprivateplugin_autogen/EWIEGA46WW/moc_nanoshellprivateplugin.cpp.d"
-AutoMoc: Generating "SRC:/obj-arm-linux-gnueabihf/components/plasmananoshellprivateplugin_autogen/EWIEGA46WW/moc_startupnotifier.cpp", because it doesn't exist, from "SRC:/components/startupnotifier.h"
-/usr/lib/qt6/libexec/moc -DKF_DEPRECATED_WARNINGS_SINCE=0x70000 -DKF_DISABLE_DEPRECATED_BEFORE_AND_AT=0x60400 -DQT_CORE_LIB -DQT_DEPRECATED_WARNINGS_SINCE=0x70000 -DQT_DISABLE_DEPRECATED_BEFORE=0x60700 -DQT_GUI_LIB -DQT_NETWORK_LIB -DQT_NO_DEBUG -DQT_OPENGL_LIB -DQT_QMLBUILTINS_LIB -DQT_QMLINTEGRATION_LIB -DQT_QMLMODELS_LIB -DQT_QML_LIB -DQT_QUICK_LIB -D_GNU_SOURCE -D_LARGEFILE64_SOURCE -Dplasmananoshellprivateplugin_EXPORTS -I/build/reproducible-path/plasma-nano-6.2.5/obj-arm-linux-gnueabihf/components -I/build/reproducible-path/plasma-nano-6.2.5/components -I/usr/include/arm-linux-gnueabihf/qt6/QtCore -I/usr/include/arm-linux-gnueabihf/qt6 -I/usr/lib/arm-linux-gnueabihf/qt6/mkspecs/linux-g++ -I/usr/include/arm-linux-gnueabihf/qt6/QtQml -I/usr/include/arm-linux-gnueabihf/qt6/QtQmlIntegration -I/usr/include/arm-linux-gnueabihf/qt6/QtQmlBuiltins -I/usr/include/arm-linux-gnueabihf/qt6/QtNetwork -I/usr/include/arm-linux-gnueabihf/qt6/QtQuick -I/usr/include/arm-linux-gnueabihf/qt6/QtGui -I/usr/include/arm-linux-gnueabihf/qt6/QtQmlModels -I/usr/include/arm-linux-gnueabihf/qt6/QtOpenGL -I/usr/include/KF6/KWindowSystem -I/usr/include/KWayland -I/usr/include/KF6/KService -I/usr/include -I/usr/include/c++/14 -I/usr/include/arm-linux-gnueabihf/c++/14 -I/usr/include/c++/14/backward -I/usr/lib/gcc/arm-linux-gnueabihf/14/include -I/usr/local/include -I/usr/include/arm-linux-gnueabihf --include /build/reproducible-path/plasma-nano-6.2.5/obj-arm-linux-gnueabihf/components/plasmananoshellprivateplugin_autogen/moc_predefs.h --output-dep-file -o /build/reproducible-path/plasma-nano-6.2.5/obj-arm-linux-gnueabihf/components/plasmananoshellprivateplugin_autogen/EWIEGA46WW/moc_startupnotifier.cpp /build/reproducible-path/plasma-nano-6.2.5/components/startupnotifier.h
-AutoMoc: Reading dependencies from "SRC:/obj-arm-linux-gnueabihf/components/plasmananoshellprivateplugin_autogen/EWIEGA46WW/moc_startupnotifier.cpp.d"
-AutoMoc: Generating "SRC:/obj-arm-linux-gnueabihf/components/plasmananoshellprivateplugin_autogen/include/fullscreenoverlay.moc", because it doesn't exist, from "SRC:/components/fullscreenoverlay.cpp"
-/usr/lib/qt6/libexec/moc -DKF_DEPRECATED_WARNINGS_SINCE=0x70000 -DKF_DISABLE_DEPRECATED_BEFORE_AND_AT=0x60400 -DQT_CORE_LIB -DQT_DEPRECATED_WARNINGS_SINCE=0x70000 -DQT_DISABLE_DEPRECATED_BEFORE=0x60700 -DQT_GUI_LIB -DQT_NETWORK_LIB -DQT_NO_DEBUG -DQT_OPENGL_LIB -DQT_QMLBUILTINS_LIB -DQT_QMLINTEGRATION_LIB -DQT_QMLMODELS_LIB -DQT_QML_LIB -DQT_QUICK_LIB -D_GNU_SOURCE -D_LARGEFILE64_SOURCE -Dplasmananoshellprivateplugin_EXPORTS -I/build/reproducible-path/plasma-nano-6.2.5/obj-arm-linux-gnueabihf/components -I/build/reproducible-path/plasma-nano-6.2.5/components -I/usr/include/arm-linux-gnueabihf/qt6/QtCore -I/usr/include/arm-linux-gnueabihf/qt6 -I/usr/lib/arm-linux-gnueabihf/qt6/mkspecs/linux-g++ -I/usr/include/arm-linux-gnueabihf/qt6/QtQml -I/usr/include/arm-linux-gnueabihf/qt6/QtQmlIntegration -I/usr/include/arm-linux-gnueabihf/qt6/QtQmlBuiltins -I/usr/include/arm-linux-gnueabihf/qt6/QtNetwork -I/usr/include/arm-linux-gnueabihf/qt6/QtQuick -I/usr/include/arm-linux-gnueabihf/qt6/QtGui -I/usr/include/arm-linux-gnueabihf/qt6/QtQmlModels -I/usr/include/arm-linux-gnueabihf/qt6/QtOpenGL -I/usr/include/KF6/KWindowSystem -I/usr/include/KWayland -I/usr/include/KF6/KService -I/usr/include -I/usr/include/c++/14 -I/usr/include/arm-linux-gnueabihf/c++/14 -I/usr/include/c++/14/backward -I/usr/lib/gcc/arm-linux-gnueabihf/14/include -I/usr/local/include -I/usr/include/arm-linux-gnueabihf --include /build/reproducible-path/plasma-nano-6.2.5/obj-arm-linux-gnueabihf/components/plasmananoshellprivateplugin_autogen/moc_predefs.h --output-dep-file -o /build/reproducible-path/plasma-nano-6.2.5/obj-arm-linux-gnueabihf/components/plasmananoshellprivateplugin_autogen/include/fullscreenoverlay.moc /build/reproducible-path/plasma-nano-6.2.5/components/fullscreenoverlay.cpp
-AutoMoc: /build/reproducible-path/plasma-nano-6.2.5/components/fullscreenoverlay.cpp: note: No relevant classes found. No output generated.
-AutoMoc: Reading dependencies from "SRC:/obj-arm-linux-gnueabihf/components/plasmananoshellprivateplugin_autogen/include/fullscreenoverlay.moc.d"
-AutoMoc: Generating MOC compilation "SRC:/obj-arm-linux-gnueabihf/components/plasmananoshellprivateplugin_autogen/mocs_compilation.cpp"
-AutoMoc: Merging MOC dependencies into "SRC:/obj-arm-linux-gnueabihf/components/plasmananoshellprivateplugin_autogen/deps"
-AutoGen: Writing the parse cache file "SRC:/obj-arm-linux-gnueabihf/components/CMakeFiles/plasmananoshellprivateplugin_autogen.dir/ParseCache.txt"
-AutoGen: Writing the settings file "SRC:/obj-arm-linux-gnueabihf/components/CMakeFiles/plasmananoshellprivateplugin_autogen.dir/AutogenUsed.txt"
-cd /build/reproducible-path/plasma-nano-6.2.5/obj-arm-linux-gnueabihf/components && /usr/bin/cmake -E touch /build/reproducible-path/plasma-nano-6.2.5/obj-arm-linux-gnueabihf/components/plasmananoshellprivateplugin_autogen/timestamp
-make[3]: Leaving directory '/build/reproducible-path/plasma-nano-6.2.5/obj-arm-linux-gnueabihf'
-[ 33%] Built target plasmananoshellprivateplugin_autogen
-make  -f components/CMakeFiles/plasmananoshellprivateplugin.dir/build.make components/CMakeFiles/plasmananoshellprivateplugin.dir/depend
-make[3]: Entering directory '/build/reproducible-path/plasma-nano-6.2.5/obj-arm-linux-gnueabihf'
-cd /build/reproducible-path/plasma-nano-6.2.5/obj-arm-linux-gnueabihf && /usr/bin/cmake -E cmake_depends "Unix Makefiles" /build/reproducible-path/plasma-nano-6.2.5 /build/reproducible-path/plasma-nano-6.2.5/components /build/reproducible-path/plasma-nano-6.2.5/obj-arm-linux-gnueabihf /build/reproducible-path/plasma-nano-6.2.5/obj-arm-linux-gnueabihf/components /build/reproducible-path/plasma-nano-6.2.5/obj-arm-linux-gnueabihf/components/CMakeFiles/plasmananoshellprivateplugin.dir/DependInfo.cmake "--color="
-Dependencies file "components/plasmananoshellprivateplugin_autogen/deps" is newer than depends file "/build/reproducible-path/plasma-nano-6.2.5/obj-arm-linux-gnueabihf/components/CMakeFiles/plasmananoshellprivateplugin.dir/compiler_depend.internal".
-Consolidate compiler generated dependencies of target plasmananoshellprivateplugin
-make[3]: Leaving directory '/build/reproducible-path/plasma-nano-6.2.5/obj-arm-linux-gnueabihf'
-make  -f components/CMakeFiles/plasmananoshellprivateplugin.dir/build.make components/CMakeFiles/plasmananoshellprivateplugin.dir/build
-make[3]: Entering directory '/build/reproducible-path/plasma-nano-6.2.5/obj-arm-linux-gnueabihf'
-[ 44%] Building CXX object components/CMakeFiles/plasmananoshellprivateplugin.dir/fullscreenoverlay.cpp.o
-[ 55%] Building CXX object components/CMakeFiles/plasmananoshellprivateplugin.dir/plasmananoshellprivateplugin_autogen/mocs_compilation.cpp.o
-cd /build/reproducible-path/plasma-nano-6.2.5/obj-arm-linux-gnueabihf/components && /usr/bin/c++ -DKF_DEPRECATED_WARNINGS_SINCE=0x70000 -DKF_DISABLE_DEPRECATED_BEFORE_AND_AT=0x60400 -DQT_CORE_LIB -DQT_DEPRECATED_WARNINGS_SINCE=0x70000 -DQT_DISABLE_DEPRECATED_BEFORE=0x60700 -DQT_GUI_LIB -DQT_NETWORK_LIB -DQT_NO_DEBUG -DQT_OPENGL_LIB -DQT_QMLBUILTINS_LIB -DQT_QMLINTEGRATION_LIB -DQT_QMLMODELS_LIB -DQT_QML_LIB -DQT_QUICK_LIB -D_GNU_SOURCE -D_LARGEFILE64_SOURCE -Dplasmananoshellprivateplugin_EXPORTS -I/build/reproducible-path/plasma-nano-6.2.5/obj-arm-linux-gnueabihf/components -I/build/reproducible-path/plasma-nano-6.2.5/components -I/build/reproducible-path/plasma-nano-6.2.5/obj-arm-linux-gnueabihf/components/plasmananoshellprivateplugin_autogen/include -isystem /usr/include/arm-linux-gnueabihf/qt6/QtCore -isystem /usr/include/arm-linux-gnueabihf/qt6 -isystem /usr/lib/arm-linux-gnueabihf/qt6/mkspecs/linux-g++ -isystem /usr/include/arm-linux-gnueabihf/qt6/QtQml -isystem /usr/include/arm-linux-gnueabihf/qt6/QtQmlIntegration -isystem /usr/include/arm-linux-gnueabihf/qt6/QtQmlBuiltins -isystem /usr/include/arm-linux-gnueabihf/qt6/QtNetwork -isystem /usr/include/arm-linux-gnueabihf/qt6/QtQuick -isystem /usr/include/arm-linux-gnueabihf/qt6/QtGui -isystem /usr/include/arm-linux-gnueabihf/qt6/QtQmlModels -isystem /usr/include/arm-linux-gnueabihf/qt6/QtOpenGL -isystem /usr/include/KF6/KWindowSystem -isystem /usr/include/KWayland -isystem /usr/include/KF6/KService -g -O2 -ffile-prefix-map=/build/reproducible-path/plasma-nano-6.2.5=. -fstack-protector-strong -fstack-clash-protection -Wformat -Werror=format-security -D_LARGEFILE_SOURCE -D_FILE_OFFSET_BITS=64 -D_TIME_BITS=64 -Wdate-time -D_FORTIFY_SOURCE=2 -fno-operator-names -fno-exceptions -Wall -Wextra -Wcast-align -Wchar-subscripts -Wformat-security -Wno-long-long -Wpointer-arith -Wundef -Wnon-virtual-dtor -Woverloaded-virtual -Werror=return-type -Werror=init-self -Wvla -Wdate-time -Wsuggest-override -Wlogical-op -std=gnu++20 -fPIC -fvisibility=hidden -fvisibility-inlines-hidden -MD -MT components/CMakeFiles/plasmananoshellprivateplugin.dir/fullscreenoverlay.cpp.o -MF CMakeFiles/plasmananoshellprivateplugin.dir/fullscreenoverlay.cpp.o.d -o CMakeFiles/plasmananoshellprivateplugin.dir/fullscreenoverlay.cpp.o -c /build/reproducible-path/plasma-nano-6.2.5/components/fullscreenoverlay.cpp
-cd /build/reproducible-path/plasma-nano-6.2.5/obj-arm-linux-gnueabihf/components && /usr/bin/c++ -DKF_DEPRECATED_WARNINGS_SINCE=0x70000 -DKF_DISABLE_DEPRECATED_BEFORE_AND_AT=0x60400 -DQT_CORE_LIB -DQT_DEPRECATED_WARNINGS_SINCE=0x70000 -DQT_DISABLE_DEPRECATED_BEFORE=0x60700 -DQT_GUI_LIB -DQT_NETWORK_LIB -DQT_NO_DEBUG -DQT_OPENGL_LIB -DQT_QMLBUILTINS_LIB -DQT_QMLINTEGRATION_LIB -DQT_QMLMODELS_LIB -DQT_QML_LIB -DQT_QUICK_LIB -D_GNU_SOURCE -D_LARGEFILE64_SOURCE -Dplasmananoshellprivateplugin_EXPORTS -I/build/reproducible-path/plasma-nano-6.2.5/obj-arm-linux-gnueabihf/components -I/build/reproducible-path/plasma-nano-6.2.5/components -I/build/reproducible-path/plasma-nano-6.2.5/obj-arm-linux-gnueabihf/components/plasmananoshellprivateplugin_autogen/include -isystem /usr/include/arm-linux-gnueabihf/qt6/QtCore -isystem /usr/include/arm-linux-gnueabihf/qt6 -isystem /usr/lib/arm-linux-gnueabihf/qt6/mkspecs/linux-g++ -isystem /usr/include/arm-linux-gnueabihf/qt6/QtQml -isystem /usr/include/arm-linux-gnueabihf/qt6/QtQmlIntegration -isystem /usr/include/arm-linux-gnueabihf/qt6/QtQmlBuiltins -isystem /usr/include/arm-linux-gnueabihf/qt6/QtNetwork -isystem /usr/include/arm-linux-gnueabihf/qt6/QtQuick -isystem /usr/include/arm-linux-gnueabihf/qt6/QtGui -isystem /usr/include/arm-linux-gnueabihf/qt6/QtQmlModels -isystem /usr/include/arm-linux-gnueabihf/qt6/QtOpenGL -isystem /usr/include/KF6/KWindowSystem -isystem /usr/include/KWayland -isystem /usr/include/KF6/KService -g -O2 -ffile-prefix-map=/build/reproducible-path/plasma-nano-6.2.5=. -fstack-protector-strong -fstack-clash-protection -Wformat -Werror=format-security -D_LARGEFILE_SOURCE -D_FILE_OFFSET_BITS=64 -D_TIME_BITS=64 -Wdate-time -D_FORTIFY_SOURCE=2 -fno-operator-names -fno-exceptions -Wall -Wextra -Wcast-align -Wchar-subscripts -Wformat-security -Wno-long-long -Wpointer-arith -Wundef -Wnon-virtual-dtor -Woverloaded-virtual -Werror=return-type -Werror=init-self -Wvla -Wdate-time -Wsuggest-override -Wlogical-op -std=gnu++20 -fPIC -fvisibility=hidden -fvisibility-inlines-hidden -MD -MT components/CMakeFiles/plasmananoshellprivateplugin.dir/plasmananoshellprivateplugin_autogen/mocs_compilation.cpp.o -MF CMakeFiles/plasmananoshellprivateplugin.dir/plasmananoshellprivateplugin_autogen/mocs_compilation.cpp.o.d -o CMakeFiles/plasmananoshellprivateplugin.dir/plasmananoshellprivateplugin_autogen/mocs_compilation.cpp.o -c /build/reproducible-path/plasma-nano-6.2.5/obj-arm-linux-gnueabihf/components/plasmananoshellprivateplugin_autogen/mocs_compilation.cpp
-[ 66%] Building CXX object components/CMakeFiles/plasmananoshellprivateplugin.dir/nanoshellprivateplugin.cpp.o
-cd /build/reproducible-path/plasma-nano-6.2.5/obj-arm-linux-gnueabihf/components && /usr/bin/c++ -DKF_DEPRECATED_WARNINGS_SINCE=0x70000 -DKF_DISABLE_DEPRECATED_BEFORE_AND_AT=0x60400 -DQT_CORE_LIB -DQT_DEPRECATED_WARNINGS_SINCE=0x70000 -DQT_DISABLE_DEPRECATED_BEFORE=0x60700 -DQT_GUI_LIB -DQT_NETWORK_LIB -DQT_NO_DEBUG -DQT_OPENGL_LIB -DQT_QMLBUILTINS_LIB -DQT_QMLINTEGRATION_LIB -DQT_QMLMODELS_LIB -DQT_QML_LIB -DQT_QUICK_LIB -D_GNU_SOURCE -D_LARGEFILE64_SOURCE -Dplasmananoshellprivateplugin_EXPORTS -I/build/reproducible-path/plasma-nano-6.2.5/obj-arm-linux-gnueabihf/components -I/build/reproducible-path/plasma-nano-6.2.5/components -I/build/reproducible-path/plasma-nano-6.2.5/obj-arm-linux-gnueabihf/components/plasmananoshellprivateplugin_autogen/include -isystem /usr/include/arm-linux-gnueabihf/qt6/QtCore -isystem /usr/include/arm-linux-gnueabihf/qt6 -isystem /usr/lib/arm-linux-gnueabihf/qt6/mkspecs/linux-g++ -isystem /usr/include/arm-linux-gnueabihf/qt6/QtQml -isystem /usr/include/arm-linux-gnueabihf/qt6/QtQmlIntegration -isystem /usr/include/arm-linux-gnueabihf/qt6/QtQmlBuiltins -isystem /usr/include/arm-linux-gnueabihf/qt6/QtNetwork -isystem /usr/include/arm-linux-gnueabihf/qt6/QtQuick -isystem /usr/include/arm-linux-gnueabihf/qt6/QtGui -isystem /usr/include/arm-linux-gnueabihf/qt6/QtQmlModels -isystem /usr/include/arm-linux-gnueabihf/qt6/QtOpenGL -isystem /usr/include/KF6/KWindowSystem -isystem /usr/include/KWayland -isystem /usr/include/KF6/KService -g -O2 -ffile-prefix-map=/build/reproducible-path/plasma-nano-6.2.5=. -fstack-protector-strong -fstack-clash-protection -Wformat -Werror=format-security -D_LARGEFILE_SOURCE -D_FILE_OFFSET_BITS=64 -D_TIME_BITS=64 -Wdate-time -D_FORTIFY_SOURCE=2 -fno-operator-names -fno-exceptions -Wall -Wextra -Wcast-align -Wchar-subscripts -Wformat-security -Wno-long-long -Wpointer-arith -Wundef -Wnon-virtual-dtor -Woverloaded-virtual -Werror=return-type -Werror=init-self -Wvla -Wdate-time -Wsuggest-override -Wlogical-op -std=gnu++20 -fPIC -fvisibility=hidden -fvisibility-inlines-hidden -MD -MT components/CMakeFiles/plasmananoshellprivateplugin.dir/nanoshellprivateplugin.cpp.o -MF CMakeFiles/plasmananoshellprivateplugin.dir/nanoshellprivateplugin.cpp.o.d -o CMakeFiles/plasmananoshellprivateplugin.dir/nanoshellprivateplugin.cpp.o -c /build/reproducible-path/plasma-nano-6.2.5/components/nanoshellprivateplugin.cpp
-[ 77%] Building CXX object components/CMakeFiles/plasmananoshellprivateplugin.dir/startupnotifier.cpp.o
-cd /build/reproducible-path/plasma-nano-6.2.5/obj-arm-linux-gnueabihf/components && /usr/bin/c++ -DKF_DEPRECATED_WARNINGS_SINCE=0x70000 -DKF_DISABLE_DEPRECATED_BEFORE_AND_AT=0x60400 -DQT_CORE_LIB -DQT_DEPRECATED_WARNINGS_SINCE=0x70000 -DQT_DISABLE_DEPRECATED_BEFORE=0x60700 -DQT_GUI_LIB -DQT_NETWORK_LIB -DQT_NO_DEBUG -DQT_OPENGL_LIB -DQT_QMLBUILTINS_LIB -DQT_QMLINTEGRATION_LIB -DQT_QMLMODELS_LIB -DQT_QML_LIB -DQT_QUICK_LIB -D_GNU_SOURCE -D_LARGEFILE64_SOURCE -Dplasmananoshellprivateplugin_EXPORTS -I/build/reproducible-path/plasma-nano-6.2.5/obj-arm-linux-gnueabihf/components -I/build/reproducible-path/plasma-nano-6.2.5/components -I/build/reproducible-path/plasma-nano-6.2.5/obj-arm-linux-gnueabihf/components/plasmananoshellprivateplugin_autogen/include -isystem /usr/include/arm-linux-gnueabihf/qt6/QtCore -isystem /usr/include/arm-linux-gnueabihf/qt6 -isystem /usr/lib/arm-linux-gnueabihf/qt6/mkspecs/linux-g++ -isystem /usr/include/arm-linux-gnueabihf/qt6/QtQml -isystem /usr/include/arm-linux-gnueabihf/qt6/QtQmlIntegration -isystem /usr/include/arm-linux-gnueabihf/qt6/QtQmlBuiltins -isystem /usr/include/arm-linux-gnueabihf/qt6/QtNetwork -isystem /usr/include/arm-linux-gnueabihf/qt6/QtQuick -isystem /usr/include/arm-linux-gnueabihf/qt6/QtGui -isystem /usr/include/arm-linux-gnueabihf/qt6/QtQmlModels -isystem /usr/include/arm-linux-gnueabihf/qt6/QtOpenGL -isystem /usr/include/KF6/KWindowSystem -isystem /usr/include/KWayland -isystem /usr/include/KF6/KService -g -O2 -ffile-prefix-map=/build/reproducible-path/plasma-nano-6.2.5=. -fstack-protector-strong -fstack-clash-protection -Wformat -Werror=format-security -D_LARGEFILE_SOURCE -D_FILE_OFFSET_BITS=64 -D_TIME_BITS=64 -Wdate-time -D_FORTIFY_SOURCE=2 -fno-operator-names -fno-exceptions -Wall -Wextra -Wcast-align -Wchar-subscripts -Wformat-security -Wno-long-long -Wpointer-arith -Wundef -Wnon-virtual-dtor -Woverloaded-virtual -Werror=return-type -Werror=init-self -Wvla -Wdate-time -Wsuggest-override -Wlogical-op -std=gnu++20 -fPIC -fvisibility=hidden -fvisibility-inlines-hidden -MD -MT components/CMakeFiles/plasmananoshellprivateplugin.dir/startupnotifier.cpp.o -MF CMakeFiles/plasmananoshellprivateplugin.dir/startupnotifier.cpp.o.d -o CMakeFiles/plasmananoshellprivateplugin.dir/startupnotifier.cpp.o -c /build/reproducible-path/plasma-nano-6.2.5/components/startupnotifier.cpp
-[ 88%] Linking CXX shared library ../bin/libplasmananoshellprivateplugin.so
-cd /build/reproducible-path/plasma-nano-6.2.5/obj-arm-linux-gnueabihf/components && /usr/bin/cmake -E cmake_link_script CMakeFiles/plasmananoshellprivateplugin.dir/link.txt --verbose=1
-/usr/bin/c++ -fPIC -g -O2 -ffile-prefix-map=/build/reproducible-path/plasma-nano-6.2.5=. -fstack-protector-strong -fstack-clash-protection -Wformat -Werror=format-security -D_LARGEFILE_SOURCE -D_FILE_OFFSET_BITS=64 -D_TIME_BITS=64 -Wdate-time -D_FORTIFY_SOURCE=2 -fno-operator-names -fno-exceptions -Wall -Wextra -Wcast-align -Wchar-subscripts -Wformat-security -Wno-long-long -Wpointer-arith -Wundef -Wnon-virtual-dtor -Woverloaded-virtual -Werror=return-type -Werror=init-self -Wvla -Wdate-time -Wsuggest-override -Wlogical-op -Wl,--no-undefined -Wl,--fatal-warnings -Wl,--enable-new-dtags -Wl,-z,relro -Wl,-z,now -shared -Wl,-soname,libplasmananoshellprivateplugin.so -o ../bin/libplasmananoshellprivateplugin.so CMakeFiles/plasmananoshellprivateplugin.dir/plasmananoshellprivateplugin_autogen/mocs_compilation.cpp.o CMakeFiles/plasmananoshellprivateplugin.dir/fullscreenoverlay.cpp.o CMakeFiles/plasmananoshellprivateplugin.dir/nanoshellprivateplugin.cpp.o CMakeFiles/plasmananoshellprivateplugin.dir/startupnotifier.cpp.o  /usr/lib/arm-linux-gnueabihf/libKF6WindowSystem.so.6.8.0 /usr/lib/arm-linux-gnueabihf/libKWaylandClient.so.6.2.5 /usr/lib/arm-linux-gnueabihf/libKF6Service.so.6.8.0 /usr/lib/arm-linux-gnueabihf/libQt6Quick.so.6.7.2 /usr/lib/arm-linux-gnueabihf/libQt6QmlModels.so.6.7.2 /usr/lib/arm-linux-gnueabihf/libQt6Qml.so.6.7.2 /usr/lib/arm-linux-gnueabihf/libQt6QmlBuiltins.a /usr/lib/arm-linux-gnueabihf/libQt6Network.so.6.7.2 /usr/lib/arm-linux-gnueabihf/libQt6OpenGL.so.6.7.2 /usr/lib/arm-linux-gnueabihf/libX11.so /usr/lib/arm-linux-gnueabihf/libQt6Gui.so.6.7.2 /usr/lib/arm-linux-gnueabihf/libGLX.so /usr/lib/arm-linux-gnueabihf/libOpenGL.so /usr/lib/arm-linux-gnueabihf/libQt6Core.so.6.7.2
+
+AutoMoc subprocess error
+------------------------
+The moc process failed to compile
+  "SRC:/components/fullscreenoverlay.h"
+into
+  "SRC:/obj-arm-linux-gnueabihf/components/plasmananoshellprivateplugin_autogen/EWIEGA46WW/moc_fullscreenoverlay.cpp"
+Process was terminated by signal 11
+
+Command
+-------
+/usr/lib/qt6/libexec/moc -DKF_DEPRECATED_WARNINGS_SINCE=0x70000 -DKF_DISABLE_DEPRECATED_BEFORE_AND_AT=0x60400 -DQT_CORE_LIB -DQT_DEPRECATED_WARNINGS_SINCE=0x70000 -DQT_DISABLE_DEPRECATED_BEFORE=0x60700 -DQT_GUI_LIB -DQT_NETWORK_LIB -DQT_NO_DEBUG -DQT_OPENGL_LIB -DQT_QMLBUILTINS_LIB -DQT_QMLINTEGRATION_LIB -DQT_QMLMODELS_LIB -DQT_QML_LIB -DQT_QUICK_LIB -D_GNU_SOURCE -D_LARGEFILE64_SOURCE -Dplasmananoshellprivateplugin_EXPORTS -I/build/reproducible-path/plasma-nano-6.2.5/obj-arm-linux-gnueabihf/components -I/build/reproducible-path/plasma-nano-6.2.5/components -I/usr/include/arm-linux-gnueabihf/qt6/QtCore -I/usr/include/arm-linux-gnueabihf/qt6 -I/usr/lib/arm-linux-gnueabihf/qt6/mkspecs/linux-g++ -I/usr/include/arm-linux-gnueabihf/qt6/QtQml -I/usr/include/arm-linux-gnueabihf/qt6/QtQmlIntegration -I/usr/include/arm-linux-gnueabihf/qt6/QtQmlBuiltins -I/usr/include/arm-linux-gnueabihf/qt6/QtNetwork -I/usr/include/arm-linux-gnueabihf/qt6/QtQuick -I/usr/include/arm-linux-gnueabihf/qt6/QtGui -I/usr/include/arm-linux-gnueabihf/qt6/QtQmlModels -I/usr/include/arm-linux-gnueabihf/qt6/QtOpenGL -I/usr/include/KF6/KWindowSystem -I/usr/include/KWayland -I/usr/include/KF6/KService -I/usr/include -I/usr/include/c++/14 -I/usr/include/arm-linux-gnueabihf/c++/14 -I/usr/include/c++/14/backward -I/usr/lib/gcc/arm-linux-gnueabihf/14/include -I/usr/local/include -I/usr/include/arm-linux-gnueabihf --include /build/reproducible-path/plasma-nano-6.2.5/obj-arm-linux-gnueabihf/components/plasmananoshellprivateplugin_autogen/moc_predefs.h --output-dep-file -o /build/reproducible-path/plasma-nano-6.2.5/obj-arm-linux-gnueabihf/components/plasmananoshellprivateplugin_autogen/EWIEGA46WW/moc_fullscreenoverlay.cpp /build/reproducible-path/plasma-nano-6.2.5/components/fullscreenoverlay.h
+
+Output
+------
+
+
+make[3]: *** [components/CMakeFiles/plasmananoshellprivateplugin_autogen.dir/build.make:77: components/plasmananoshellprivateplugin_autogen/timestamp] Error 1
 make[3]: Leaving directory '/build/reproducible-path/plasma-nano-6.2.5/obj-arm-linux-gnueabihf'
-[100%] Built target plasmananoshellprivateplugin
-make[2]: Leaving directory '/build/reproducible-path/plasma-nano-6.2.5/obj-arm-linux-gnueabihf'
-/usr/bin/cmake -E cmake_progress_start /build/reproducible-path/plasma-nano-6.2.5/obj-arm-linux-gnueabihf/CMakeFiles 0
-make[1]: Leaving directory '/build/reproducible-path/plasma-nano-6.2.5/obj-arm-linux-gnueabihf'
-   dh_auto_test --buildsystem=kf6
-	cd obj-arm-linux-gnueabihf && make -j3 test ARGS\+=--verbose ARGS\+=-j3
-make[1]: Entering directory '/build/reproducible-path/plasma-nano-6.2.5/obj-arm-linux-gnueabihf'
-Running tests...
-/usr/bin/ctest --force-new-ctest-process --verbose -j3
-UpdateCTestConfiguration  from :/build/reproducible-path/plasma-nano-6.2.5/obj-arm-linux-gnueabihf/DartConfiguration.tcl
-UpdateCTestConfiguration  from :/build/reproducible-path/plasma-nano-6.2.5/obj-arm-linux-gnueabihf/DartConfiguration.tcl
-Test project /build/reproducible-path/plasma-nano-6.2.5/obj-arm-linux-gnueabihf
-Constructing a list of tests
-Done constructing a list of tests
-Updating test list for fixtures
-Added 0 tests to meet fixture requirements
-Checking test dependency graph...
-Checking test dependency graph end
-Connected to MAKE jobserver
-No tests were found!!!
-make[1]: Leaving directory '/build/reproducible-path/plasma-nano-6.2.5/obj-arm-linux-gnueabihf'
-   create-stamp debian/debhelper-build-stamp
-   dh_prep
-   dh_auto_install --buildsystem=kf6 --destdir=debian/plasma-nano/
-	cd obj-arm-linux-gnueabihf && make -j3 install DESTDIR=/build/reproducible-path/plasma-nano-6.2.5/debian/plasma-nano AM_UPDATE_INFO_DIR=no "INSTALL=install --strip-program=true"
-make[1]: Entering directory '/build/reproducible-path/plasma-nano-6.2.5/obj-arm-linux-gnueabihf'
-/usr/bin/cmake -S/build/reproducible-path/plasma-nano-6.2.5 -B/build/reproducible-path/plasma-nano-6.2.5/obj-arm-linux-gnueabihf --check-build-system CMakeFiles/Makefile.cmake 0
-make  -f CMakeFiles/Makefile2 preinstall
-make[2]: Entering directory '/build/reproducible-path/plasma-nano-6.2.5/obj-arm-linux-gnueabihf'
-make[2]: Nothing to be done for 'preinstall'.
+make[2]: *** [CMakeFiles/Makefile2:675: components/CMakeFiles/plasmananoshellprivateplugin_autogen.dir/all] Error 2
 make[2]: Leaving directory '/build/reproducible-path/plasma-nano-6.2.5/obj-arm-linux-gnueabihf'
-Install the project...
-/usr/bin/cmake -P cmake_install.cmake
--- Install configuration: "Debian"
--- Installing: /build/reproducible-path/plasma-nano-6.2.5/debian/plasma-nano/usr/share/plasma/shells/org.kde.plasma.nano
--- Installing: /build/reproducible-path/plasma-nano-6.2.5/debian/plasma-nano/usr/share/plasma/shells/org.kde.plasma.nano/contents
--- Installing: /build/reproducible-path/plasma-nano-6.2.5/debian/plasma-nano/usr/share/plasma/shells/org.kde.plasma.nano/contents/defaults
--- Installing: /build/reproducible-path/plasma-nano-6.2.5/debian/plasma-nano/usr/share/plasma/shells/org.kde.plasma.nano/contents/configuration
--- Installing: /build/reproducible-path/plasma-nano-6.2.5/debian/plasma-nano/usr/share/plasma/shells/org.kde.plasma.nano/contents/configuration/AppletConfiguration.qml
--- Installing: /build/reproducible-path/plasma-nano-6.2.5/debian/plasma-nano/usr/share/plasma/shells/org.kde.plasma.nano/contents/configuration/ConfigurationContainmentAppearance.qml
--- Installing: /build/reproducible-path/plasma-nano-6.2.5/debian/plasma-nano/usr/share/plasma/shells/org.kde.plasma.nano/contents/configuration/ConfigCategoryDelegate.qml
--- Installing: /build/reproducible-path/plasma-nano-6.2.5/debian/plasma-nano/usr/share/plasma/shells/org.kde.plasma.nano/contents/configuration/ContainmentConfiguration.qml
--- Installing: /build/reproducible-path/plasma-nano-6.2.5/debian/plasma-nano/usr/share/plasma/shells/org.kde.plasma.nano/contents/loader.qml
--- Installing: /build/reproducible-path/plasma-nano-6.2.5/debian/plasma-nano/usr/share/plasma/shells/org.kde.plasma.nano/contents/views
--- Installing: /build/reproducible-path/plasma-nano-6.2.5/debian/plasma-nano/usr/share/plasma/shells/org.kde.plasma.nano/contents/views/Panel.qml
--- Installing: /build/reproducible-path/plasma-nano-6.2.5/debian/plasma-nano/usr/share/plasma/shells/org.kde.plasma.nano/contents/views/Desktop.qml
--- Installing: /build/reproducible-path/plasma-nano-6.2.5/debian/plasma-nano/usr/share/plasma/shells/org.kde.plasma.nano/contents/layout.js
--- Installing: /build/reproducible-path/plasma-nano-6.2.5/debian/plasma-nano/usr/share/plasma/shells/org.kde.plasma.nano/contents/applet
--- Installing: /build/reproducible-path/plasma-nano-6.2.5/debian/plasma-nano/usr/share/plasma/shells/org.kde.plasma.nano/contents/applet/DefaultCompactRepresentation.qml
--- Installing: /build/reproducible-path/plasma-nano-6.2.5/debian/plasma-nano/usr/share/plasma/shells/org.kde.plasma.nano/contents/applet/CompactApplet.qml
--- Installing: /build/reproducible-path/plasma-nano-6.2.5/debian/plasma-nano/usr/share/plasma/shells/org.kde.plasma.nano/contents/applet/AppletError.qml
--- Installing: /build/reproducible-path/plasma-nano-6.2.5/debian/plasma-nano/usr/share/plasma/shells/org.kde.plasma.nano/contents/explorer
--- Installing: /build/reproducible-path/plasma-nano-6.2.5/debian/plasma-nano/usr/share/plasma/shells/org.kde.plasma.nano/contents/explorer/WidgetExplorer.qml
--- Installing: /build/reproducible-path/plasma-nano-6.2.5/debian/plasma-nano/usr/share/plasma/shells/org.kde.plasma.nano/contents/explorer/AppletDelegate.qml
--- Installing: /build/reproducible-path/plasma-nano-6.2.5/debian/plasma-nano/usr/share/plasma/shells/org.kde.plasma.nano/metadata.json
--- Installing: /build/reproducible-path/plasma-nano-6.2.5/debian/plasma-nano/usr/lib/arm-linux-gnueabihf/qt6/qml/org/kde/plasma/private/nanoshell/libplasmananoshellprivateplugin.so
--- Installing: /build/reproducible-path/plasma-nano-6.2.5/debian/plasma-nano/usr/lib/arm-linux-gnueabihf/qt6/qml/org/kde/plasma/private/nanoshell/qmldir
--- Installing: /build/reproducible-path/plasma-nano-6.2.5/debian/plasma-nano/usr/lib/arm-linux-gnueabihf/qt6/qml/org/kde/plasma/private/nanoshell//qml
--- Installing: /build/reproducible-path/plasma-nano-6.2.5/debian/plasma-nano/usr/lib/arm-linux-gnueabihf/qt6/qml/org/kde/plasma/private/nanoshell//qml/StartupFeedback.qml
--- Installing: /build/reproducible-path/plasma-nano-6.2.5/debian/plasma-nano/usr/share/locale
--- Installing: /build/reproducible-path/plasma-nano-6.2.5/debian/plasma-nano/usr/share/locale/ja
--- Installing: /build/reproducible-path/plasma-nano-6.2.5/debian/plasma-nano/usr/share/locale/ja/LC_MESSAGES
--- Installing: /build/reproducible-path/plasma-nano-6.2.5/debian/plasma-nano/usr/share/locale/ja/LC_MESSAGES/plasma_shell_org.kde.plasma.nano.mo
--- Installing: /build/reproducible-path/plasma-nano-6.2.5/debian/plasma-nano/usr/share/locale/tr
--- Installing: /build/reproducible-path/plasma-nano-6.2.5/debian/plasma-nano/usr/share/locale/tr/LC_MESSAGES
--- Installing: /build/reproducible-path/plasma-nano-6.2.5/debian/plasma-nano/usr/share/locale/tr/LC_MESSAGES/plasma_shell_org.kde.plasma.nano.mo
--- Installing: /build/reproducible-path/plasma-nano-6.2.5/debian/plasma-nano/usr/share/locale/sk
--- Installing: /build/reproducible-path/plasma-nano-6.2.5/debian/plasma-nano/usr/share/locale/sk/LC_MESSAGES
--- Installing: /build/reproducible-path/plasma-nano-6.2.5/debian/plasma-nano/usr/share/locale/sk/LC_MESSAGES/plasma_shell_org.kde.plasma.nano.mo
--- Installing: /build/reproducible-path/plasma-nano-6.2.5/debian/plasma-nano/usr/share/locale/it
--- Installing: /build/reproducible-path/plasma-nano-6.2.5/debian/plasma-nano/usr/share/locale/it/LC_MESSAGES
--- Installing: /build/reproducible-path/plasma-nano-6.2.5/debian/plasma-nano/usr/share/locale/it/LC_MESSAGES/plasma_shell_org.kde.plasma.nano.mo
--- Installing: /build/reproducible-path/plasma-nano-6.2.5/debian/plasma-nano/usr/share/locale/hi
--- Installing: /build/reproducible-path/plasma-nano-6.2.5/debian/plasma-nano/usr/share/locale/hi/LC_MESSAGES
--- Installing: /build/reproducible-path/plasma-nano-6.2.5/debian/plasma-nano/usr/share/locale/hi/LC_MESSAGES/plasma_shell_org.kde.plasma.nano.mo
--- Installing: /build/reproducible-path/plasma-nano-6.2.5/debian/plasma-nano/usr/share/locale/sa
--- Installing: /build/reproducible-path/plasma-nano-6.2.5/debian/plasma-nano/usr/share/locale/sa/LC_MESSAGES
--- Installing: /build/reproducible-path/plasma-nano-6.2.5/debian/plasma-nano/usr/share/locale/sa/LC_MESSAGES/plasma_shell_org.kde.plasma.nano.mo
--- Installing: /build/reproducible-path/plasma-nano-6.2.5/debian/plasma-nano/usr/share/locale/lv
--- Installing: /build/reproducible-path/plasma-nano-6.2.5/debian/plasma-nano/usr/share/locale/lv/LC_MESSAGES
--- Installing: /build/reproducible-path/plasma-nano-6.2.5/debian/plasma-nano/usr/share/locale/lv/LC_MESSAGES/plasma_shell_org.kde.plasma.nano.mo
--- Installing: /build/reproducible-path/plasma-nano-6.2.5/debian/plasma-nano/usr/share/locale/ko
--- Installing: /build/reproducible-path/plasma-nano-6.2.5/debian/plasma-nano/usr/share/locale/ko/LC_MESSAGES
--- Installing: /build/reproducible-path/plasma-nano-6.2.5/debian/plasma-nano/usr/share/locale/ko/LC_MESSAGES/plasma_shell_org.kde.plasma.nano.mo
--- Installing: /build/reproducible-path/plasma-nano-6.2.5/debian/plasma-nano/usr/share/locale/cs
--- Installing: /build/reproducible-path/plasma-nano-6.2.5/debian/plasma-nano/usr/share/locale/cs/LC_MESSAGES
--- Installing: /build/reproducible-path/plasma-nano-6.2.5/debian/plasma-nano/usr/share/locale/cs/LC_MESSAGES/plasma_shell_org.kde.plasma.nano.mo
--- Installing: /build/reproducible-path/plasma-nano-6.2.5/debian/plasma-nano/usr/share/locale/he
--- Installing: /build/reproducible-path/plasma-nano-6.2.5/debian/plasma-nano/usr/share/locale/he/LC_MESSAGES
--- Installing: /build/reproducible-path/plasma-nano-6.2.5/debian/plasma-nano/usr/share/locale/he/LC_MESSAGES/plasma_shell_org.kde.plasma.nano.mo
--- Installing: /build/reproducible-path/plasma-nano-6.2.5/debian/plasma-nano/usr/share/locale/eo
--- Installing: /build/reproducible-path/plasma-nano-6.2.5/debian/plasma-nano/usr/share/locale/eo/LC_MESSAGES
--- Installing: /build/reproducible-path/plasma-nano-6.2.5/debian/plasma-nano/usr/share/locale/eo/LC_MESSAGES/plasma_shell_org.kde.plasma.nano.mo
--- Installing: /build/reproducible-path/plasma-nano-6.2.5/debian/plasma-nano/usr/share/locale/sv
--- Installing: /build/reproducible-path/plasma-nano-6.2.5/debian/plasma-nano/usr/share/locale/sv/LC_MESSAGES
--- Installing: /build/reproducible-path/plasma-nano-6.2.5/debian/plasma-nano/usr/share/locale/sv/LC_MESSAGES/plasma_shell_org.kde.plasma.nano.mo
--- Installing: /build/reproducible-path/plasma-nano-6.2.5/debian/plasma-nano/usr/share/locale/ro
--- Installing: /build/reproducible-path/plasma-nano-6.2.5/debian/plasma-nano/usr/share/locale/ro/LC_MESSAGES
--- Installing: /build/reproducible-path/plasma-nano-6.2.5/debian/plasma-nano/usr/share/locale/ro/LC_MESSAGES/plasma_shell_org.kde.plasma.nano.mo
--- Installing: /build/reproducible-path/plasma-nano-6.2.5/debian/plasma-nano/usr/share/locale/az
--- Installing: /build/reproducible-path/plasma-nano-6.2.5/debian/plasma-nano/usr/share/locale/az/LC_MESSAGES
--- Installing: /build/reproducible-path/plasma-nano-6.2.5/debian/plasma-nano/usr/share/locale/az/LC_MESSAGES/plasma_shell_org.kde.plasma.nano.mo
--- Installing: /build/reproducible-path/plasma-nano-6.2.5/debian/plasma-nano/usr/share/locale/zh_TW
--- Installing: /build/reproducible-path/plasma-nano-6.2.5/debian/plasma-nano/usr/share/locale/zh_TW/LC_MESSAGES
--- Installing: /build/reproducible-path/plasma-nano-6.2.5/debian/plasma-nano/usr/share/locale/zh_TW/LC_MESSAGES/plasma_shell_org.kde.plasma.nano.mo
--- Installing: /build/reproducible-path/plasma-nano-6.2.5/debian/plasma-nano/usr/share/locale/fi
--- Installing: /build/reproducible-path/plasma-nano-6.2.5/debian/plasma-nano/usr/share/locale/fi/LC_MESSAGES
--- Installing: /build/reproducible-path/plasma-nano-6.2.5/debian/plasma-nano/usr/share/locale/fi/LC_MESSAGES/plasma_shell_org.kde.plasma.nano.mo
--- Installing: /build/reproducible-path/plasma-nano-6.2.5/debian/plasma-nano/usr/share/locale/ka
--- Installing: /build/reproducible-path/plasma-nano-6.2.5/debian/plasma-nano/usr/share/locale/ka/LC_MESSAGES
--- Installing: /build/reproducible-path/plasma-nano-6.2.5/debian/plasma-nano/usr/share/locale/ka/LC_MESSAGES/plasma_shell_org.kde.plasma.nano.mo
--- Installing: /build/reproducible-path/plasma-nano-6.2.5/debian/plasma-nano/usr/share/locale/pt
--- Installing: /build/reproducible-path/plasma-nano-6.2.5/debian/plasma-nano/usr/share/locale/pt/LC_MESSAGES
--- Installing: /build/reproducible-path/plasma-nano-6.2.5/debian/plasma-nano/usr/share/locale/pt/LC_MESSAGES/plasma_shell_org.kde.plasma.nano.mo
--- Installing: /build/reproducible-path/plasma-nano-6.2.5/debian/plasma-nano/usr/share/locale/pt_BR
--- Installing: /build/reproducible-path/plasma-nano-6.2.5/debian/plasma-nano/usr/share/locale/pt_BR/LC_MESSAGES
--- Installing: /build/reproducible-path/plasma-nano-6.2.5/debian/plasma-nano/usr/share/locale/pt_BR/LC_MESSAGES/plasma_shell_org.kde.plasma.nano.mo
--- Installing: /build/reproducible-path/plasma-nano-6.2.5/debian/plasma-nano/usr/share/locale/lt
--- Installing: /build/reproducible-path/plasma-nano-6.2.5/debian/plasma-nano/usr/share/locale/lt/LC_MESSAGES
--- Installing: /build/reproducible-path/plasma-nano-6.2.5/debian/plasma-nano/usr/share/locale/lt/LC_MESSAGES/plasma_shell_org.kde.plasma.nano.mo
--- Installing: /build/reproducible-path/plasma-nano-6.2.5/debian/plasma-nano/usr/share/locale/ca
--- Installing: /build/reproducible-path/plasma-nano-6.2.5/debian/plasma-nano/usr/share/locale/ca/LC_MESSAGES
--- Installing: /build/reproducible-path/plasma-nano-6.2.5/debian/plasma-nano/usr/share/locale/ca/LC_MESSAGES/plasma_shell_org.kde.plasma.nano.mo
--- Installing: /build/reproducible-path/plasma-nano-6.2.5/debian/plasma-nano/usr/share/locale/ru
--- Installing: /build/reproducible-path/plasma-nano-6.2.5/debian/plasma-nano/usr/share/locale/ru/LC_MESSAGES
--- Installing: /build/reproducible-path/plasma-nano-6.2.5/debian/plasma-nano/usr/share/locale/ru/LC_MESSAGES/plasma_shell_org.kde.plasma.nano.mo
--- Installing: /build/reproducible-path/plasma-nano-6.2.5/debian/plasma-nano/usr/share/locale/id
--- Installing: /build/reproducible-path/plasma-nano-6.2.5/debian/plasma-nano/usr/share/locale/id/LC_MESSAGES
--- Installing: /build/reproducible-path/plasma-nano-6.2.5/debian/plasma-nano/usr/share/locale/id/LC_MESSAGES/plasma_shell_org.kde.plasma.nano.mo
--- Installing: /build/reproducible-path/plasma-nano-6.2.5/debian/plasma-nano/usr/share/locale/ast
--- Installing: /build/reproducible-path/plasma-nano-6.2.5/debian/plasma-nano/usr/share/locale/ast/LC_MESSAGES
--- Installing: /build/reproducible-path/plasma-nano-6.2.5/debian/plasma-nano/usr/share/locale/ast/LC_MESSAGES/plasma_shell_org.kde.plasma.nano.mo
--- Installing: /build/reproducible-path/plasma-nano-6.2.5/debian/plasma-nano/usr/share/locale/pl
--- Installing: /build/reproducible-path/plasma-nano-6.2.5/debian/plasma-nano/usr/share/locale/pl/LC_MESSAGES
--- Installing: /build/reproducible-path/plasma-nano-6.2.5/debian/plasma-nano/usr/share/locale/pl/LC_MESSAGES/plasma_shell_org.kde.plasma.nano.mo
--- Installing: /build/reproducible-path/plasma-nano-6.2.5/debian/plasma-nano/usr/share/locale/hu
--- Installing: /build/reproducible-path/plasma-nano-6.2.5/debian/plasma-nano/usr/share/locale/hu/LC_MESSAGES
--- Installing: /build/reproducible-path/plasma-nano-6.2.5/debian/plasma-nano/usr/share/locale/hu/LC_MESSAGES/plasma_shell_org.kde.plasma.nano.mo
--- Installing: /build/reproducible-path/plasma-nano-6.2.5/debian/plasma-nano/usr/share/locale/bg
--- Installing: /build/reproducible-path/plasma-nano-6.2.5/debian/plasma-nano/usr/share/locale/bg/LC_MESSAGES
--- Installing: /build/reproducible-path/plasma-nano-6.2.5/debian/plasma-nano/usr/share/locale/bg/LC_MESSAGES/plasma_shell_org.kde.plasma.nano.mo
--- Installing: /build/reproducible-path/plasma-nano-6.2.5/debian/plasma-nano/usr/share/locale/sl
--- Installing: /build/reproducible-path/plasma-nano-6.2.5/debian/plasma-nano/usr/share/locale/sl/LC_MESSAGES
--- Installing: /build/reproducible-path/plasma-nano-6.2.5/debian/plasma-nano/usr/share/locale/sl/LC_MESSAGES/plasma_shell_org.kde.plasma.nano.mo
--- Installing: /build/reproducible-path/plasma-nano-6.2.5/debian/plasma-nano/usr/share/locale/ar
--- Installing: /build/reproducible-path/plasma-nano-6.2.5/debian/plasma-nano/usr/share/locale/ar/LC_MESSAGES
--- Installing: /build/reproducible-path/plasma-nano-6.2.5/debian/plasma-nano/usr/share/locale/ar/LC_MESSAGES/plasma_shell_org.kde.plasma.nano.mo
--- Installing: /build/reproducible-path/plasma-nano-6.2.5/debian/plasma-nano/usr/share/locale/ta
--- Installing: /build/reproducible-path/plasma-nano-6.2.5/debian/plasma-nano/usr/share/locale/ta/LC_MESSAGES
--- Installing: /build/reproducible-path/plasma-nano-6.2.5/debian/plasma-nano/usr/share/locale/ta/LC_MESSAGES/plasma_shell_org.kde.plasma.nano.mo
--- Installing: /build/reproducible-path/plasma-nano-6.2.5/debian/plasma-nano/usr/share/locale/uk
--- Installing: /build/reproducible-path/plasma-nano-6.2.5/debian/plasma-nano/usr/share/locale/uk/LC_MESSAGES
--- Installing: /build/reproducible-path/plasma-nano-6.2.5/debian/plasma-nano/usr/share/locale/uk/LC_MESSAGES/plasma_shell_org.kde.plasma.nano.mo
--- Installing: /build/reproducible-path/plasma-nano-6.2.5/debian/plasma-nano/usr/share/locale/es
--- Installing: /build/reproducible-path/plasma-nano-6.2.5/debian/plasma-nano/usr/share/locale/es/LC_MESSAGES
--- Installing: /build/reproducible-path/plasma-nano-6.2.5/debian/plasma-nano/usr/share/locale/es/LC_MESSAGES/plasma_shell_org.kde.plasma.nano.mo
--- Installing: /build/reproducible-path/plasma-nano-6.2.5/debian/plasma-nano/usr/share/locale/fr
--- Installing: /build/reproducible-path/plasma-nano-6.2.5/debian/plasma-nano/usr/share/locale/fr/LC_MESSAGES
--- Installing: /build/reproducible-path/plasma-nano-6.2.5/debian/plasma-nano/usr/share/locale/fr/LC_MESSAGES/plasma_shell_org.kde.plasma.nano.mo
--- Installing: /build/reproducible-path/plasma-nano-6.2.5/debian/plasma-nano/usr/share/locale/de
--- Installing: /build/reproducible-path/plasma-nano-6.2.5/debian/plasma-nano/usr/share/locale/de/LC_MESSAGES
--- Installing: /build/reproducible-path/plasma-nano-6.2.5/debian/plasma-nano/usr/share/locale/de/LC_MESSAGES/plasma_shell_org.kde.plasma.nano.mo
--- Installing: /build/reproducible-path/plasma-nano-6.2.5/debian/plasma-nano/usr/share/locale/pa
--- Installing: /build/reproducible-path/plasma-nano-6.2.5/debian/plasma-nano/usr/share/locale/pa/LC_MESSAGES
--- Installing: /build/reproducible-path/plasma-nano-6.2.5/debian/plasma-nano/usr/share/locale/pa/LC_MESSAGES/plasma_shell_org.kde.plasma.nano.mo
--- Installing: /build/reproducible-path/plasma-nano-6.2.5/debian/plasma-nano/usr/share/locale/el
--- Installing: /build/reproducible-path/plasma-nano-6.2.5/debian/plasma-nano/usr/share/locale/el/LC_MESSAGES
--- Installing: /build/reproducible-path/plasma-nano-6.2.5/debian/plasma-nano/usr/share/locale/el/LC_MESSAGES/plasma_shell_org.kde.plasma.nano.mo
--- Installing: /build/reproducible-path/plasma-nano-6.2.5/debian/plasma-nano/usr/share/locale/zh_CN
--- Installing: /build/reproducible-path/plasma-nano-6.2.5/debian/plasma-nano/usr/share/locale/zh_CN/LC_MESSAGES
--- Installing: /build/reproducible-path/plasma-nano-6.2.5/debian/plasma-nano/usr/share/locale/zh_CN/LC_MESSAGES/plasma_shell_org.kde.plasma.nano.mo
--- Installing: /build/reproducible-path/plasma-nano-6.2.5/debian/plasma-nano/usr/share/locale/ia
--- Installing: /build/reproducible-path/plasma-nano-6.2.5/debian/plasma-nano/usr/share/locale/ia/LC_MESSAGES
--- Installing: /build/reproducible-path/plasma-nano-6.2.5/debian/plasma-nano/usr/share/locale/ia/LC_MESSAGES/plasma_shell_org.kde.plasma.nano.mo
--- Installing: /build/reproducible-path/plasma-nano-6.2.5/debian/plasma-nano/usr/share/locale/is
--- Installing: /build/reproducible-path/plasma-nano-6.2.5/debian/plasma-nano/usr/share/locale/is/LC_MESSAGES
--- Installing: /build/reproducible-path/plasma-nano-6.2.5/debian/plasma-nano/usr/share/locale/is/LC_MESSAGES/plasma_shell_org.kde.plasma.nano.mo
--- Installing: /build/reproducible-path/plasma-nano-6.2.5/debian/plasma-nano/usr/share/locale/nl
--- Installing: /build/reproducible-path/plasma-nano-6.2.5/debian/plasma-nano/usr/share/locale/nl/LC_MESSAGES
--- Installing: /build/reproducible-path/plasma-nano-6.2.5/debian/plasma-nano/usr/share/locale/nl/LC_MESSAGES/plasma_shell_org.kde.plasma.nano.mo
--- Installing: /build/reproducible-path/plasma-nano-6.2.5/debian/plasma-nano/usr/share/locale/et
--- Installing: /build/reproducible-path/plasma-nano-6.2.5/debian/plasma-nano/usr/share/locale/et/LC_MESSAGES
--- Installing: /build/reproducible-path/plasma-nano-6.2.5/debian/plasma-nano/usr/share/locale/et/LC_MESSAGES/plasma_shell_org.kde.plasma.nano.mo
--- Installing: /build/reproducible-path/plasma-nano-6.2.5/debian/plasma-nano/usr/share/locale/ca@valencia
--- Installing: /build/reproducible-path/plasma-nano-6.2.5/debian/plasma-nano/usr/share/locale/ca@valencia/LC_MESSAGES
--- Installing: /build/reproducible-path/plasma-nano-6.2.5/debian/plasma-nano/usr/share/locale/ca@valencia/LC_MESSAGES/plasma_shell_org.kde.plasma.nano.mo
--- Installing: /build/reproducible-path/plasma-nano-6.2.5/debian/plasma-nano/usr/share/locale/gl
--- Installing: /build/reproducible-path/plasma-nano-6.2.5/debian/plasma-nano/usr/share/locale/gl/LC_MESSAGES
--- Installing: /build/reproducible-path/plasma-nano-6.2.5/debian/plasma-nano/usr/share/locale/gl/LC_MESSAGES/plasma_shell_org.kde.plasma.nano.mo
--- Installing: /build/reproducible-path/plasma-nano-6.2.5/debian/plasma-nano/usr/share/locale/nn
--- Installing: /build/reproducible-path/plasma-nano-6.2.5/debian/plasma-nano/usr/share/locale/nn/LC_MESSAGES
--- Installing: /build/reproducible-path/plasma-nano-6.2.5/debian/plasma-nano/usr/share/locale/nn/LC_MESSAGES/plasma_shell_org.kde.plasma.nano.mo
--- Installing: /build/reproducible-path/plasma-nano-6.2.5/debian/plasma-nano/usr/share/locale/en_GB
--- Installing: /build/reproducible-path/plasma-nano-6.2.5/debian/plasma-nano/usr/share/locale/en_GB/LC_MESSAGES
--- Installing: /build/reproducible-path/plasma-nano-6.2.5/debian/plasma-nano/usr/share/locale/en_GB/LC_MESSAGES/plasma_shell_org.kde.plasma.nano.mo
--- Installing: /build/reproducible-path/plasma-nano-6.2.5/debian/plasma-nano/usr/share/locale/da
--- Installing: /build/reproducible-path/plasma-nano-6.2.5/debian/plasma-nano/usr/share/locale/da/LC_MESSAGES
--- Installing: /build/reproducible-path/plasma-nano-6.2.5/debian/plasma-nano/usr/share/locale/da/LC_MESSAGES/plasma_shell_org.kde.plasma.nano.mo
--- Installing: /build/reproducible-path/plasma-nano-6.2.5/debian/plasma-nano/usr/share/locale/eu
--- Installing: /build/reproducible-path/plasma-nano-6.2.5/debian/plasma-nano/usr/share/locale/eu/LC_MESSAGES
--- Installing: /build/reproducible-path/plasma-nano-6.2.5/debian/plasma-nano/usr/share/locale/eu/LC_MESSAGES/plasma_shell_org.kde.plasma.nano.mo
+make[1]: *** [Makefile:149: all] Error 2
 make[1]: Leaving directory '/build/reproducible-path/plasma-nano-6.2.5/obj-arm-linux-gnueabihf'
-   dh_installdocs
-   dh_installchangelogs
-   dh_perl
-   dh_link
-   dh_strip_nondeterminism
-	Normalized debian/plasma-nano/usr/share/locale/ja/LC_MESSAGES/plasma_shell_org.kde.plasma.nano.mo
-	Normalized debian/plasma-nano/usr/share/locale/tr/LC_MESSAGES/plasma_shell_org.kde.plasma.nano.mo
-	Normalized debian/plasma-nano/usr/share/locale/sk/LC_MESSAGES/plasma_shell_org.kde.plasma.nano.mo
-	Normalized debian/plasma-nano/usr/share/locale/it/LC_MESSAGES/plasma_shell_org.kde.plasma.nano.mo
-	Normalized debian/plasma-nano/usr/share/locale/hi/LC_MESSAGES/plasma_shell_org.kde.plasma.nano.mo
-	Normalized debian/plasma-nano/usr/share/locale/sa/LC_MESSAGES/plasma_shell_org.kde.plasma.nano.mo
-	Normalized debian/plasma-nano/usr/share/locale/lv/LC_MESSAGES/plasma_shell_org.kde.plasma.nano.mo
-	Normalized debian/plasma-nano/usr/share/locale/ko/LC_MESSAGES/plasma_shell_org.kde.plasma.nano.mo
-	Normalized debian/plasma-nano/usr/share/locale/cs/LC_MESSAGES/plasma_shell_org.kde.plasma.nano.mo
-	Normalized debian/plasma-nano/usr/share/locale/he/LC_MESSAGES/plasma_shell_org.kde.plasma.nano.mo
-	Normalized debian/plasma-nano/usr/share/locale/eo/LC_MESSAGES/plasma_shell_org.kde.plasma.nano.mo
-	Normalized debian/plasma-nano/usr/share/locale/sv/LC_MESSAGES/plasma_shell_org.kde.plasma.nano.mo
-	Normalized debian/plasma-nano/usr/share/locale/ro/LC_MESSAGES/plasma_shell_org.kde.plasma.nano.mo
-	Normalized debian/plasma-nano/usr/share/locale/az/LC_MESSAGES/plasma_shell_org.kde.plasma.nano.mo
-	Normalized debian/plasma-nano/usr/share/locale/zh_TW/LC_MESSAGES/plasma_shell_org.kde.plasma.nano.mo
-	Normalized debian/plasma-nano/usr/share/locale/fi/LC_MESSAGES/plasma_shell_org.kde.plasma.nano.mo
-	Normalized debian/plasma-nano/usr/share/locale/ka/LC_MESSAGES/plasma_shell_org.kde.plasma.nano.mo
-	Normalized debian/plasma-nano/usr/share/locale/pt/LC_MESSAGES/plasma_shell_org.kde.plasma.nano.mo
-	Normalized debian/plasma-nano/usr/share/locale/pt_BR/LC_MESSAGES/plasma_shell_org.kde.plasma.nano.mo
-	Normalized debian/plasma-nano/usr/share/locale/lt/LC_MESSAGES/plasma_shell_org.kde.plasma.nano.mo
-	Normalized debian/plasma-nano/usr/share/locale/ca/LC_MESSAGES/plasma_shell_org.kde.plasma.nano.mo
-	Normalized debian/plasma-nano/usr/share/locale/ru/LC_MESSAGES/plasma_shell_org.kde.plasma.nano.mo
-	Normalized debian/plasma-nano/usr/share/locale/id/LC_MESSAGES/plasma_shell_org.kde.plasma.nano.mo
-	Normalized debian/plasma-nano/usr/share/locale/ast/LC_MESSAGES/plasma_shell_org.kde.plasma.nano.mo
-	Normalized debian/plasma-nano/usr/share/locale/pl/LC_MESSAGES/plasma_shell_org.kde.plasma.nano.mo
-	Normalized debian/plasma-nano/usr/share/locale/hu/LC_MESSAGES/plasma_shell_org.kde.plasma.nano.mo
-	Normalized debian/plasma-nano/usr/share/locale/bg/LC_MESSAGES/plasma_shell_org.kde.plasma.nano.mo
-	Normalized debian/plasma-nano/usr/share/locale/sl/LC_MESSAGES/plasma_shell_org.kde.plasma.nano.mo
-	Normalized debian/plasma-nano/usr/share/locale/ar/LC_MESSAGES/plasma_shell_org.kde.plasma.nano.mo
-	Normalized debian/plasma-nano/usr/share/locale/ta/LC_MESSAGES/plasma_shell_org.kde.plasma.nano.mo
-	Normalized debian/plasma-nano/usr/share/locale/uk/LC_MESSAGES/plasma_shell_org.kde.plasma.nano.mo
-	Normalized debian/plasma-nano/usr/share/locale/es/LC_MESSAGES/plasma_shell_org.kde.plasma.nano.mo
-	Normalized debian/plasma-nano/usr/share/locale/fr/LC_MESSAGES/plasma_shell_org.kde.plasma.nano.mo
-	Normalized debian/plasma-nano/usr/share/locale/de/LC_MESSAGES/plasma_shell_org.kde.plasma.nano.mo
-	Normalized debian/plasma-nano/usr/share/locale/pa/LC_MESSAGES/plasma_shell_org.kde.plasma.nano.mo
-	Normalized debian/plasma-nano/usr/share/locale/el/LC_MESSAGES/plasma_shell_org.kde.plasma.nano.mo
-	Normalized debian/plasma-nano/usr/share/locale/zh_CN/LC_MESSAGES/plasma_shell_org.kde.plasma.nano.mo
-	Normalized debian/plasma-nano/usr/share/locale/ia/LC_MESSAGES/plasma_shell_org.kde.plasma.nano.mo
-	Normalized debian/plasma-nano/usr/share/locale/is/LC_MESSAGES/plasma_shell_org.kde.plasma.nano.mo
-	Normalized debian/plasma-nano/usr/share/locale/nl/LC_MESSAGES/plasma_shell_org.kde.plasma.nano.mo
-	Normalized debian/plasma-nano/usr/share/locale/et/LC_MESSAGES/plasma_shell_org.kde.plasma.nano.mo
-	Normalized debian/plasma-nano/usr/share/locale/ca@valencia/LC_MESSAGES/plasma_shell_org.kde.plasma.nano.mo
-	Normalized debian/plasma-nano/usr/share/locale/gl/LC_MESSAGES/plasma_shell_org.kde.plasma.nano.mo
-	Normalized debian/plasma-nano/usr/share/locale/nn/LC_MESSAGES/plasma_shell_org.kde.plasma.nano.mo
-	Normalized debian/plasma-nano/usr/share/locale/en_GB/LC_MESSAGES/plasma_shell_org.kde.plasma.nano.mo
-	Normalized debian/plasma-nano/usr/share/locale/da/LC_MESSAGES/plasma_shell_org.kde.plasma.nano.mo
-	Normalized debian/plasma-nano/usr/share/locale/eu/LC_MESSAGES/plasma_shell_org.kde.plasma.nano.mo
-   dh_compress -X.dcl -X.docbook -X-license -X.tag -X.sty -X.el
-   dh_fixperms
-   dh_missing
-   dh_dwz -a
-   dh_strip -a
-   dh_makeshlibs -a
-   dh_shlibdeps -a
-dpkg-shlibdeps: warning: diversions involved - output may be incorrect
- diversion by libc6 from: /lib/ld-linux-armhf.so.3
-dpkg-shlibdeps: warning: diversions involved - output may be incorrect
- diversion by libc6 to: /lib/ld-linux-armhf.so.3.usr-is-merged
-dpkg-shlibdeps: warning: debian/plasma-nano/usr/lib/arm-linux-gnueabihf/qt6/qml/org/kde/plasma/private/nanoshell/libplasmananoshellprivateplugin.so contains an unresolvable reference to symbol __aeabi_atexit@CXXABI_ARM_1.3.3: it's probably a plugin
-   dh_installdeb
-   dh_gencontrol
-   dh_md5sums
-   dh_builddeb
-dpkg-deb: building package 'plasma-nano' in '../plasma-nano_6.2.5-1_armhf.deb'.
-dpkg-deb: building package 'plasma-nano-dbgsym' in '../plasma-nano-dbgsym_6.2.5-1_armhf.deb'.
- dpkg-genbuildinfo --build=binary -O../plasma-nano_6.2.5-1_armhf.buildinfo
- dpkg-genchanges --build=binary -O../plasma-nano_6.2.5-1_armhf.changes
-dpkg-genchanges: info: binary-only upload (no source code included)
- dpkg-source --after-build .
-dpkg-buildpackage: info: binary-only upload (no source included)
-dpkg-genchanges: info: including full source code in upload
+dh_auto_build: error: cd obj-arm-linux-gnueabihf && make -j4 "INSTALL=install --strip-program=true" VERBOSE=1 returned exit code 2
+make: *** [debian/rules:6: binary] Error 25
+dpkg-buildpackage: error: debian/rules binary subprocess returned exit status 2
 I: copying local configuration
+E: Failed autobuilding of package
+I: user script /srv/workspace/pbuilder/29870/tmp/hooks/C01_cleanup starting
+debug output: disk usage on i-capture-the-hostname at Sun Jan 12 10:04:49 UTC 2025
+Filesystem      Size  Used Avail Use% Mounted on
+tmpfs           3.4G     0  3.4G   0% /dev/shm
+
+I: user script /srv/workspace/pbuilder/29870/tmp/hooks/C01_cleanup finished
 I: unmounting dev/ptmx filesystem
 I: unmounting dev/pts filesystem
 I: unmounting dev/shm filesystem
 I: unmounting proc filesystem
 I: unmounting sys filesystem
 I: cleaning the build env 
-I: removing directory /srv/workspace/pbuilder/14988 and its subdirectories
-I: Current time: Sat Jan 11 21:59:54 -12 2025
-I: pbuilder-time-stamp: 1736675994
+I: removing directory /srv/workspace/pbuilder/29870 and its subdirectories