Diff of the two buildlogs:

--
--- b1/build.log	2025-01-31 15:04:11.281094297 +0000
+++ b2/build.log	2025-01-31 15:09:03.531905574 +0000
@@ -1,6 +1,6 @@
 I: pbuilder: network access will be disabled during build
-I: Current time: Fri Jan 31 02:59:01 -12 2025
-I: pbuilder-time-stamp: 1738335541
+I: Current time: Sat Feb  1 05:04:20 +14 2025
+I: pbuilder-time-stamp: 1738335860
 I: Building the build Environment
 I: extracting base tarball [/var/cache/pbuilder/trixie-reproducible-base.tgz]
 I: copying local configuration
@@ -24,52 +24,84 @@
 dpkg-source: info: applying 01-compile-on-java8-proxy.patch
 I: using fakeroot in build.
 I: Installing the build-deps
-I: user script /srv/workspace/pbuilder/22616/tmp/hooks/D02_print_environment starting
+I: user script /srv/workspace/pbuilder/18640/tmp/hooks/D01_modify_environment starting
+debug: Running on virt64c.
+I: Changing host+domainname to test build reproducibility
+I: Adding a custom variable just for the fun of it...
+I: Changing /bin/sh to bash
+'/bin/sh' -> '/bin/bash'
+lrwxrwxrwx 1 root root 9 Jan 31 15:04 /bin/sh -> /bin/bash
+I: Setting pbuilder2's login shell to /bin/bash
+I: Setting pbuilder2's GECOS to second user,second room,second work-phone,second home-phone,second other
+I: user script /srv/workspace/pbuilder/18640/tmp/hooks/D01_modify_environment finished
+I: user script /srv/workspace/pbuilder/18640/tmp/hooks/D02_print_environment starting
 I: set
-  BUILDDIR='/build/reproducible-path'
-  BUILDUSERGECOS='first user,first room,first work-phone,first home-phone,first other'
-  BUILDUSERNAME='pbuilder1'
-  BUILD_ARCH='armhf'
-  DEBIAN_FRONTEND='noninteractive'
-  DEB_BUILD_OPTIONS='buildinfo=+all reproducible=+all parallel=3 '
-  DISTRIBUTION='trixie'
-  HOME='/root'
-  HOST_ARCH='armhf'
+  BASH=/bin/sh
+  BASHOPTS=checkwinsize:cmdhist:complete_fullquote:extquote:force_fignore:globasciiranges:globskipdots:hostcomplete:interactive_comments:patsub_replacement:progcomp:promptvars:sourcepath
+  BASH_ALIASES=()
+  BASH_ARGC=()
+  BASH_ARGV=()
+  BASH_CMDS=()
+  BASH_LINENO=([0]="12" [1]="0")
+  BASH_LOADABLES_PATH=/usr/local/lib/bash:/usr/lib/bash:/opt/local/lib/bash:/usr/pkg/lib/bash:/opt/pkg/lib/bash:.
+  BASH_SOURCE=([0]="/tmp/hooks/D02_print_environment" [1]="/tmp/hooks/D02_print_environment")
+  BASH_VERSINFO=([0]="5" [1]="2" [2]="37" [3]="1" [4]="release" [5]="arm-unknown-linux-gnueabihf")
+  BASH_VERSION='5.2.37(1)-release'
+  BUILDDIR=/build/reproducible-path
+  BUILDUSERGECOS='second user,second room,second work-phone,second home-phone,second other'
+  BUILDUSERNAME=pbuilder2
+  BUILD_ARCH=armhf
+  DEBIAN_FRONTEND=noninteractive
+  DEB_BUILD_OPTIONS='buildinfo=+all reproducible=+all parallel=4 '
+  DIRSTACK=()
+  DISTRIBUTION=trixie
+  EUID=0
+  FUNCNAME=([0]="Echo" [1]="main")
+  GROUPS=()
+  HOME=/root
+  HOSTNAME=i-capture-the-hostname
+  HOSTTYPE=arm
+  HOST_ARCH=armhf
   IFS=' 	
   '
-  INVOCATION_ID='a4ecdcb9626e4edcbb6e261f4578ae05'
-  LANG='C'
-  LANGUAGE='en_US:en'
-  LC_ALL='C'
-  MAIL='/var/mail/root'
-  OPTIND='1'
-  PATH='/usr/sbin:/usr/bin:/sbin:/bin:/usr/games'
-  PBCURRENTCOMMANDLINEOPERATION='build'
-  PBUILDER_OPERATION='build'
-  PBUILDER_PKGDATADIR='/usr/share/pbuilder'
-  PBUILDER_PKGLIBDIR='/usr/lib/pbuilder'
-  PBUILDER_SYSCONFDIR='/etc'
-  PPID='22616'
-  PS1='# '
-  PS2='> '
+  INVOCATION_ID=acbc44b317a34fd9bd5fac0d12aa96f0
+  LANG=C
+  LANGUAGE=it_CH:it
+  LC_ALL=C
+  MACHTYPE=arm-unknown-linux-gnueabihf
+  MAIL=/var/mail/root
+  OPTERR=1
+  OPTIND=1
+  OSTYPE=linux-gnueabihf
+  PATH=/usr/sbin:/usr/bin:/sbin:/bin:/usr/games:/i/capture/the/path
+  PBCURRENTCOMMANDLINEOPERATION=build
+  PBUILDER_OPERATION=build
+  PBUILDER_PKGDATADIR=/usr/share/pbuilder
+  PBUILDER_PKGLIBDIR=/usr/lib/pbuilder
+  PBUILDER_SYSCONFDIR=/etc
+  PIPESTATUS=([0]="0")
+  POSIXLY_CORRECT=y
+  PPID=18640
   PS4='+ '
-  PWD='/'
-  SHELL='/bin/bash'
-  SHLVL='2'
-  SUDO_COMMAND='/usr/bin/timeout -k 18.1h 18h /usr/bin/ionice -c 3 /usr/bin/nice /usr/sbin/pbuilder --build --configfile /srv/reproducible-results/rbuild-debian/r-b-build.j4ysXjxa/pbuilderrc_xKYO --distribution trixie --hookdir /etc/pbuilder/first-build-hooks --debbuildopts -b --basetgz /var/cache/pbuilder/trixie-reproducible-base.tgz --buildresult /srv/reproducible-results/rbuild-debian/r-b-build.j4ysXjxa/b1 --logfile b1/build.log libjtype-java_0.1.3-5.dsc'
-  SUDO_GID='113'
-  SUDO_UID='107'
-  SUDO_USER='jenkins'
-  TERM='unknown'
-  TZ='/usr/share/zoneinfo/Etc/GMT+12'
-  USER='root'
-  _='/usr/bin/systemd-run'
-  http_proxy='http://10.0.0.15:3142/'
+  PWD=/
+  SHELL=/bin/bash
+  SHELLOPTS=braceexpand:errexit:hashall:interactive-comments:posix
+  SHLVL=3
+  SUDO_COMMAND='/usr/bin/timeout -k 24.1h 24h /usr/bin/ionice -c 3 /usr/bin/nice -n 11 /usr/bin/unshare --uts -- /usr/sbin/pbuilder --build --configfile /srv/reproducible-results/rbuild-debian/r-b-build.j4ysXjxa/pbuilderrc_ncCG --distribution trixie --hookdir /etc/pbuilder/rebuild-hooks --debbuildopts -b --basetgz /var/cache/pbuilder/trixie-reproducible-base.tgz --buildresult /srv/reproducible-results/rbuild-debian/r-b-build.j4ysXjxa/b2 --logfile b2/build.log libjtype-java_0.1.3-5.dsc'
+  SUDO_GID=113
+  SUDO_UID=107
+  SUDO_USER=jenkins
+  TERM=unknown
+  TZ=/usr/share/zoneinfo/Etc/GMT-14
+  UID=0
+  USER=root
+  _='I: set'
+  http_proxy=http://10.0.0.15:3142/
 I: uname -a
-  Linux virt32a 6.1.0-30-armmp-lpae #1 SMP Debian 6.1.124-1 (2025-01-12) armv7l GNU/Linux
+  Linux i-capture-the-hostname 6.1.0-30-arm64 #1 SMP Debian 6.1.124-1 (2025-01-12) aarch64 GNU/Linux
 I: ls -l /bin
   lrwxrwxrwx 1 root root 7 Nov 22 14:40 /bin -> usr/bin
-I: user script /srv/workspace/pbuilder/22616/tmp/hooks/D02_print_environment finished
+I: user script /srv/workspace/pbuilder/18640/tmp/hooks/D02_print_environment finished
  -> Attempting to satisfy build-dependencies
  -> Creating pbuilder-satisfydepends-dummy package
 Package: pbuilder-satisfydepends-dummy
@@ -358,7 +390,7 @@
 Get: 239 http://deb.debian.org/debian trixie/main armhf maven-repo-helper all 1.11 [142 kB]
 Get: 240 http://deb.debian.org/debian trixie/main armhf unzip armhf 6.0-28 [152 kB]
 Get: 241 http://deb.debian.org/debian trixie/main armhf maven-debian-helper all 2.6.7 [108 kB]
-Fetched 189 MB in 6s (32.4 MB/s)
+Fetched 189 MB in 4s (43.2 MB/s)
 Preconfiguring packages ...
 Selecting previously unselected package libpipeline1:armhf.
 (Reading database ... 
(Reading database ... 5%
(Reading database ... 10%
(Reading database ... 15%
(Reading database ... 20%
(Reading database ... 25%
(Reading database ... 30%
(Reading database ... 35%
(Reading database ... 40%
(Reading database ... 45%
(Reading database ... 50%
(Reading database ... 55%
(Reading database ... 60%
(Reading database ... 65%
(Reading database ... 70%
(Reading database ... 75%
(Reading database ... 80%
(Reading database ... 85%
(Reading database ... 90%
(Reading database ... 95%
(Reading database ... 100%
(Reading database ... 19575 files and directories currently installed.)
@@ -1145,8 +1177,8 @@
 Setting up tzdata (2024b-6) ...
 
 Current default time zone: 'Etc/UTC'
-Local time is now:      Fri Jan 31 15:01:48 UTC 2025.
-Universal Time is now:  Fri Jan 31 15:01:48 UTC 2025.
+Local time is now:      Fri Jan 31 15:05:57 UTC 2025.
+Universal Time is now:  Fri Jan 31 15:05:57 UTC 2025.
 Run 'dpkg-reconfigure tzdata' if you wish to change it.
 
 Setting up libgeronimo-annotation-1.3-spec-java (1.3-1) ...
@@ -1552,7 +1584,11 @@
 fakeroot is already the newest version (1.37-1).
 0 upgraded, 0 newly installed, 0 to remove and 0 not upgraded.
 I: Building the package
-I: Running cd /build/reproducible-path/libjtype-java-0.1.3/ && env PATH="/usr/sbin:/usr/bin:/sbin:/bin:/usr/games" HOME="/nonexistent/first-build" dpkg-buildpackage -us -uc -b && env PATH="/usr/sbin:/usr/bin:/sbin:/bin:/usr/games" HOME="/nonexistent/first-build" dpkg-genchanges -S  > ../libjtype-java_0.1.3-5_source.changes
+I: user script /srv/workspace/pbuilder/18640/tmp/hooks/A99_set_merged_usr starting
+Not re-configuring usrmerge for trixie
+I: user script /srv/workspace/pbuilder/18640/tmp/hooks/A99_set_merged_usr finished
+hostname: Name or service not known
+I: Running cd /build/reproducible-path/libjtype-java-0.1.3/ && env PATH="/usr/sbin:/usr/bin:/sbin:/bin:/usr/games:/i/capture/the/path" HOME="/nonexistent/second-build" dpkg-buildpackage -us -uc -b && env PATH="/usr/sbin:/usr/bin:/sbin:/bin:/usr/games:/i/capture/the/path" HOME="/nonexistent/second-build" dpkg-genchanges -S  > ../libjtype-java_0.1.3-5_source.changes
 dpkg-buildpackage: info: source package libjtype-java
 dpkg-buildpackage: info: source version 0.1.3-5
 dpkg-buildpackage: info: source distribution unstable
@@ -1565,7 +1601,7 @@
 	bash -c "for dir in \$(find . -name target -type d); do if [ -f \$(echo \$dir | sed -e s/target\$/pom.xml/) ]; then rm -Rf \$dir; fi done"
 	mh_unpatchpoms -plibjtype-java
    jh_clean
-Duplicate specification "unlink|u" for option "u"
+Duplicate specification "u=s" for option "u"
    dh_clean
  debian/rules build
 dh build --with javahelper
@@ -1634,8 +1670,8 @@
 [INFO] ------------------------------------------------------------------------
 [INFO] BUILD SUCCESS
 [INFO] ------------------------------------------------------------------------
-[INFO] Total time:  16.009 s
-[INFO] Finished at: 2025-01-31T03:02:56-12:00
+[INFO] Total time:  27.441 s
+[INFO] Finished at: 2025-02-01T05:07:30+14:00
 [INFO] ------------------------------------------------------------------------
    dh_auto_test
 	/usr/lib/jvm/default-java/bin/java -noverify -cp /usr/share/maven/boot/plexus-classworlds-2.x.jar -Dmaven.home=/usr/share/maven -Dmaven.multiModuleProjectDirectory=/build/reproducible-path/libjtype-java-0.1.3 -Dclassworlds.conf=/etc/maven/m2-debian.conf -Dproperties.file.manual=/build/reproducible-path/libjtype-java-0.1.3/debian/maven.properties org.codehaus.plexus.classworlds.launcher.Launcher -s/etc/maven/settings-debian.xml -Ddebian.dir=/build/reproducible-path/libjtype-java-0.1.3/debian -Dmaven.repo.local=/build/reproducible-path/libjtype-java-0.1.3/debian/maven-repo --batch-mode test
@@ -1668,22 +1704,22 @@
 [INFO]  T E S T S
 [INFO] -------------------------------------------------------
 [INFO] Running com.googlecode.jtype.GenericTest
-[INFO] Tests run: 39, Failures: 0, Errors: 0, Skipped: 0, Time elapsed: 0.417 s - in com.googlecode.jtype.GenericTest
-[INFO] Running com.googlecode.jtype.DefaultTypeVariableTest
-[INFO] Tests run: 28, Failures: 0, Errors: 0, Skipped: 0, Time elapsed: 0.021 s - in com.googlecode.jtype.DefaultTypeVariableTest
+[INFO] Tests run: 39, Failures: 0, Errors: 0, Skipped: 0, Time elapsed: 0.474 s - in com.googlecode.jtype.GenericTest
+[INFO] Running com.googlecode.jtype.TypeUtilsTest
+[ERROR] Tests run: 202, Failures: 1, Errors: 0, Skipped: 4, Time elapsed: 0.736 s <<< FAILURE! - in com.googlecode.jtype.TypeUtilsTest
+[ERROR] getResolvedInterfacesWithClass(com.googlecode.jtype.TypeUtilsTest)  Time elapsed: 0.022 s  <<< FAILURE!
+org.junit.internal.ArrayComparisonFailure: array lengths differed, expected.length=1 actual.length=3; arrays first differed at element [1]; expected:<end of array> but was:<interface java.lang.constant.Constable>
+	at com.googlecode.jtype.TypeUtilsTest.getResolvedInterfacesWithClass(TypeUtilsTest.java:1434)
+Caused by: java.lang.AssertionError: expected:<end of array> but was:<interface java.lang.constant.Constable>
+	at com.googlecode.jtype.TypeUtilsTest.getResolvedInterfacesWithClass(TypeUtilsTest.java:1434)
+
+[INFO] Running com.googlecode.jtype.GenericsTest
+[INFO] Tests run: 26, Failures: 0, Errors: 0, Skipped: 0, Time elapsed: 0.016 s - in com.googlecode.jtype.GenericsTest
 [INFO] Running com.googlecode.jtype.DefaultGenericArrayTypeTest
-[INFO] Tests run: 8, Failures: 0, Errors: 0, Skipped: 0, Time elapsed: 0.004 s - in com.googlecode.jtype.DefaultGenericArrayTypeTest
-[INFO] Running com.googlecode.jtype.DefaultWildcardTypeTest
-[INFO] Tests run: 16, Failures: 0, Errors: 0, Skipped: 0, Time elapsed: 0.019 s - in com.googlecode.jtype.DefaultWildcardTypeTest
-[INFO] Running com.googlecode.jtype.ClassUtilsTest
-[INFO] Tests run: 18, Failures: 0, Errors: 0, Skipped: 0, Time elapsed: 0.007 s - in com.googlecode.jtype.ClassUtilsTest
-[INFO] Running com.googlecode.jtype.TypeUtilsGetResolvedSupertypeTest
-[INFO] Tests run: 5, Failures: 0, Errors: 0, Skipped: 0, Time elapsed: 0.002 s - in com.googlecode.jtype.TypeUtilsGetResolvedSupertypeTest
-[INFO] Running com.googlecode.jtype.DefaultParameterizedTypeTest
-[INFO] Tests run: 17, Failures: 0, Errors: 0, Skipped: 0, Time elapsed: 0.004 s - in com.googlecode.jtype.DefaultParameterizedTypeTest
+[INFO] Tests run: 8, Failures: 0, Errors: 0, Skipped: 0, Time elapsed: 0.003 s - in com.googlecode.jtype.DefaultGenericArrayTypeTest
 [INFO] Running com.googlecode.jtype.TypesTest
-[ERROR] Tests run: 56, Failures: 0, Errors: 55, Skipped: 1, Time elapsed: 0.196 s <<< FAILURE! - in com.googlecode.jtype.TypesTest
-[ERROR] valueOfWithClassAndImportContext(com.googlecode.jtype.TypesTest)  Time elapsed: 0.022 s  <<< ERROR!
+[ERROR] Tests run: 56, Failures: 0, Errors: 55, Skipped: 1, Time elapsed: 0.051 s <<< FAILURE! - in com.googlecode.jtype.TypesTest
+[ERROR] valueOfWithClassAndImportContext(com.googlecode.jtype.TypesTest)  Time elapsed: 0 s  <<< ERROR!
 java.lang.IllegalStateException: Mockery named 'context' is null
 
 [ERROR] valueOfWithUnboundedWildcardTypeAndWhitespace(com.googlecode.jtype.TypesTest)  Time elapsed: 0 s  <<< ERROR!
@@ -1695,7 +1731,7 @@
 [ERROR] valueOfWithMultipleArgumentParameterizedTypeAndWhitespace(com.googlecode.jtype.TypesTest)  Time elapsed: 0 s  <<< ERROR!
 java.lang.IllegalStateException: Mockery named 'context' is null
 
-[ERROR] valueOfWithSingleArgumentParameterizedType(com.googlecode.jtype.TypesTest)  Time elapsed: 0.003 s  <<< ERROR!
+[ERROR] valueOfWithSingleArgumentParameterizedType(com.googlecode.jtype.TypesTest)  Time elapsed: 0 s  <<< ERROR!
 java.lang.IllegalStateException: Mockery named 'context' is null
 
 [ERROR] valueOfWithParameterizedTypeAndImportContext(com.googlecode.jtype.TypesTest)  Time elapsed: 0 s  <<< ERROR!
@@ -1704,13 +1740,13 @@
 [ERROR] parameterizedTypeWithMismatchedActualTypeArguments(com.googlecode.jtype.TypesTest)  Time elapsed: 0 s  <<< ERROR!
 java.lang.IllegalStateException: Mockery named 'context' is null
 
-[ERROR] valueOfWithMultipleUnboundedWildcardParameterizedType(com.googlecode.jtype.TypesTest)  Time elapsed: 0.003 s  <<< ERROR!
+[ERROR] valueOfWithMultipleUnboundedWildcardParameterizedType(com.googlecode.jtype.TypesTest)  Time elapsed: 0 s  <<< ERROR!
 java.lang.IllegalStateException: Mockery named 'context' is null
 
 [ERROR] upperBoundedWildcardType(com.googlecode.jtype.TypesTest)  Time elapsed: 0 s  <<< ERROR!
 java.lang.IllegalStateException: Mockery named 'context' is null
 
-[ERROR] valueOfWithShortPrimitive(com.googlecode.jtype.TypesTest)  Time elapsed: 0.001 s  <<< ERROR!
+[ERROR] valueOfWithShortPrimitive(com.googlecode.jtype.TypesTest)  Time elapsed: 0 s  <<< ERROR!
 java.lang.IllegalStateException: Mockery named 'context' is null
 
 [ERROR] valueOfWithClassAndCustomClassLoader(com.googlecode.jtype.TypesTest)  Time elapsed: 0 s  <<< ERROR!
@@ -1728,28 +1764,28 @@
 [ERROR] valueOfWithArrayAndWhitespace(com.googlecode.jtype.TypesTest)  Time elapsed: 0 s  <<< ERROR!
 java.lang.IllegalStateException: Mockery named 'context' is null
 
-[ERROR] unboundedParameterizedType(com.googlecode.jtype.TypesTest)  Time elapsed: 0.007 s  <<< ERROR!
+[ERROR] unboundedParameterizedType(com.googlecode.jtype.TypesTest)  Time elapsed: 0.001 s  <<< ERROR!
 java.lang.IllegalStateException: Mockery named 'context' is null
 
 [ERROR] valueOfWithClassAndNullImportContext(com.googlecode.jtype.TypesTest)  Time elapsed: 0 s  <<< ERROR!
 java.lang.IllegalStateException: Mockery named 'context' is null
 
-[ERROR] valueOfWithLowerBoundedWildcardTypeAndWhitespace(com.googlecode.jtype.TypesTest)  Time elapsed: 0.001 s  <<< ERROR!
+[ERROR] valueOfWithLowerBoundedWildcardTypeAndWhitespace(com.googlecode.jtype.TypesTest)  Time elapsed: 0 s  <<< ERROR!
 java.lang.IllegalStateException: Mockery named 'context' is null
 
 [ERROR] parameterizedTypeWithNullRawType(com.googlecode.jtype.TypesTest)  Time elapsed: 0 s  <<< ERROR!
 java.lang.IllegalStateException: Mockery named 'context' is null
 
-[ERROR] valueOfWithUpperBoundedWildcardType(com.googlecode.jtype.TypesTest)  Time elapsed: 0 s  <<< ERROR!
+[ERROR] valueOfWithUpperBoundedWildcardType(com.googlecode.jtype.TypesTest)  Time elapsed: 0.001 s  <<< ERROR!
 java.lang.IllegalStateException: Mockery named 'context' is null
 
-[ERROR] valueOfWithNullTypeName(com.googlecode.jtype.TypesTest)  Time elapsed: 0 s  <<< ERROR!
+[ERROR] valueOfWithNullTypeName(com.googlecode.jtype.TypesTest)  Time elapsed: 0.006 s  <<< ERROR!
 java.lang.IllegalStateException: Mockery named 'context' is null
 
 [ERROR] valueOfWithBooleanPrimitive(com.googlecode.jtype.TypesTest)  Time elapsed: 0.001 s  <<< ERROR!
 java.lang.IllegalStateException: Mockery named 'context' is null
 
-[ERROR] valueOfWithMismatchedArgumentParameterizedType(com.googlecode.jtype.TypesTest)  Time elapsed: 0.01 s  <<< ERROR!
+[ERROR] valueOfWithMismatchedArgumentParameterizedType(com.googlecode.jtype.TypesTest)  Time elapsed: 0 s  <<< ERROR!
 java.lang.IllegalStateException: Mockery named 'context' is null
 
 [ERROR] valueOfWithIntPrimitive(com.googlecode.jtype.TypesTest)  Time elapsed: 0 s  <<< ERROR!
@@ -1758,28 +1794,28 @@
 [ERROR] lowerBoundedWildcardTypeWithNullLowerBound(com.googlecode.jtype.TypesTest)  Time elapsed: 0 s  <<< ERROR!
 java.lang.IllegalStateException: Mockery named 'context' is null
 
-[ERROR] valueOfWithMemberClassAndMemberImportContext(com.googlecode.jtype.TypesTest)  Time elapsed: 0 s  <<< ERROR!
+[ERROR] valueOfWithMemberClassAndMemberImportContext(com.googlecode.jtype.TypesTest)  Time elapsed: 0.001 s  <<< ERROR!
 java.lang.IllegalStateException: Mockery named 'context' is null
 
-[ERROR] typeVariableWithBounds(com.googlecode.jtype.TypesTest)  Time elapsed: 0 s  <<< ERROR!
+[ERROR] typeVariableWithBounds(com.googlecode.jtype.TypesTest)  Time elapsed: 0.001 s  <<< ERROR!
 java.lang.IllegalStateException: Mockery named 'context' is null
 
-[ERROR] valueOfWithMultipleArgumentParameterizedTypeAndNoWhitespace(com.googlecode.jtype.TypesTest)  Time elapsed: 0.014 s  <<< ERROR!
+[ERROR] valueOfWithMultipleArgumentParameterizedTypeAndNoWhitespace(com.googlecode.jtype.TypesTest)  Time elapsed: 0.001 s  <<< ERROR!
 java.lang.IllegalStateException: Mockery named 'context' is null
 
 [ERROR] valueOfWithGenericArrayType(com.googlecode.jtype.TypesTest)  Time elapsed: 0.001 s  <<< ERROR!
 java.lang.IllegalStateException: Mockery named 'context' is null
 
-[ERROR] valueOfWithMultipleArgumentParameterizedType(com.googlecode.jtype.TypesTest)  Time elapsed: 0 s  <<< ERROR!
+[ERROR] valueOfWithMultipleArgumentParameterizedType(com.googlecode.jtype.TypesTest)  Time elapsed: 0.001 s  <<< ERROR!
 java.lang.IllegalStateException: Mockery named 'context' is null
 
-[ERROR] valueOfWithFloatPrimitive(com.googlecode.jtype.TypesTest)  Time elapsed: 0.003 s  <<< ERROR!
+[ERROR] valueOfWithFloatPrimitive(com.googlecode.jtype.TypesTest)  Time elapsed: 0.002 s  <<< ERROR!
 java.lang.IllegalStateException: Mockery named 'context' is null
 
 [ERROR] unboundedParameterizedTypeWithNullRawType(com.googlecode.jtype.TypesTest)  Time elapsed: 0 s  <<< ERROR!
 java.lang.IllegalStateException: Mockery named 'context' is null
 
-[ERROR] unboundedWildcardType(com.googlecode.jtype.TypesTest)  Time elapsed: 0.003 s  <<< ERROR!
+[ERROR] unboundedWildcardType(com.googlecode.jtype.TypesTest)  Time elapsed: 0 s  <<< ERROR!
 java.lang.IllegalStateException: Mockery named 'context' is null
 
 [ERROR] valueOfWithWilcardTypeAndImportContext(com.googlecode.jtype.TypesTest)  Time elapsed: 0 s  <<< ERROR!
@@ -1788,76 +1824,76 @@
 [ERROR] parameterizedTypeWithUnparameterizedRawType(com.googlecode.jtype.TypesTest)  Time elapsed: 0 s  <<< ERROR!
 java.lang.IllegalStateException: Mockery named 'context' is null
 
-[ERROR] valueOfWithDoublePrimitive(com.googlecode.jtype.TypesTest)  Time elapsed: 0 s  <<< ERROR!
+[ERROR] valueOfWithDoublePrimitive(com.googlecode.jtype.TypesTest)  Time elapsed: 0.001 s  <<< ERROR!
 java.lang.IllegalStateException: Mockery named 'context' is null
 
-[ERROR] valueOfWithCharPrimitive(com.googlecode.jtype.TypesTest)  Time elapsed: 0.015 s  <<< ERROR!
+[ERROR] valueOfWithCharPrimitive(com.googlecode.jtype.TypesTest)  Time elapsed: 0.001 s  <<< ERROR!
 java.lang.IllegalStateException: Mockery named 'context' is null
 
-[ERROR] valueOfWithClassAndMissingImportContext(com.googlecode.jtype.TypesTest)  Time elapsed: 0 s  <<< ERROR!
+[ERROR] valueOfWithClassAndMissingImportContext(com.googlecode.jtype.TypesTest)  Time elapsed: 0.001 s  <<< ERROR!
 java.lang.IllegalStateException: Mockery named 'context' is null
 
-[ERROR] valueOfWithUpperBoundedWildcardTypeAndWhitespace(com.googlecode.jtype.TypesTest)  Time elapsed: 0 s  <<< ERROR!
+[ERROR] valueOfWithUpperBoundedWildcardTypeAndWhitespace(com.googlecode.jtype.TypesTest)  Time elapsed: 0.001 s  <<< ERROR!
 java.lang.IllegalStateException: Mockery named 'context' is null
 
-[ERROR] lowerBoundedWildcardType(com.googlecode.jtype.TypesTest)  Time elapsed: 0 s  <<< ERROR!
+[ERROR] lowerBoundedWildcardType(com.googlecode.jtype.TypesTest)  Time elapsed: 0.001 s  <<< ERROR!
 java.lang.IllegalStateException: Mockery named 'context' is null
 
-[ERROR] unboundedParameterizedTypeWithUnparameterizedRawType(com.googlecode.jtype.TypesTest)  Time elapsed: 0 s  <<< ERROR!
+[ERROR] unboundedParameterizedTypeWithUnparameterizedRawType(com.googlecode.jtype.TypesTest)  Time elapsed: 0.002 s  <<< ERROR!
 java.lang.IllegalStateException: Mockery named 'context' is null
 
-[ERROR] genericArrayTypeWithNull(com.googlecode.jtype.TypesTest)  Time elapsed: 0.007 s  <<< ERROR!
+[ERROR] genericArrayTypeWithNull(com.googlecode.jtype.TypesTest)  Time elapsed: 0 s  <<< ERROR!
 java.lang.IllegalStateException: Mockery named 'context' is null
 
-[ERROR] valueOfWithArray(com.googlecode.jtype.TypesTest)  Time elapsed: 0 s  <<< ERROR!
+[ERROR] valueOfWithArray(com.googlecode.jtype.TypesTest)  Time elapsed: 0.001 s  <<< ERROR!
 java.lang.IllegalStateException: Mockery named 'context' is null
 
 [ERROR] valueOfWithClass(com.googlecode.jtype.TypesTest)  Time elapsed: 0.001 s  <<< ERROR!
 java.lang.IllegalStateException: Mockery named 'context' is null
 
-[ERROR] valueOfWithSingleUnboundedWildcardParameterizedType(com.googlecode.jtype.TypesTest)  Time elapsed: 0 s  <<< ERROR!
+[ERROR] valueOfWithSingleUnboundedWildcardParameterizedType(com.googlecode.jtype.TypesTest)  Time elapsed: 0.001 s  <<< ERROR!
 java.lang.IllegalStateException: Mockery named 'context' is null
 
-[ERROR] parameterizedType(com.googlecode.jtype.TypesTest)  Time elapsed: 0 s  <<< ERROR!
+[ERROR] parameterizedType(com.googlecode.jtype.TypesTest)  Time elapsed: 0.001 s  <<< ERROR!
 java.lang.IllegalStateException: Mockery named 'context' is null
 
-[ERROR] valueOfWithUnboundedWildcardType(com.googlecode.jtype.TypesTest)  Time elapsed: 0 s  <<< ERROR!
+[ERROR] valueOfWithUnboundedWildcardType(com.googlecode.jtype.TypesTest)  Time elapsed: 0.003 s  <<< ERROR!
 java.lang.IllegalStateException: Mockery named 'context' is null
 
-[ERROR] typeVariableWithNoBounds(com.googlecode.jtype.TypesTest)  Time elapsed: 0.007 s  <<< ERROR!
+[ERROR] typeVariableWithNoBounds(com.googlecode.jtype.TypesTest)  Time elapsed: 0 s  <<< ERROR!
 java.lang.IllegalStateException: Mockery named 'context' is null
 
-[ERROR] valueOfWithMultiParameterizedType(com.googlecode.jtype.TypesTest)  Time elapsed: 0 s  <<< ERROR!
+[ERROR] valueOfWithMultiParameterizedType(com.googlecode.jtype.TypesTest)  Time elapsed: 0.001 s  <<< ERROR!
 java.lang.IllegalStateException: Mockery named 'context' is null
 
-[ERROR] valueOfWithBytePrimitive(com.googlecode.jtype.TypesTest)  Time elapsed: 0.001 s  <<< ERROR!
+[ERROR] valueOfWithBytePrimitive(com.googlecode.jtype.TypesTest)  Time elapsed: 0 s  <<< ERROR!
 java.lang.IllegalStateException: Mockery named 'context' is null
 
-[ERROR] valueOfWithLowerBoundedWildcardType(com.googlecode.jtype.TypesTest)  Time elapsed: 0 s  <<< ERROR!
+[ERROR] valueOfWithLowerBoundedWildcardType(com.googlecode.jtype.TypesTest)  Time elapsed: 0.001 s  <<< ERROR!
 java.lang.IllegalStateException: Mockery named 'context' is null
 
-[ERROR] valueOfWithClassAndInvalidImportContext(com.googlecode.jtype.TypesTest)  Time elapsed: 0 s  <<< ERROR!
+[ERROR] valueOfWithClassAndInvalidImportContext(com.googlecode.jtype.TypesTest)  Time elapsed: 0.01 s  <<< ERROR!
 java.lang.IllegalStateException: Mockery named 'context' is null
 
 [ERROR] unboundedWildcardTypeIsCached(com.googlecode.jtype.TypesTest)  Time elapsed: 0 s  <<< ERROR!
 java.lang.IllegalStateException: Mockery named 'context' is null
 
-[ERROR] valueOfWithMultiAndMultipleArgumentParameterizedType(com.googlecode.jtype.TypesTest)  Time elapsed: 0.007 s  <<< ERROR!
+[ERROR] valueOfWithMultiAndMultipleArgumentParameterizedType(com.googlecode.jtype.TypesTest)  Time elapsed: 0 s  <<< ERROR!
 java.lang.IllegalStateException: Mockery named 'context' is null
 
 [ERROR] genericArrayType(com.googlecode.jtype.TypesTest)  Time elapsed: 0 s  <<< ERROR!
 java.lang.IllegalStateException: Mockery named 'context' is null
 
-[INFO] Running com.googlecode.jtype.TypeUtilsTest
-[ERROR] Tests run: 202, Failures: 1, Errors: 0, Skipped: 4, Time elapsed: 0.38 s <<< FAILURE! - in com.googlecode.jtype.TypeUtilsTest
-[ERROR] getResolvedInterfacesWithClass(com.googlecode.jtype.TypeUtilsTest)  Time elapsed: 0.004 s  <<< FAILURE!
-org.junit.internal.ArrayComparisonFailure: array lengths differed, expected.length=1 actual.length=3; arrays first differed at element [1]; expected:<end of array> but was:<interface java.lang.constant.Constable>
-	at com.googlecode.jtype.TypeUtilsTest.getResolvedInterfacesWithClass(TypeUtilsTest.java:1434)
-Caused by: java.lang.AssertionError: expected:<end of array> but was:<interface java.lang.constant.Constable>
-	at com.googlecode.jtype.TypeUtilsTest.getResolvedInterfacesWithClass(TypeUtilsTest.java:1434)
-
-[INFO] Running com.googlecode.jtype.GenericsTest
-[INFO] Tests run: 26, Failures: 0, Errors: 0, Skipped: 0, Time elapsed: 0.005 s - in com.googlecode.jtype.GenericsTest
+[INFO] Running com.googlecode.jtype.DefaultWildcardTypeTest
+[INFO] Tests run: 16, Failures: 0, Errors: 0, Skipped: 0, Time elapsed: 0.015 s - in com.googlecode.jtype.DefaultWildcardTypeTest
+[INFO] Running com.googlecode.jtype.DefaultTypeVariableTest
+[INFO] Tests run: 28, Failures: 0, Errors: 0, Skipped: 0, Time elapsed: 0.012 s - in com.googlecode.jtype.DefaultTypeVariableTest
+[INFO] Running com.googlecode.jtype.DefaultParameterizedTypeTest
+[INFO] Tests run: 17, Failures: 0, Errors: 0, Skipped: 0, Time elapsed: 0.004 s - in com.googlecode.jtype.DefaultParameterizedTypeTest
+[INFO] Running com.googlecode.jtype.ClassUtilsTest
+[INFO] Tests run: 18, Failures: 0, Errors: 0, Skipped: 0, Time elapsed: 0.004 s - in com.googlecode.jtype.ClassUtilsTest
+[INFO] Running com.googlecode.jtype.TypeUtilsGetResolvedSupertypeTest
+[INFO] Tests run: 5, Failures: 0, Errors: 0, Skipped: 0, Time elapsed: 0.002 s - in com.googlecode.jtype.TypeUtilsGetResolvedSupertypeTest
 [INFO] 
 [INFO] Results:
 [INFO] 
@@ -1929,8 +1965,8 @@
 [INFO] ------------------------------------------------------------------------
 [INFO] BUILD SUCCESS
 [INFO] ------------------------------------------------------------------------
-[INFO] Total time:  39.237 s
-[INFO] Finished at: 2025-01-31T03:03:43-12:00
+[INFO] Total time:  37.847 s
+[INFO] Finished at: 2025-02-01T05:08:20+14:00
 [INFO] ------------------------------------------------------------------------
    create-stamp debian/debhelper-build-stamp
  fakeroot debian/rules binary
@@ -1958,8 +1994,8 @@
 [INFO] ------------------------------------------------------------------------
 [INFO] BUILD SUCCESS
 [INFO] ------------------------------------------------------------------------
-[INFO] Total time:  2.160 s
-[INFO] Finished at: 2025-01-31T03:03:51-12:00
+[INFO] Total time:  2.244 s
+[INFO] Finished at: 2025-02-01T05:08:29+14:00
 [INFO] ------------------------------------------------------------------------
 	mh_resolve_dependencies --non-interactive --offline --build -plibjtype-java --base-directory=/build/reproducible-path/libjtype-java-0.1.3 --non-explore
 Analysing pom.xml...
@@ -1989,12 +2025,14 @@
 dpkg-buildpackage: info: binary-only upload (no source included)
 dpkg-genchanges: info: not including original source code in upload
 I: copying local configuration
+I: user script /srv/workspace/pbuilder/18640/tmp/hooks/B01_cleanup starting
+I: user script /srv/workspace/pbuilder/18640/tmp/hooks/B01_cleanup finished
 I: unmounting dev/ptmx filesystem
 I: unmounting dev/pts filesystem
 I: unmounting dev/shm filesystem
 I: unmounting proc filesystem
 I: unmounting sys filesystem
 I: cleaning the build env 
-I: removing directory /srv/workspace/pbuilder/22616 and its subdirectories
-I: Current time: Fri Jan 31 03:04:06 -12 2025
-I: pbuilder-time-stamp: 1738335846
+I: removing directory /srv/workspace/pbuilder/18640 and its subdirectories
+I: Current time: Sat Feb  1 05:08:59 +14 2025
+I: pbuilder-time-stamp: 1738336139