Diff of the two buildlogs:

--
--- b1/build.log	2025-01-30 04:52:33.666654032 +0000
+++ b2/build.log	2025-01-30 04:54:41.724882909 +0000
@@ -1,6 +1,6 @@
 I: pbuilder: network access will be disabled during build
-I: Current time: Wed Jan 29 16:50:47 -12 2025
-I: pbuilder-time-stamp: 1738212647
+I: Current time: Thu Jan 30 18:52:46 +14 2025
+I: pbuilder-time-stamp: 1738212766
 I: Building the build Environment
 I: extracting base tarball [/var/cache/pbuilder/trixie-reproducible-base.tgz]
 I: copying local configuration
@@ -26,52 +26,84 @@
 dpkg-source: info: applying fix-ftbts-implicit-function-syscall.patch
 I: Not using root during the build.
 I: Installing the build-deps
-I: user script /srv/workspace/pbuilder/29058/tmp/hooks/D02_print_environment starting
+I: user script /srv/workspace/pbuilder/16425/tmp/hooks/D01_modify_environment starting
+debug: Running on ff64a.
+I: Changing host+domainname to test build reproducibility
+I: Adding a custom variable just for the fun of it...
+I: Changing /bin/sh to bash
+'/bin/sh' -> '/bin/bash'
+lrwxrwxrwx 1 root root 9 Jan 30 04:53 /bin/sh -> /bin/bash
+I: Setting pbuilder2's login shell to /bin/bash
+I: Setting pbuilder2's GECOS to second user,second room,second work-phone,second home-phone,second other
+I: user script /srv/workspace/pbuilder/16425/tmp/hooks/D01_modify_environment finished
+I: user script /srv/workspace/pbuilder/16425/tmp/hooks/D02_print_environment starting
 I: set
-  BUILDDIR='/build/reproducible-path'
-  BUILDUSERGECOS='first user,first room,first work-phone,first home-phone,first other'
-  BUILDUSERNAME='pbuilder1'
-  BUILD_ARCH='armhf'
-  DEBIAN_FRONTEND='noninteractive'
-  DEB_BUILD_OPTIONS='buildinfo=+all reproducible=+all parallel=3 '
-  DISTRIBUTION='trixie'
-  HOME='/root'
-  HOST_ARCH='armhf'
+  BASH=/bin/sh
+  BASHOPTS=checkwinsize:cmdhist:complete_fullquote:extquote:force_fignore:globasciiranges:globskipdots:hostcomplete:interactive_comments:patsub_replacement:progcomp:promptvars:sourcepath
+  BASH_ALIASES=()
+  BASH_ARGC=()
+  BASH_ARGV=()
+  BASH_CMDS=()
+  BASH_LINENO=([0]="12" [1]="0")
+  BASH_LOADABLES_PATH=/usr/local/lib/bash:/usr/lib/bash:/opt/local/lib/bash:/usr/pkg/lib/bash:/opt/pkg/lib/bash:.
+  BASH_SOURCE=([0]="/tmp/hooks/D02_print_environment" [1]="/tmp/hooks/D02_print_environment")
+  BASH_VERSINFO=([0]="5" [1]="2" [2]="37" [3]="1" [4]="release" [5]="arm-unknown-linux-gnueabihf")
+  BASH_VERSION='5.2.37(1)-release'
+  BUILDDIR=/build/reproducible-path
+  BUILDUSERGECOS='second user,second room,second work-phone,second home-phone,second other'
+  BUILDUSERNAME=pbuilder2
+  BUILD_ARCH=armhf
+  DEBIAN_FRONTEND=noninteractive
+  DEB_BUILD_OPTIONS='buildinfo=+all reproducible=+all parallel=6 '
+  DIRSTACK=()
+  DISTRIBUTION=trixie
+  EUID=0
+  FUNCNAME=([0]="Echo" [1]="main")
+  GROUPS=()
+  HOME=/root
+  HOSTNAME=i-capture-the-hostname
+  HOSTTYPE=arm
+  HOST_ARCH=armhf
   IFS=' 	
   '
-  INVOCATION_ID='e42921cb9e7942e38ae83d7ecae64501'
-  LANG='C'
-  LANGUAGE='en_US:en'
-  LC_ALL='C'
-  MAIL='/var/mail/root'
-  OPTIND='1'
-  PATH='/usr/sbin:/usr/bin:/sbin:/bin:/usr/games'
-  PBCURRENTCOMMANDLINEOPERATION='build'
-  PBUILDER_OPERATION='build'
-  PBUILDER_PKGDATADIR='/usr/share/pbuilder'
-  PBUILDER_PKGLIBDIR='/usr/lib/pbuilder'
-  PBUILDER_SYSCONFDIR='/etc'
-  PPID='29058'
-  PS1='# '
-  PS2='> '
+  INVOCATION_ID=66dd5ad0db694193bc7c1a21acfa3ee4
+  LANG=C
+  LANGUAGE=it_CH:it
+  LC_ALL=C
+  MACHTYPE=arm-unknown-linux-gnueabihf
+  MAIL=/var/mail/root
+  OPTERR=1
+  OPTIND=1
+  OSTYPE=linux-gnueabihf
+  PATH=/usr/sbin:/usr/bin:/sbin:/bin:/usr/games:/i/capture/the/path
+  PBCURRENTCOMMANDLINEOPERATION=build
+  PBUILDER_OPERATION=build
+  PBUILDER_PKGDATADIR=/usr/share/pbuilder
+  PBUILDER_PKGLIBDIR=/usr/lib/pbuilder
+  PBUILDER_SYSCONFDIR=/etc
+  PIPESTATUS=([0]="0")
+  POSIXLY_CORRECT=y
+  PPID=16425
   PS4='+ '
-  PWD='/'
-  SHELL='/bin/bash'
-  SHLVL='2'
-  SUDO_COMMAND='/usr/bin/timeout -k 18.1h 18h /usr/bin/ionice -c 3 /usr/bin/nice /usr/sbin/pbuilder --build --configfile /srv/reproducible-results/rbuild-debian/r-b-build.adWlMLTm/pbuilderrc_ffH4 --distribution trixie --hookdir /etc/pbuilder/first-build-hooks --debbuildopts -b --basetgz /var/cache/pbuilder/trixie-reproducible-base.tgz --buildresult /srv/reproducible-results/rbuild-debian/r-b-build.adWlMLTm/b1 --logfile b1/build.log cpuinfo_0.0~git20250110.8a1772a-1.dsc'
-  SUDO_GID='110'
-  SUDO_UID='103'
-  SUDO_USER='jenkins'
-  TERM='unknown'
-  TZ='/usr/share/zoneinfo/Etc/GMT+12'
-  USER='root'
-  _='/usr/bin/systemd-run'
-  http_proxy='http://10.0.0.15:3142/'
+  PWD=/
+  SHELL=/bin/bash
+  SHELLOPTS=braceexpand:errexit:hashall:interactive-comments:posix
+  SHLVL=3
+  SUDO_COMMAND='/usr/bin/timeout -k 24.1h 24h /usr/bin/ionice -c 3 /usr/bin/nice -n 11 /usr/bin/unshare --uts -- /usr/sbin/pbuilder --build --configfile /srv/reproducible-results/rbuild-debian/r-b-build.adWlMLTm/pbuilderrc_89Uu --distribution trixie --hookdir /etc/pbuilder/rebuild-hooks --debbuildopts -b --basetgz /var/cache/pbuilder/trixie-reproducible-base.tgz --buildresult /srv/reproducible-results/rbuild-debian/r-b-build.adWlMLTm/b2 --logfile b2/build.log cpuinfo_0.0~git20250110.8a1772a-1.dsc'
+  SUDO_GID=114
+  SUDO_UID=109
+  SUDO_USER=jenkins
+  TERM=unknown
+  TZ=/usr/share/zoneinfo/Etc/GMT-14
+  UID=0
+  USER=root
+  _='I: set'
+  http_proxy=http://10.0.0.15:3142/
 I: uname -a
-  Linux virt32z 6.1.0-30-armmp-lpae #1 SMP Debian 6.1.124-1 (2025-01-12) armv7l GNU/Linux
+  Linux i-capture-the-hostname 6.1.0-30-arm64 #1 SMP Debian 6.1.124-1 (2025-01-12) aarch64 GNU/Linux
 I: ls -l /bin
   lrwxrwxrwx 1 root root 7 Nov 22 14:40 /bin -> usr/bin
-I: user script /srv/workspace/pbuilder/29058/tmp/hooks/D02_print_environment finished
+I: user script /srv/workspace/pbuilder/16425/tmp/hooks/D02_print_environment finished
  -> Attempting to satisfy build-dependencies
  -> Creating pbuilder-satisfydepends-dummy package
 Package: pbuilder-satisfydepends-dummy
@@ -174,7 +206,7 @@
 Get: 59 http://deb.debian.org/debian trixie/main armhf debhelper all 13.24.1 [920 kB]
 Get: 60 http://deb.debian.org/debian trixie/main armhf googletest all 1.15.2-1 [514 kB]
 Get: 61 http://deb.debian.org/debian trixie/main armhf ninja-build armhf 1.12.1-1 [125 kB]
-Fetched 33.9 MB in 3s (11.6 MB/s)
+Fetched 33.9 MB in 1s (34.6 MB/s)
 Preconfiguring packages ...
 Selecting previously unselected package libproc2-0:armhf.
 (Reading database ... 
(Reading database ... 5%
(Reading database ... 10%
(Reading database ... 15%
(Reading database ... 20%
(Reading database ... 25%
(Reading database ... 30%
(Reading database ... 35%
(Reading database ... 40%
(Reading database ... 45%
(Reading database ... 50%
(Reading database ... 55%
(Reading database ... 60%
(Reading database ... 65%
(Reading database ... 70%
(Reading database ... 75%
(Reading database ... 80%
(Reading database ... 85%
(Reading database ... 90%
(Reading database ... 95%
(Reading database ... 100%
(Reading database ... 19575 files and directories currently installed.)
@@ -433,7 +465,11 @@
 Building tag database...
  -> Finished parsing the build-deps
 I: Building the package
-I: Running cd /build/reproducible-path/cpuinfo-0.0~git20250110.8a1772a/ && env PATH="/usr/sbin:/usr/bin:/sbin:/bin:/usr/games" HOME="/nonexistent/first-build" dpkg-buildpackage -us -uc -b && env PATH="/usr/sbin:/usr/bin:/sbin:/bin:/usr/games" HOME="/nonexistent/first-build" dpkg-genchanges -S  > ../cpuinfo_0.0~git20250110.8a1772a-1_source.changes
+I: user script /srv/workspace/pbuilder/16425/tmp/hooks/A99_set_merged_usr starting
+Not re-configuring usrmerge for trixie
+I: user script /srv/workspace/pbuilder/16425/tmp/hooks/A99_set_merged_usr finished
+hostname: Name or service not known
+I: Running cd /build/reproducible-path/cpuinfo-0.0~git20250110.8a1772a/ && env PATH="/usr/sbin:/usr/bin:/sbin:/bin:/usr/games:/i/capture/the/path" HOME="/nonexistent/second-build" dpkg-buildpackage -us -uc -b && env PATH="/usr/sbin:/usr/bin:/sbin:/bin:/usr/games:/i/capture/the/path" HOME="/nonexistent/second-build" dpkg-genchanges -S  > ../cpuinfo_0.0~git20250110.8a1772a-1_source.changes
 dpkg-buildpackage: info: source package cpuinfo
 dpkg-buildpackage: info: source version 0.0~git20250110.8a1772a-1
 dpkg-buildpackage: info: source distribution unstable
@@ -481,8 +517,8 @@
 -- Performing Test CMAKE_HAVE_LIBC_PTHREAD
 -- Performing Test CMAKE_HAVE_LIBC_PTHREAD - Success
 -- Found Threads: TRUE
--- Configuring done (1.5s)
--- Generating done (0.1s)
+-- Configuring done (3.4s)
+-- Generating done (0.2s)
 CMake Warning:
   Manually-specified variables were not used by the project:
 
@@ -494,267 +530,183 @@
 -- Build files have been written to: /build/reproducible-path/cpuinfo-0.0~git20250110.8a1772a/obj-arm-linux-gnueabihf
 make[1]: Leaving directory '/build/reproducible-path/cpuinfo-0.0~git20250110.8a1772a'
    dh_auto_build -O-Scmake\+ninja
-	cd obj-arm-linux-gnueabihf && LC_ALL=C.UTF-8 ninja -j3 -v
+	cd obj-arm-linux-gnueabihf && LC_ALL=C.UTF-8 ninja -j6 -v
 [1/78] /usr/bin/cc -DCPUINFO_LOG_LEVEL=2 -DCPUINFO_LOG_TO_STDIO=1 -D_GNU_SOURCE=1 -Dcpuinfo_EXPORTS -I"/build/reproducible-path/cpuinfo-0.0~git20250110.8a1772a/src" -I"/build/reproducible-path/cpuinfo-0.0~git20250110.8a1772a/include" -g -O2 -Werror=implicit-function-declaration -ffile-prefix-map=/build/reproducible-path/cpuinfo-0.0~git20250110.8a1772a=. -fstack-protector-strong -fstack-clash-protection -Wformat -Werror=format-security -D_LARGEFILE_SOURCE -D_FILE_OFFSET_BITS=64 -D_TIME_BITS=64 -Wdate-time -D_FORTIFY_SOURCE=2 -std=c99 -fPIC -MD -MT CMakeFiles/cpuinfo.dir/src/cache.c.o -MF CMakeFiles/cpuinfo.dir/src/cache.c.o.d -o CMakeFiles/cpuinfo.dir/src/cache.c.o -c '/build/reproducible-path/cpuinfo-0.0~git20250110.8a1772a/src/cache.c'
 [2/78] /usr/bin/cc -DCPUINFO_LOG_LEVEL=2 -DCPUINFO_LOG_TO_STDIO=1 -D_GNU_SOURCE=1 -Dcpuinfo_EXPORTS -I"/build/reproducible-path/cpuinfo-0.0~git20250110.8a1772a/src" -I"/build/reproducible-path/cpuinfo-0.0~git20250110.8a1772a/include" -g -O2 -Werror=implicit-function-declaration -ffile-prefix-map=/build/reproducible-path/cpuinfo-0.0~git20250110.8a1772a=. -fstack-protector-strong -fstack-clash-protection -Wformat -Werror=format-security -D_LARGEFILE_SOURCE -D_FILE_OFFSET_BITS=64 -D_TIME_BITS=64 -Wdate-time -D_FORTIFY_SOURCE=2 -std=c99 -fPIC -MD -MT CMakeFiles/cpuinfo.dir/src/init.c.o -MF CMakeFiles/cpuinfo.dir/src/init.c.o.d -o CMakeFiles/cpuinfo.dir/src/init.c.o -c '/build/reproducible-path/cpuinfo-0.0~git20250110.8a1772a/src/init.c'
-[3/78] /usr/bin/cc -DCPUINFO_LOG_LEVEL=2 -DCPUINFO_LOG_TO_STDIO=1 -D_GNU_SOURCE=1 -Dcpuinfo_EXPORTS -I"/build/reproducible-path/cpuinfo-0.0~git20250110.8a1772a/src" -I"/build/reproducible-path/cpuinfo-0.0~git20250110.8a1772a/include" -g -O2 -Werror=implicit-function-declaration -ffile-prefix-map=/build/reproducible-path/cpuinfo-0.0~git20250110.8a1772a=. -fstack-protector-strong -fstack-clash-protection -Wformat -Werror=format-security -D_LARGEFILE_SOURCE -D_FILE_OFFSET_BITS=64 -D_TIME_BITS=64 -Wdate-time -D_FORTIFY_SOURCE=2 -std=c99 -fPIC -MD -MT CMakeFiles/cpuinfo.dir/src/log.c.o -MF CMakeFiles/cpuinfo.dir/src/log.c.o.d -o CMakeFiles/cpuinfo.dir/src/log.c.o -c '/build/reproducible-path/cpuinfo-0.0~git20250110.8a1772a/src/log.c'
-[4/78] /usr/bin/cc -DCPUINFO_LOG_LEVEL=2 -DCPUINFO_LOG_TO_STDIO=1 -D_GNU_SOURCE=1 -Dcpuinfo_EXPORTS -I"/build/reproducible-path/cpuinfo-0.0~git20250110.8a1772a/src" -I"/build/reproducible-path/cpuinfo-0.0~git20250110.8a1772a/include" -g -O2 -Werror=implicit-function-declaration -ffile-prefix-map=/build/reproducible-path/cpuinfo-0.0~git20250110.8a1772a=. -fstack-protector-strong -fstack-clash-protection -Wformat -Werror=format-security -D_LARGEFILE_SOURCE -D_FILE_OFFSET_BITS=64 -D_TIME_BITS=64 -Wdate-time -D_FORTIFY_SOURCE=2 -std=c99 -fPIC -MD -MT CMakeFiles/cpuinfo.dir/src/arm/uarch.c.o -MF CMakeFiles/cpuinfo.dir/src/arm/uarch.c.o.d -o CMakeFiles/cpuinfo.dir/src/arm/uarch.c.o -c '/build/reproducible-path/cpuinfo-0.0~git20250110.8a1772a/src/arm/uarch.c'
-[5/78] /usr/bin/cc -DCPUINFO_LOG_LEVEL=2 -DCPUINFO_LOG_TO_STDIO=1 -D_GNU_SOURCE=1 -Dcpuinfo_EXPORTS -I"/build/reproducible-path/cpuinfo-0.0~git20250110.8a1772a/src" -I"/build/reproducible-path/cpuinfo-0.0~git20250110.8a1772a/include" -g -O2 -Werror=implicit-function-declaration -ffile-prefix-map=/build/reproducible-path/cpuinfo-0.0~git20250110.8a1772a=. -fstack-protector-strong -fstack-clash-protection -Wformat -Werror=format-security -D_LARGEFILE_SOURCE -D_FILE_OFFSET_BITS=64 -D_TIME_BITS=64 -Wdate-time -D_FORTIFY_SOURCE=2 -std=c99 -fPIC -MD -MT CMakeFiles/cpuinfo.dir/src/api.c.o -MF CMakeFiles/cpuinfo.dir/src/api.c.o.d -o CMakeFiles/cpuinfo.dir/src/api.c.o -c '/build/reproducible-path/cpuinfo-0.0~git20250110.8a1772a/src/api.c'
-[6/78] /usr/bin/cc -DCPUINFO_LOG_LEVEL=2 -DCPUINFO_LOG_TO_STDIO=1 -D_GNU_SOURCE=1 -Dcpuinfo_EXPORTS -I"/build/reproducible-path/cpuinfo-0.0~git20250110.8a1772a/src" -I"/build/reproducible-path/cpuinfo-0.0~git20250110.8a1772a/include" -g -O2 -Werror=implicit-function-declaration -ffile-prefix-map=/build/reproducible-path/cpuinfo-0.0~git20250110.8a1772a=. -fstack-protector-strong -fstack-clash-protection -Wformat -Werror=format-security -D_LARGEFILE_SOURCE -D_FILE_OFFSET_BITS=64 -D_TIME_BITS=64 -Wdate-time -D_FORTIFY_SOURCE=2 -std=c99 -fPIC -MD -MT CMakeFiles/cpuinfo.dir/src/arm/cache.c.o -MF CMakeFiles/cpuinfo.dir/src/arm/cache.c.o.d -o CMakeFiles/cpuinfo.dir/src/arm/cache.c.o -c '/build/reproducible-path/cpuinfo-0.0~git20250110.8a1772a/src/arm/cache.c'
-[7/78] /usr/bin/cc -DCPUINFO_LOG_LEVEL=2 -DCPUINFO_LOG_TO_STDIO=1 -D_GNU_SOURCE=1 -Dcpuinfo_EXPORTS -I"/build/reproducible-path/cpuinfo-0.0~git20250110.8a1772a/src" -I"/build/reproducible-path/cpuinfo-0.0~git20250110.8a1772a/include" -g -O2 -Werror=implicit-function-declaration -ffile-prefix-map=/build/reproducible-path/cpuinfo-0.0~git20250110.8a1772a=. -fstack-protector-strong -fstack-clash-protection -Wformat -Werror=format-security -D_LARGEFILE_SOURCE -D_FILE_OFFSET_BITS=64 -D_TIME_BITS=64 -Wdate-time -D_FORTIFY_SOURCE=2 -std=c99 -fPIC -MD -MT CMakeFiles/cpuinfo.dir/src/arm/linux/cpuinfo.c.o -MF CMakeFiles/cpuinfo.dir/src/arm/linux/cpuinfo.c.o.d -o CMakeFiles/cpuinfo.dir/src/arm/linux/cpuinfo.c.o -c '/build/reproducible-path/cpuinfo-0.0~git20250110.8a1772a/src/arm/linux/cpuinfo.c'
-[8/78] /usr/bin/cc -DCPUINFO_LOG_LEVEL=2 -DCPUINFO_LOG_TO_STDIO=1 -D_GNU_SOURCE=1 -Dcpuinfo_EXPORTS -I"/build/reproducible-path/cpuinfo-0.0~git20250110.8a1772a/src" -I"/build/reproducible-path/cpuinfo-0.0~git20250110.8a1772a/include" -g -O2 -Werror=implicit-function-declaration -ffile-prefix-map=/build/reproducible-path/cpuinfo-0.0~git20250110.8a1772a=. -fstack-protector-strong -fstack-clash-protection -Wformat -Werror=format-security -D_LARGEFILE_SOURCE -D_FILE_OFFSET_BITS=64 -D_TIME_BITS=64 -Wdate-time -D_FORTIFY_SOURCE=2 -std=c99 -fPIC -MD -MT CMakeFiles/cpuinfo.dir/src/arm/linux/init.c.o -MF CMakeFiles/cpuinfo.dir/src/arm/linux/init.c.o.d -o CMakeFiles/cpuinfo.dir/src/arm/linux/init.c.o -c '/build/reproducible-path/cpuinfo-0.0~git20250110.8a1772a/src/arm/linux/init.c'
-[9/78] /usr/bin/cc -DCPUINFO_LOG_LEVEL=2 -DCPUINFO_LOG_TO_STDIO=1 -D_GNU_SOURCE=1 -Dcpuinfo_EXPORTS -I"/build/reproducible-path/cpuinfo-0.0~git20250110.8a1772a/src" -I"/build/reproducible-path/cpuinfo-0.0~git20250110.8a1772a/include" -g -O2 -Werror=implicit-function-declaration -ffile-prefix-map=/build/reproducible-path/cpuinfo-0.0~git20250110.8a1772a=. -fstack-protector-strong -fstack-clash-protection -Wformat -Werror=format-security -D_LARGEFILE_SOURCE -D_FILE_OFFSET_BITS=64 -D_TIME_BITS=64 -Wdate-time -D_FORTIFY_SOURCE=2 -std=c99 -fPIC -MD -MT CMakeFiles/cpuinfo.dir/src/arm/linux/clusters.c.o -MF CMakeFiles/cpuinfo.dir/src/arm/linux/clusters.c.o.d -o CMakeFiles/cpuinfo.dir/src/arm/linux/clusters.c.o -c '/build/reproducible-path/cpuinfo-0.0~git20250110.8a1772a/src/arm/linux/clusters.c'
-[10/78] /usr/bin/cc -DCPUINFO_LOG_LEVEL=2 -DCPUINFO_LOG_TO_STDIO=1 -D_GNU_SOURCE=1 -Dcpuinfo_EXPORTS -I"/build/reproducible-path/cpuinfo-0.0~git20250110.8a1772a/src" -I"/build/reproducible-path/cpuinfo-0.0~git20250110.8a1772a/include" -g -O2 -Werror=implicit-function-declaration -ffile-prefix-map=/build/reproducible-path/cpuinfo-0.0~git20250110.8a1772a=. -fstack-protector-strong -fstack-clash-protection -Wformat -Werror=format-security -D_LARGEFILE_SOURCE -D_FILE_OFFSET_BITS=64 -D_TIME_BITS=64 -Wdate-time -D_FORTIFY_SOURCE=2 -std=c99 -fPIC -MD -MT CMakeFiles/cpuinfo.dir/src/arm/linux/hwcap.c.o -MF CMakeFiles/cpuinfo.dir/src/arm/linux/hwcap.c.o.d -o CMakeFiles/cpuinfo.dir/src/arm/linux/hwcap.c.o -c '/build/reproducible-path/cpuinfo-0.0~git20250110.8a1772a/src/arm/linux/hwcap.c'
-[11/78] /usr/bin/cc -DCPUINFO_LOG_LEVEL=2 -DCPUINFO_LOG_TO_STDIO=1 -D_GNU_SOURCE=1 -Dcpuinfo_EXPORTS -I"/build/reproducible-path/cpuinfo-0.0~git20250110.8a1772a/src" -I"/build/reproducible-path/cpuinfo-0.0~git20250110.8a1772a/include" -g -O2 -Werror=implicit-function-declaration -ffile-prefix-map=/build/reproducible-path/cpuinfo-0.0~git20250110.8a1772a=. -fstack-protector-strong -fstack-clash-protection -Wformat -Werror=format-security -D_LARGEFILE_SOURCE -D_FILE_OFFSET_BITS=64 -D_TIME_BITS=64 -Wdate-time -D_FORTIFY_SOURCE=2 -std=c99 -fPIC -MD -MT CMakeFiles/cpuinfo.dir/src/arm/linux/midr.c.o -MF CMakeFiles/cpuinfo.dir/src/arm/linux/midr.c.o.d -o CMakeFiles/cpuinfo.dir/src/arm/linux/midr.c.o -c '/build/reproducible-path/cpuinfo-0.0~git20250110.8a1772a/src/arm/linux/midr.c'
-[12/78] /usr/bin/cc -DCPUINFO_LOG_LEVEL=2 -DCPUINFO_LOG_TO_STDIO=1 -D_GNU_SOURCE=1 -Dcpuinfo_EXPORTS -I"/build/reproducible-path/cpuinfo-0.0~git20250110.8a1772a/src" -I"/build/reproducible-path/cpuinfo-0.0~git20250110.8a1772a/include" -g -O2 -Werror=implicit-function-declaration -ffile-prefix-map=/build/reproducible-path/cpuinfo-0.0~git20250110.8a1772a=. -fstack-protector-strong -fstack-clash-protection -Wformat -Werror=format-security -D_LARGEFILE_SOURCE -D_FILE_OFFSET_BITS=64 -D_TIME_BITS=64 -Wdate-time -D_FORTIFY_SOURCE=2 -std=c99 -fPIC -MD -MT CMakeFiles/cpuinfo.dir/src/linux/smallfile.c.o -MF CMakeFiles/cpuinfo.dir/src/linux/smallfile.c.o.d -o CMakeFiles/cpuinfo.dir/src/linux/smallfile.c.o -c '/build/reproducible-path/cpuinfo-0.0~git20250110.8a1772a/src/linux/smallfile.c'
-[13/78] /usr/bin/cc -DCPUINFO_LOG_LEVEL=2 -DCPUINFO_LOG_TO_STDIO=1 -D_GNU_SOURCE=1 -Dcpuinfo_EXPORTS -I"/build/reproducible-path/cpuinfo-0.0~git20250110.8a1772a/src" -I"/build/reproducible-path/cpuinfo-0.0~git20250110.8a1772a/include" -g -O2 -Werror=implicit-function-declaration -ffile-prefix-map=/build/reproducible-path/cpuinfo-0.0~git20250110.8a1772a=. -fstack-protector-strong -fstack-clash-protection -Wformat -Werror=format-security -D_LARGEFILE_SOURCE -D_FILE_OFFSET_BITS=64 -D_TIME_BITS=64 -Wdate-time -D_FORTIFY_SOURCE=2 -std=c99 -fPIC -MD -MT CMakeFiles/cpuinfo.dir/src/arm/linux/aarch32-isa.c.o -MF CMakeFiles/cpuinfo.dir/src/arm/linux/aarch32-isa.c.o.d -o CMakeFiles/cpuinfo.dir/src/arm/linux/aarch32-isa.c.o -c '/build/reproducible-path/cpuinfo-0.0~git20250110.8a1772a/src/arm/linux/aarch32-isa.c'
-[14/78] /usr/bin/cc -DCPUINFO_LOG_LEVEL=2 -DCPUINFO_LOG_TO_STDIO=1 -D_GNU_SOURCE=1 -Dcpuinfo_EXPORTS -I"/build/reproducible-path/cpuinfo-0.0~git20250110.8a1772a/src" -I"/build/reproducible-path/cpuinfo-0.0~git20250110.8a1772a/include" -g -O2 -Werror=implicit-function-declaration -ffile-prefix-map=/build/reproducible-path/cpuinfo-0.0~git20250110.8a1772a=. -fstack-protector-strong -fstack-clash-protection -Wformat -Werror=format-security -D_LARGEFILE_SOURCE -D_FILE_OFFSET_BITS=64 -D_TIME_BITS=64 -Wdate-time -D_FORTIFY_SOURCE=2 -std=c99 -fPIC -MD -MT CMakeFiles/cpuinfo.dir/src/linux/multiline.c.o -MF CMakeFiles/cpuinfo.dir/src/linux/multiline.c.o.d -o CMakeFiles/cpuinfo.dir/src/linux/multiline.c.o -c '/build/reproducible-path/cpuinfo-0.0~git20250110.8a1772a/src/linux/multiline.c'
-[15/78] /usr/bin/cc -DCPUINFO_LOG_LEVEL=2 -DCPUINFO_LOG_TO_STDIO=1 -D_GNU_SOURCE=1 -Dcpuinfo_EXPORTS -I"/build/reproducible-path/cpuinfo-0.0~git20250110.8a1772a/src" -I"/build/reproducible-path/cpuinfo-0.0~git20250110.8a1772a/include" -g -O2 -Werror=implicit-function-declaration -ffile-prefix-map=/build/reproducible-path/cpuinfo-0.0~git20250110.8a1772a=. -fstack-protector-strong -fstack-clash-protection -Wformat -Werror=format-security -D_LARGEFILE_SOURCE -D_FILE_OFFSET_BITS=64 -D_TIME_BITS=64 -Wdate-time -D_FORTIFY_SOURCE=2 -std=c99 -fPIC -MD -MT CMakeFiles/cpuinfo.dir/src/linux/cpulist.c.o -MF CMakeFiles/cpuinfo.dir/src/linux/cpulist.c.o.d -o CMakeFiles/cpuinfo.dir/src/linux/cpulist.c.o -c '/build/reproducible-path/cpuinfo-0.0~git20250110.8a1772a/src/linux/cpulist.c'
-[16/78] /usr/bin/cc -DCPUINFO_LOG_LEVEL=2 -DCPUINFO_LOG_TO_STDIO=1 -D_GNU_SOURCE=1 -Dcpuinfo_EXPORTS -I"/build/reproducible-path/cpuinfo-0.0~git20250110.8a1772a/src" -I"/build/reproducible-path/cpuinfo-0.0~git20250110.8a1772a/include" -g -O2 -Werror=implicit-function-declaration -ffile-prefix-map=/build/reproducible-path/cpuinfo-0.0~git20250110.8a1772a=. -fstack-protector-strong -fstack-clash-protection -Wformat -Werror=format-security -D_LARGEFILE_SOURCE -D_FILE_OFFSET_BITS=64 -D_TIME_BITS=64 -Wdate-time -D_FORTIFY_SOURCE=2 -std=c99 -fPIC -MD -MT CMakeFiles/cpuinfo.dir/src/arm/linux/chipset.c.o -MF CMakeFiles/cpuinfo.dir/src/arm/linux/chipset.c.o.d -o CMakeFiles/cpuinfo.dir/src/arm/linux/chipset.c.o -c '/build/reproducible-path/cpuinfo-0.0~git20250110.8a1772a/src/arm/linux/chipset.c'
-[17/78] /usr/bin/cc -DCPUINFO_LOG_LEVEL=2 -DCPUINFO_LOG_TO_STDIO=1 -D_GNU_SOURCE=1 -Dcpuinfo_EXPORTS -I"/build/reproducible-path/cpuinfo-0.0~git20250110.8a1772a/src" -I"/build/reproducible-path/cpuinfo-0.0~git20250110.8a1772a/include" -g -O2 -Werror=implicit-function-declaration -ffile-prefix-map=/build/reproducible-path/cpuinfo-0.0~git20250110.8a1772a=. -fstack-protector-strong -fstack-clash-protection -Wformat -Werror=format-security -D_LARGEFILE_SOURCE -D_FILE_OFFSET_BITS=64 -D_TIME_BITS=64 -Wdate-time -D_FORTIFY_SOURCE=2 -std=c99 -fPIC -MD -MT CMakeFiles/cpuinfo.dir/src/linux/processors.c.o -MF CMakeFiles/cpuinfo.dir/src/linux/processors.c.o.d -o CMakeFiles/cpuinfo.dir/src/linux/processors.c.o -c '/build/reproducible-path/cpuinfo-0.0~git20250110.8a1772a/src/linux/processors.c'
-[18/78] : && /usr/bin/cc -fPIC -g -O2 -Werror=implicit-function-declaration -ffile-prefix-map=/build/reproducible-path/cpuinfo-0.0~git20250110.8a1772a=. -fstack-protector-strong -fstack-clash-protection -Wformat -Werror=format-security -D_LARGEFILE_SOURCE -D_FILE_OFFSET_BITS=64 -D_TIME_BITS=64 -Wdate-time -D_FORTIFY_SOURCE=2  -Wl,-z,relro -Wl,-z,now   -Wl,--dependency-file=CMakeFiles/cpuinfo.dir/link.d -shared -Wl,-soname,libcpuinfo.so.0 -o libcpuinfo.so.0 CMakeFiles/cpuinfo.dir/src/api.c.o CMakeFiles/cpuinfo.dir/src/cache.c.o CMakeFiles/cpuinfo.dir/src/init.c.o CMakeFiles/cpuinfo.dir/src/log.c.o CMakeFiles/cpuinfo.dir/src/arm/uarch.c.o CMakeFiles/cpuinfo.dir/src/arm/cache.c.o CMakeFiles/cpuinfo.dir/src/arm/linux/init.c.o CMakeFiles/cpuinfo.dir/src/arm/linux/cpuinfo.c.o CMakeFiles/cpuinfo.dir/src/arm/linux/clusters.c.o CMakeFiles/cpuinfo.dir/src/arm/linux/chipset.c.o CMakeFiles/cpuinfo.dir/src/arm/linux/midr.c.o CMakeFiles/cpuinfo.dir/src/arm/linux/hwcap.c.o CMakeFiles/cpuinfo.dir/src/arm/linux/aarch32-isa.c.o CMakeFiles/cpuinfo.dir/src/linux/smallfile.c.o CMakeFiles/cpuinfo.dir/src/linux/multiline.c.o CMakeFiles/cpuinfo.dir/src/linux/cpulist.c.o CMakeFiles/cpuinfo.dir/src/linux/processors.c.o   && :
-[19/78] /usr/bin/c++  -isystem /usr/src/googletest/googletest/include -isystem /usr/src/googletest/googletest -g -O2 -ffile-prefix-map=/build/reproducible-path/cpuinfo-0.0~git20250110.8a1772a=. -fstack-protector-strong -fstack-clash-protection -Wformat -Werror=format-security -D_LARGEFILE_SOURCE -D_FILE_OFFSET_BITS=64 -D_TIME_BITS=64 -Wdate-time -D_FORTIFY_SOURCE=2 -Wall -Wshadow -Wundef -Wno-error=dangling-else -DGTEST_HAS_PTHREAD=1 -fexceptions -Wextra -Wno-unused-parameter -Wno-missing-field-initializers -DGTEST_HAS_PTHREAD=1 -MD -MT deps/googletest/googletest/CMakeFiles/gtest_main.dir/src/gtest_main.cc.o -MF deps/googletest/googletest/CMakeFiles/gtest_main.dir/src/gtest_main.cc.o.d -o deps/googletest/googletest/CMakeFiles/gtest_main.dir/src/gtest_main.cc.o -c /usr/src/googletest/googletest/src/gtest_main.cc
-[20/78] /usr/bin/cmake -E cmake_symlink_library libcpuinfo.so.0 libcpuinfo.so.0 libcpuinfo.so && :
-[21/78] /usr/bin/cc -DCPUINFO_LOG_LEVEL=0 -DCPUINFO_LOG_TO_STDIO=1 -D_GNU_SOURCE=1 -I"/build/reproducible-path/cpuinfo-0.0~git20250110.8a1772a/include" -I"/build/reproducible-path/cpuinfo-0.0~git20250110.8a1772a/src" -g -O2 -Werror=implicit-function-declaration -ffile-prefix-map=/build/reproducible-path/cpuinfo-0.0~git20250110.8a1772a=. -fstack-protector-strong -fstack-clash-protection -Wformat -Werror=format-security -D_LARGEFILE_SOURCE -D_FILE_OFFSET_BITS=64 -D_TIME_BITS=64 -Wdate-time -D_FORTIFY_SOURCE=2 -std=c99 -MD -MT CMakeFiles/cpuinfo_internals.dir/src/api.c.o -MF CMakeFiles/cpuinfo_internals.dir/src/api.c.o.d -o CMakeFiles/cpuinfo_internals.dir/src/api.c.o -c '/build/reproducible-path/cpuinfo-0.0~git20250110.8a1772a/src/api.c'
-[22/78] /usr/bin/cc -DCPUINFO_LOG_LEVEL=0 -DCPUINFO_LOG_TO_STDIO=1 -D_GNU_SOURCE=1 -I"/build/reproducible-path/cpuinfo-0.0~git20250110.8a1772a/include" -I"/build/reproducible-path/cpuinfo-0.0~git20250110.8a1772a/src" -g -O2 -Werror=implicit-function-declaration -ffile-prefix-map=/build/reproducible-path/cpuinfo-0.0~git20250110.8a1772a=. -fstack-protector-strong -fstack-clash-protection -Wformat -Werror=format-security -D_LARGEFILE_SOURCE -D_FILE_OFFSET_BITS=64 -D_TIME_BITS=64 -Wdate-time -D_FORTIFY_SOURCE=2 -std=c99 -MD -MT CMakeFiles/cpuinfo_internals.dir/src/cache.c.o -MF CMakeFiles/cpuinfo_internals.dir/src/cache.c.o.d -o CMakeFiles/cpuinfo_internals.dir/src/cache.c.o -c '/build/reproducible-path/cpuinfo-0.0~git20250110.8a1772a/src/cache.c'
-[23/78] /usr/bin/cc -DCPUINFO_LOG_LEVEL=0 -DCPUINFO_LOG_TO_STDIO=1 -D_GNU_SOURCE=1 -I"/build/reproducible-path/cpuinfo-0.0~git20250110.8a1772a/include" -I"/build/reproducible-path/cpuinfo-0.0~git20250110.8a1772a/src" -g -O2 -Werror=implicit-function-declaration -ffile-prefix-map=/build/reproducible-path/cpuinfo-0.0~git20250110.8a1772a=. -fstack-protector-strong -fstack-clash-protection -Wformat -Werror=format-security -D_LARGEFILE_SOURCE -D_FILE_OFFSET_BITS=64 -D_TIME_BITS=64 -Wdate-time -D_FORTIFY_SOURCE=2 -std=c99 -MD -MT CMakeFiles/cpuinfo_internals.dir/src/init.c.o -MF CMakeFiles/cpuinfo_internals.dir/src/init.c.o.d -o CMakeFiles/cpuinfo_internals.dir/src/init.c.o -c '/build/reproducible-path/cpuinfo-0.0~git20250110.8a1772a/src/init.c'
-[24/78] /usr/bin/cc -DCPUINFO_LOG_LEVEL=0 -DCPUINFO_LOG_TO_STDIO=1 -D_GNU_SOURCE=1 -I"/build/reproducible-path/cpuinfo-0.0~git20250110.8a1772a/include" -I"/build/reproducible-path/cpuinfo-0.0~git20250110.8a1772a/src" -g -O2 -Werror=implicit-function-declaration -ffile-prefix-map=/build/reproducible-path/cpuinfo-0.0~git20250110.8a1772a=. -fstack-protector-strong -fstack-clash-protection -Wformat -Werror=format-security -D_LARGEFILE_SOURCE -D_FILE_OFFSET_BITS=64 -D_TIME_BITS=64 -Wdate-time -D_FORTIFY_SOURCE=2 -std=c99 -MD -MT CMakeFiles/cpuinfo_internals.dir/src/log.c.o -MF CMakeFiles/cpuinfo_internals.dir/src/log.c.o.d -o CMakeFiles/cpuinfo_internals.dir/src/log.c.o -c '/build/reproducible-path/cpuinfo-0.0~git20250110.8a1772a/src/log.c'
-[25/78] /usr/bin/cc -DCPUINFO_LOG_LEVEL=0 -DCPUINFO_LOG_TO_STDIO=1 -D_GNU_SOURCE=1 -I"/build/reproducible-path/cpuinfo-0.0~git20250110.8a1772a/include" -I"/build/reproducible-path/cpuinfo-0.0~git20250110.8a1772a/src" -g -O2 -Werror=implicit-function-declaration -ffile-prefix-map=/build/reproducible-path/cpuinfo-0.0~git20250110.8a1772a=. -fstack-protector-strong -fstack-clash-protection -Wformat -Werror=format-security -D_LARGEFILE_SOURCE -D_FILE_OFFSET_BITS=64 -D_TIME_BITS=64 -Wdate-time -D_FORTIFY_SOURCE=2 -std=c99 -MD -MT CMakeFiles/cpuinfo_internals.dir/src/arm/uarch.c.o -MF CMakeFiles/cpuinfo_internals.dir/src/arm/uarch.c.o.d -o CMakeFiles/cpuinfo_internals.dir/src/arm/uarch.c.o -c '/build/reproducible-path/cpuinfo-0.0~git20250110.8a1772a/src/arm/uarch.c'
-[26/78] /usr/bin/cc -DCPUINFO_LOG_LEVEL=0 -DCPUINFO_LOG_TO_STDIO=1 -D_GNU_SOURCE=1 -I"/build/reproducible-path/cpuinfo-0.0~git20250110.8a1772a/include" -I"/build/reproducible-path/cpuinfo-0.0~git20250110.8a1772a/src" -g -O2 -Werror=implicit-function-declaration -ffile-prefix-map=/build/reproducible-path/cpuinfo-0.0~git20250110.8a1772a=. -fstack-protector-strong -fstack-clash-protection -Wformat -Werror=format-security -D_LARGEFILE_SOURCE -D_FILE_OFFSET_BITS=64 -D_TIME_BITS=64 -Wdate-time -D_FORTIFY_SOURCE=2 -std=c99 -MD -MT CMakeFiles/cpuinfo_internals.dir/src/arm/cache.c.o -MF CMakeFiles/cpuinfo_internals.dir/src/arm/cache.c.o.d -o CMakeFiles/cpuinfo_internals.dir/src/arm/cache.c.o -c '/build/reproducible-path/cpuinfo-0.0~git20250110.8a1772a/src/arm/cache.c'
-[27/78] /usr/bin/cc -DCPUINFO_LOG_LEVEL=0 -DCPUINFO_LOG_TO_STDIO=1 -D_GNU_SOURCE=1 -I"/build/reproducible-path/cpuinfo-0.0~git20250110.8a1772a/include" -I"/build/reproducible-path/cpuinfo-0.0~git20250110.8a1772a/src" -g -O2 -Werror=implicit-function-declaration -ffile-prefix-map=/build/reproducible-path/cpuinfo-0.0~git20250110.8a1772a=. -fstack-protector-strong -fstack-clash-protection -Wformat -Werror=format-security -D_LARGEFILE_SOURCE -D_FILE_OFFSET_BITS=64 -D_TIME_BITS=64 -Wdate-time -D_FORTIFY_SOURCE=2 -std=c99 -MD -MT CMakeFiles/cpuinfo_internals.dir/src/arm/linux/init.c.o -MF CMakeFiles/cpuinfo_internals.dir/src/arm/linux/init.c.o.d -o CMakeFiles/cpuinfo_internals.dir/src/arm/linux/init.c.o -c '/build/reproducible-path/cpuinfo-0.0~git20250110.8a1772a/src/arm/linux/init.c'
-[28/78] /usr/bin/cc -DCPUINFO_LOG_LEVEL=0 -DCPUINFO_LOG_TO_STDIO=1 -D_GNU_SOURCE=1 -I"/build/reproducible-path/cpuinfo-0.0~git20250110.8a1772a/include" -I"/build/reproducible-path/cpuinfo-0.0~git20250110.8a1772a/src" -g -O2 -Werror=implicit-function-declaration -ffile-prefix-map=/build/reproducible-path/cpuinfo-0.0~git20250110.8a1772a=. -fstack-protector-strong -fstack-clash-protection -Wformat -Werror=format-security -D_LARGEFILE_SOURCE -D_FILE_OFFSET_BITS=64 -D_TIME_BITS=64 -Wdate-time -D_FORTIFY_SOURCE=2 -std=c99 -MD -MT CMakeFiles/cpuinfo_internals.dir/src/arm/linux/cpuinfo.c.o -MF CMakeFiles/cpuinfo_internals.dir/src/arm/linux/cpuinfo.c.o.d -o CMakeFiles/cpuinfo_internals.dir/src/arm/linux/cpuinfo.c.o -c '/build/reproducible-path/cpuinfo-0.0~git20250110.8a1772a/src/arm/linux/cpuinfo.c'
-[29/78] /usr/bin/cc -DCPUINFO_LOG_LEVEL=0 -DCPUINFO_LOG_TO_STDIO=1 -D_GNU_SOURCE=1 -I"/build/reproducible-path/cpuinfo-0.0~git20250110.8a1772a/include" -I"/build/reproducible-path/cpuinfo-0.0~git20250110.8a1772a/src" -g -O2 -Werror=implicit-function-declaration -ffile-prefix-map=/build/reproducible-path/cpuinfo-0.0~git20250110.8a1772a=. -fstack-protector-strong -fstack-clash-protection -Wformat -Werror=format-security -D_LARGEFILE_SOURCE -D_FILE_OFFSET_BITS=64 -D_TIME_BITS=64 -Wdate-time -D_FORTIFY_SOURCE=2 -std=c99 -MD -MT CMakeFiles/cpuinfo_internals.dir/src/arm/linux/clusters.c.o -MF CMakeFiles/cpuinfo_internals.dir/src/arm/linux/clusters.c.o.d -o CMakeFiles/cpuinfo_internals.dir/src/arm/linux/clusters.c.o -c '/build/reproducible-path/cpuinfo-0.0~git20250110.8a1772a/src/arm/linux/clusters.c'
-[30/78] /usr/bin/cc -DCPUINFO_LOG_LEVEL=0 -DCPUINFO_LOG_TO_STDIO=1 -D_GNU_SOURCE=1 -I"/build/reproducible-path/cpuinfo-0.0~git20250110.8a1772a/include" -I"/build/reproducible-path/cpuinfo-0.0~git20250110.8a1772a/src" -g -O2 -Werror=implicit-function-declaration -ffile-prefix-map=/build/reproducible-path/cpuinfo-0.0~git20250110.8a1772a=. -fstack-protector-strong -fstack-clash-protection -Wformat -Werror=format-security -D_LARGEFILE_SOURCE -D_FILE_OFFSET_BITS=64 -D_TIME_BITS=64 -Wdate-time -D_FORTIFY_SOURCE=2 -std=c99 -MD -MT CMakeFiles/cpuinfo_internals.dir/src/arm/linux/chipset.c.o -MF CMakeFiles/cpuinfo_internals.dir/src/arm/linux/chipset.c.o.d -o CMakeFiles/cpuinfo_internals.dir/src/arm/linux/chipset.c.o -c '/build/reproducible-path/cpuinfo-0.0~git20250110.8a1772a/src/arm/linux/chipset.c'
-[31/78] /usr/bin/cc -DCPUINFO_LOG_LEVEL=0 -DCPUINFO_LOG_TO_STDIO=1 -D_GNU_SOURCE=1 -I"/build/reproducible-path/cpuinfo-0.0~git20250110.8a1772a/include" -I"/build/reproducible-path/cpuinfo-0.0~git20250110.8a1772a/src" -g -O2 -Werror=implicit-function-declaration -ffile-prefix-map=/build/reproducible-path/cpuinfo-0.0~git20250110.8a1772a=. -fstack-protector-strong -fstack-clash-protection -Wformat -Werror=format-security -D_LARGEFILE_SOURCE -D_FILE_OFFSET_BITS=64 -D_TIME_BITS=64 -Wdate-time -D_FORTIFY_SOURCE=2 -std=c99 -MD -MT CMakeFiles/cpuinfo_internals.dir/src/arm/linux/midr.c.o -MF CMakeFiles/cpuinfo_internals.dir/src/arm/linux/midr.c.o.d -o CMakeFiles/cpuinfo_internals.dir/src/arm/linux/midr.c.o -c '/build/reproducible-path/cpuinfo-0.0~git20250110.8a1772a/src/arm/linux/midr.c'
-[32/78] /usr/bin/cc -DCPUINFO_LOG_LEVEL=0 -DCPUINFO_LOG_TO_STDIO=1 -D_GNU_SOURCE=1 -I"/build/reproducible-path/cpuinfo-0.0~git20250110.8a1772a/include" -I"/build/reproducible-path/cpuinfo-0.0~git20250110.8a1772a/src" -g -O2 -Werror=implicit-function-declaration -ffile-prefix-map=/build/reproducible-path/cpuinfo-0.0~git20250110.8a1772a=. -fstack-protector-strong -fstack-clash-protection -Wformat -Werror=format-security -D_LARGEFILE_SOURCE -D_FILE_OFFSET_BITS=64 -D_TIME_BITS=64 -Wdate-time -D_FORTIFY_SOURCE=2 -std=c99 -MD -MT CMakeFiles/cpuinfo_internals.dir/src/arm/linux/hwcap.c.o -MF CMakeFiles/cpuinfo_internals.dir/src/arm/linux/hwcap.c.o.d -o CMakeFiles/cpuinfo_internals.dir/src/arm/linux/hwcap.c.o -c '/build/reproducible-path/cpuinfo-0.0~git20250110.8a1772a/src/arm/linux/hwcap.c'
-[33/78] /usr/bin/cc -DCPUINFO_LOG_LEVEL=0 -DCPUINFO_LOG_TO_STDIO=1 -D_GNU_SOURCE=1 -I"/build/reproducible-path/cpuinfo-0.0~git20250110.8a1772a/include" -I"/build/reproducible-path/cpuinfo-0.0~git20250110.8a1772a/src" -g -O2 -Werror=implicit-function-declaration -ffile-prefix-map=/build/reproducible-path/cpuinfo-0.0~git20250110.8a1772a=. -fstack-protector-strong -fstack-clash-protection -Wformat -Werror=format-security -D_LARGEFILE_SOURCE -D_FILE_OFFSET_BITS=64 -D_TIME_BITS=64 -Wdate-time -D_FORTIFY_SOURCE=2 -std=c99 -MD -MT CMakeFiles/cpuinfo_internals.dir/src/arm/linux/aarch32-isa.c.o -MF CMakeFiles/cpuinfo_internals.dir/src/arm/linux/aarch32-isa.c.o.d -o CMakeFiles/cpuinfo_internals.dir/src/arm/linux/aarch32-isa.c.o -c '/build/reproducible-path/cpuinfo-0.0~git20250110.8a1772a/src/arm/linux/aarch32-isa.c'
-[34/78] /usr/bin/cc -DCPUINFO_LOG_LEVEL=0 -DCPUINFO_LOG_TO_STDIO=1 -D_GNU_SOURCE=1 -I"/build/reproducible-path/cpuinfo-0.0~git20250110.8a1772a/include" -I"/build/reproducible-path/cpuinfo-0.0~git20250110.8a1772a/src" -g -O2 -Werror=implicit-function-declaration -ffile-prefix-map=/build/reproducible-path/cpuinfo-0.0~git20250110.8a1772a=. -fstack-protector-strong -fstack-clash-protection -Wformat -Werror=format-security -D_LARGEFILE_SOURCE -D_FILE_OFFSET_BITS=64 -D_TIME_BITS=64 -Wdate-time -D_FORTIFY_SOURCE=2 -std=c99 -MD -MT CMakeFiles/cpuinfo_internals.dir/src/linux/smallfile.c.o -MF CMakeFiles/cpuinfo_internals.dir/src/linux/smallfile.c.o.d -o CMakeFiles/cpuinfo_internals.dir/src/linux/smallfile.c.o -c '/build/reproducible-path/cpuinfo-0.0~git20250110.8a1772a/src/linux/smallfile.c'
-[35/78] /usr/bin/cc -DCPUINFO_LOG_LEVEL=0 -DCPUINFO_LOG_TO_STDIO=1 -D_GNU_SOURCE=1 -I"/build/reproducible-path/cpuinfo-0.0~git20250110.8a1772a/include" -I"/build/reproducible-path/cpuinfo-0.0~git20250110.8a1772a/src" -g -O2 -Werror=implicit-function-declaration -ffile-prefix-map=/build/reproducible-path/cpuinfo-0.0~git20250110.8a1772a=. -fstack-protector-strong -fstack-clash-protection -Wformat -Werror=format-security -D_LARGEFILE_SOURCE -D_FILE_OFFSET_BITS=64 -D_TIME_BITS=64 -Wdate-time -D_FORTIFY_SOURCE=2 -std=c99 -MD -MT CMakeFiles/cpuinfo_internals.dir/src/linux/multiline.c.o -MF CMakeFiles/cpuinfo_internals.dir/src/linux/multiline.c.o.d -o CMakeFiles/cpuinfo_internals.dir/src/linux/multiline.c.o -c '/build/reproducible-path/cpuinfo-0.0~git20250110.8a1772a/src/linux/multiline.c'
-[36/78] /usr/bin/cc -DCPUINFO_LOG_LEVEL=0 -DCPUINFO_LOG_TO_STDIO=1 -D_GNU_SOURCE=1 -I"/build/reproducible-path/cpuinfo-0.0~git20250110.8a1772a/include" -I"/build/reproducible-path/cpuinfo-0.0~git20250110.8a1772a/src" -g -O2 -Werror=implicit-function-declaration -ffile-prefix-map=/build/reproducible-path/cpuinfo-0.0~git20250110.8a1772a=. -fstack-protector-strong -fstack-clash-protection -Wformat -Werror=format-security -D_LARGEFILE_SOURCE -D_FILE_OFFSET_BITS=64 -D_TIME_BITS=64 -Wdate-time -D_FORTIFY_SOURCE=2 -std=c99 -MD -MT CMakeFiles/cpuinfo_internals.dir/src/linux/cpulist.c.o -MF CMakeFiles/cpuinfo_internals.dir/src/linux/cpulist.c.o.d -o CMakeFiles/cpuinfo_internals.dir/src/linux/cpulist.c.o -c '/build/reproducible-path/cpuinfo-0.0~git20250110.8a1772a/src/linux/cpulist.c'
-[37/78] /usr/bin/cc -DCPUINFO_LOG_LEVEL=0 -DCPUINFO_LOG_TO_STDIO=1 -D_GNU_SOURCE=1 -I"/build/reproducible-path/cpuinfo-0.0~git20250110.8a1772a/include" -I"/build/reproducible-path/cpuinfo-0.0~git20250110.8a1772a/src" -g -O2 -Werror=implicit-function-declaration -ffile-prefix-map=/build/reproducible-path/cpuinfo-0.0~git20250110.8a1772a=. -fstack-protector-strong -fstack-clash-protection -Wformat -Werror=format-security -D_LARGEFILE_SOURCE -D_FILE_OFFSET_BITS=64 -D_TIME_BITS=64 -Wdate-time -D_FORTIFY_SOURCE=2 -std=c99 -MD -MT CMakeFiles/cpuinfo_internals.dir/src/linux/processors.c.o -MF CMakeFiles/cpuinfo_internals.dir/src/linux/processors.c.o.d -o CMakeFiles/cpuinfo_internals.dir/src/linux/processors.c.o -c '/build/reproducible-path/cpuinfo-0.0~git20250110.8a1772a/src/linux/processors.c'
-[38/78] /usr/bin/cc -DCPUINFO_LOG_LEVEL=5 -DCPUINFO_LOG_TO_STDIO=1 -DCPUINFO_MOCK=1 -D_GNU_SOURCE=1 -I"/build/reproducible-path/cpuinfo-0.0~git20250110.8a1772a/src" -I"/build/reproducible-path/cpuinfo-0.0~git20250110.8a1772a/include" -g -O2 -Werror=implicit-function-declaration -ffile-prefix-map=/build/reproducible-path/cpuinfo-0.0~git20250110.8a1772a=. -fstack-protector-strong -fstack-clash-protection -Wformat -Werror=format-security -D_LARGEFILE_SOURCE -D_FILE_OFFSET_BITS=64 -D_TIME_BITS=64 -Wdate-time -D_FORTIFY_SOURCE=2 -std=c99 -MD -MT CMakeFiles/cpuinfo_mock.dir/src/api.c.o -MF CMakeFiles/cpuinfo_mock.dir/src/api.c.o.d -o CMakeFiles/cpuinfo_mock.dir/src/api.c.o -c '/build/reproducible-path/cpuinfo-0.0~git20250110.8a1772a/src/api.c'
-[39/78] /usr/bin/cc -DCPUINFO_LOG_LEVEL=5 -DCPUINFO_LOG_TO_STDIO=1 -DCPUINFO_MOCK=1 -D_GNU_SOURCE=1 -I"/build/reproducible-path/cpuinfo-0.0~git20250110.8a1772a/src" -I"/build/reproducible-path/cpuinfo-0.0~git20250110.8a1772a/include" -g -O2 -Werror=implicit-function-declaration -ffile-prefix-map=/build/reproducible-path/cpuinfo-0.0~git20250110.8a1772a=. -fstack-protector-strong -fstack-clash-protection -Wformat -Werror=format-security -D_LARGEFILE_SOURCE -D_FILE_OFFSET_BITS=64 -D_TIME_BITS=64 -Wdate-time -D_FORTIFY_SOURCE=2 -std=c99 -MD -MT CMakeFiles/cpuinfo_mock.dir/src/cache.c.o -MF CMakeFiles/cpuinfo_mock.dir/src/cache.c.o.d -o CMakeFiles/cpuinfo_mock.dir/src/cache.c.o -c '/build/reproducible-path/cpuinfo-0.0~git20250110.8a1772a/src/cache.c'
-[40/78] /usr/bin/cc -DCPUINFO_LOG_LEVEL=5 -DCPUINFO_LOG_TO_STDIO=1 -DCPUINFO_MOCK=1 -D_GNU_SOURCE=1 -I"/build/reproducible-path/cpuinfo-0.0~git20250110.8a1772a/src" -I"/build/reproducible-path/cpuinfo-0.0~git20250110.8a1772a/include" -g -O2 -Werror=implicit-function-declaration -ffile-prefix-map=/build/reproducible-path/cpuinfo-0.0~git20250110.8a1772a=. -fstack-protector-strong -fstack-clash-protection -Wformat -Werror=format-security -D_LARGEFILE_SOURCE -D_FILE_OFFSET_BITS=64 -D_TIME_BITS=64 -Wdate-time -D_FORTIFY_SOURCE=2 -std=c99 -MD -MT CMakeFiles/cpuinfo_mock.dir/src/init.c.o -MF CMakeFiles/cpuinfo_mock.dir/src/init.c.o.d -o CMakeFiles/cpuinfo_mock.dir/src/init.c.o -c '/build/reproducible-path/cpuinfo-0.0~git20250110.8a1772a/src/init.c'
-[41/78] /usr/bin/cc -DCPUINFO_LOG_LEVEL=5 -DCPUINFO_LOG_TO_STDIO=1 -DCPUINFO_MOCK=1 -D_GNU_SOURCE=1 -I"/build/reproducible-path/cpuinfo-0.0~git20250110.8a1772a/src" -I"/build/reproducible-path/cpuinfo-0.0~git20250110.8a1772a/include" -g -O2 -Werror=implicit-function-declaration -ffile-prefix-map=/build/reproducible-path/cpuinfo-0.0~git20250110.8a1772a=. -fstack-protector-strong -fstack-clash-protection -Wformat -Werror=format-security -D_LARGEFILE_SOURCE -D_FILE_OFFSET_BITS=64 -D_TIME_BITS=64 -Wdate-time -D_FORTIFY_SOURCE=2 -std=c99 -MD -MT CMakeFiles/cpuinfo_mock.dir/src/log.c.o -MF CMakeFiles/cpuinfo_mock.dir/src/log.c.o.d -o CMakeFiles/cpuinfo_mock.dir/src/log.c.o -c '/build/reproducible-path/cpuinfo-0.0~git20250110.8a1772a/src/log.c'
-[42/78] /usr/bin/cc -DCPUINFO_LOG_LEVEL=5 -DCPUINFO_LOG_TO_STDIO=1 -DCPUINFO_MOCK=1 -D_GNU_SOURCE=1 -I"/build/reproducible-path/cpuinfo-0.0~git20250110.8a1772a/src" -I"/build/reproducible-path/cpuinfo-0.0~git20250110.8a1772a/include" -g -O2 -Werror=implicit-function-declaration -ffile-prefix-map=/build/reproducible-path/cpuinfo-0.0~git20250110.8a1772a=. -fstack-protector-strong -fstack-clash-protection -Wformat -Werror=format-security -D_LARGEFILE_SOURCE -D_FILE_OFFSET_BITS=64 -D_TIME_BITS=64 -Wdate-time -D_FORTIFY_SOURCE=2 -std=c99 -MD -MT CMakeFiles/cpuinfo_mock.dir/src/arm/uarch.c.o -MF CMakeFiles/cpuinfo_mock.dir/src/arm/uarch.c.o.d -o CMakeFiles/cpuinfo_mock.dir/src/arm/uarch.c.o -c '/build/reproducible-path/cpuinfo-0.0~git20250110.8a1772a/src/arm/uarch.c'
-[43/78] /usr/bin/cc -DCPUINFO_LOG_LEVEL=5 -DCPUINFO_LOG_TO_STDIO=1 -DCPUINFO_MOCK=1 -D_GNU_SOURCE=1 -I"/build/reproducible-path/cpuinfo-0.0~git20250110.8a1772a/src" -I"/build/reproducible-path/cpuinfo-0.0~git20250110.8a1772a/include" -g -O2 -Werror=implicit-function-declaration -ffile-prefix-map=/build/reproducible-path/cpuinfo-0.0~git20250110.8a1772a=. -fstack-protector-strong -fstack-clash-protection -Wformat -Werror=format-security -D_LARGEFILE_SOURCE -D_FILE_OFFSET_BITS=64 -D_TIME_BITS=64 -Wdate-time -D_FORTIFY_SOURCE=2 -std=c99 -MD -MT CMakeFiles/cpuinfo_mock.dir/src/arm/cache.c.o -MF CMakeFiles/cpuinfo_mock.dir/src/arm/cache.c.o.d -o CMakeFiles/cpuinfo_mock.dir/src/arm/cache.c.o -c '/build/reproducible-path/cpuinfo-0.0~git20250110.8a1772a/src/arm/cache.c'
-[44/78] /usr/bin/cc -DCPUINFO_LOG_LEVEL=5 -DCPUINFO_LOG_TO_STDIO=1 -DCPUINFO_MOCK=1 -D_GNU_SOURCE=1 -I"/build/reproducible-path/cpuinfo-0.0~git20250110.8a1772a/src" -I"/build/reproducible-path/cpuinfo-0.0~git20250110.8a1772a/include" -g -O2 -Werror=implicit-function-declaration -ffile-prefix-map=/build/reproducible-path/cpuinfo-0.0~git20250110.8a1772a=. -fstack-protector-strong -fstack-clash-protection -Wformat -Werror=format-security -D_LARGEFILE_SOURCE -D_FILE_OFFSET_BITS=64 -D_TIME_BITS=64 -Wdate-time -D_FORTIFY_SOURCE=2 -std=c99 -MD -MT CMakeFiles/cpuinfo_mock.dir/src/arm/linux/init.c.o -MF CMakeFiles/cpuinfo_mock.dir/src/arm/linux/init.c.o.d -o CMakeFiles/cpuinfo_mock.dir/src/arm/linux/init.c.o -c '/build/reproducible-path/cpuinfo-0.0~git20250110.8a1772a/src/arm/linux/init.c'
-[45/78] /usr/bin/c++  -I/usr/src/googletest/googlemock/include -I/usr/src/googletest/googlemock -isystem /usr/src/googletest/googletest/include -isystem /usr/src/googletest/googletest -g -O2 -ffile-prefix-map=/build/reproducible-path/cpuinfo-0.0~git20250110.8a1772a=. -fstack-protector-strong -fstack-clash-protection -Wformat -Werror=format-security -D_LARGEFILE_SOURCE -D_FILE_OFFSET_BITS=64 -D_TIME_BITS=64 -Wdate-time -D_FORTIFY_SOURCE=2 -Wall -Wshadow -Wundef -Wno-error=dangling-else -DGTEST_HAS_PTHREAD=1 -fexceptions -Wextra -Wno-unused-parameter -Wno-missing-field-initializers -DGTEST_HAS_PTHREAD=1 -MD -MT deps/googletest/googlemock/CMakeFiles/gmock.dir/src/gmock-all.cc.o -MF deps/googletest/googlemock/CMakeFiles/gmock.dir/src/gmock-all.cc.o.d -o deps/googletest/googlemock/CMakeFiles/gmock.dir/src/gmock-all.cc.o -c /usr/src/googletest/googlemock/src/gmock-all.cc
-[46/78] /usr/bin/cc -DCPUINFO_LOG_LEVEL=5 -DCPUINFO_LOG_TO_STDIO=1 -DCPUINFO_MOCK=1 -D_GNU_SOURCE=1 -I"/build/reproducible-path/cpuinfo-0.0~git20250110.8a1772a/src" -I"/build/reproducible-path/cpuinfo-0.0~git20250110.8a1772a/include" -g -O2 -Werror=implicit-function-declaration -ffile-prefix-map=/build/reproducible-path/cpuinfo-0.0~git20250110.8a1772a=. -fstack-protector-strong -fstack-clash-protection -Wformat -Werror=format-security -D_LARGEFILE_SOURCE -D_FILE_OFFSET_BITS=64 -D_TIME_BITS=64 -Wdate-time -D_FORTIFY_SOURCE=2 -std=c99 -MD -MT CMakeFiles/cpuinfo_mock.dir/src/arm/linux/cpuinfo.c.o -MF CMakeFiles/cpuinfo_mock.dir/src/arm/linux/cpuinfo.c.o.d -o CMakeFiles/cpuinfo_mock.dir/src/arm/linux/cpuinfo.c.o -c '/build/reproducible-path/cpuinfo-0.0~git20250110.8a1772a/src/arm/linux/cpuinfo.c'
-[47/78] /usr/bin/cc -DCPUINFO_LOG_LEVEL=5 -DCPUINFO_LOG_TO_STDIO=1 -DCPUINFO_MOCK=1 -D_GNU_SOURCE=1 -I"/build/reproducible-path/cpuinfo-0.0~git20250110.8a1772a/src" -I"/build/reproducible-path/cpuinfo-0.0~git20250110.8a1772a/include" -g -O2 -Werror=implicit-function-declaration -ffile-prefix-map=/build/reproducible-path/cpuinfo-0.0~git20250110.8a1772a=. -fstack-protector-strong -fstack-clash-protection -Wformat -Werror=format-security -D_LARGEFILE_SOURCE -D_FILE_OFFSET_BITS=64 -D_TIME_BITS=64 -Wdate-time -D_FORTIFY_SOURCE=2 -std=c99 -MD -MT CMakeFiles/cpuinfo_mock.dir/src/arm/linux/clusters.c.o -MF CMakeFiles/cpuinfo_mock.dir/src/arm/linux/clusters.c.o.d -o CMakeFiles/cpuinfo_mock.dir/src/arm/linux/clusters.c.o -c '/build/reproducible-path/cpuinfo-0.0~git20250110.8a1772a/src/arm/linux/clusters.c'
-[48/78] /usr/bin/cc -DCPUINFO_LOG_LEVEL=5 -DCPUINFO_LOG_TO_STDIO=1 -DCPUINFO_MOCK=1 -D_GNU_SOURCE=1 -I"/build/reproducible-path/cpuinfo-0.0~git20250110.8a1772a/src" -I"/build/reproducible-path/cpuinfo-0.0~git20250110.8a1772a/include" -g -O2 -Werror=implicit-function-declaration -ffile-prefix-map=/build/reproducible-path/cpuinfo-0.0~git20250110.8a1772a=. -fstack-protector-strong -fstack-clash-protection -Wformat -Werror=format-security -D_LARGEFILE_SOURCE -D_FILE_OFFSET_BITS=64 -D_TIME_BITS=64 -Wdate-time -D_FORTIFY_SOURCE=2 -std=c99 -MD -MT CMakeFiles/cpuinfo_mock.dir/src/arm/linux/midr.c.o -MF CMakeFiles/cpuinfo_mock.dir/src/arm/linux/midr.c.o.d -o CMakeFiles/cpuinfo_mock.dir/src/arm/linux/midr.c.o -c '/build/reproducible-path/cpuinfo-0.0~git20250110.8a1772a/src/arm/linux/midr.c'
-[49/78] /usr/bin/cc -DCPUINFO_LOG_LEVEL=5 -DCPUINFO_LOG_TO_STDIO=1 -DCPUINFO_MOCK=1 -D_GNU_SOURCE=1 -I"/build/reproducible-path/cpuinfo-0.0~git20250110.8a1772a/src" -I"/build/reproducible-path/cpuinfo-0.0~git20250110.8a1772a/include" -g -O2 -Werror=implicit-function-declaration -ffile-prefix-map=/build/reproducible-path/cpuinfo-0.0~git20250110.8a1772a=. -fstack-protector-strong -fstack-clash-protection -Wformat -Werror=format-security -D_LARGEFILE_SOURCE -D_FILE_OFFSET_BITS=64 -D_TIME_BITS=64 -Wdate-time -D_FORTIFY_SOURCE=2 -std=c99 -MD -MT CMakeFiles/cpuinfo_mock.dir/src/arm/linux/hwcap.c.o -MF CMakeFiles/cpuinfo_mock.dir/src/arm/linux/hwcap.c.o.d -o CMakeFiles/cpuinfo_mock.dir/src/arm/linux/hwcap.c.o -c '/build/reproducible-path/cpuinfo-0.0~git20250110.8a1772a/src/arm/linux/hwcap.c'
-[50/78] /usr/bin/cc -DCPUINFO_LOG_LEVEL=5 -DCPUINFO_LOG_TO_STDIO=1 -DCPUINFO_MOCK=1 -D_GNU_SOURCE=1 -I"/build/reproducible-path/cpuinfo-0.0~git20250110.8a1772a/src" -I"/build/reproducible-path/cpuinfo-0.0~git20250110.8a1772a/include" -g -O2 -Werror=implicit-function-declaration -ffile-prefix-map=/build/reproducible-path/cpuinfo-0.0~git20250110.8a1772a=. -fstack-protector-strong -fstack-clash-protection -Wformat -Werror=format-security -D_LARGEFILE_SOURCE -D_FILE_OFFSET_BITS=64 -D_TIME_BITS=64 -Wdate-time -D_FORTIFY_SOURCE=2 -std=c99 -MD -MT CMakeFiles/cpuinfo_mock.dir/src/arm/linux/chipset.c.o -MF CMakeFiles/cpuinfo_mock.dir/src/arm/linux/chipset.c.o.d -o CMakeFiles/cpuinfo_mock.dir/src/arm/linux/chipset.c.o -c '/build/reproducible-path/cpuinfo-0.0~git20250110.8a1772a/src/arm/linux/chipset.c'
-[51/78] /usr/bin/cc -DCPUINFO_LOG_LEVEL=5 -DCPUINFO_LOG_TO_STDIO=1 -DCPUINFO_MOCK=1 -D_GNU_SOURCE=1 -I"/build/reproducible-path/cpuinfo-0.0~git20250110.8a1772a/src" -I"/build/reproducible-path/cpuinfo-0.0~git20250110.8a1772a/include" -g -O2 -Werror=implicit-function-declaration -ffile-prefix-map=/build/reproducible-path/cpuinfo-0.0~git20250110.8a1772a=. -fstack-protector-strong -fstack-clash-protection -Wformat -Werror=format-security -D_LARGEFILE_SOURCE -D_FILE_OFFSET_BITS=64 -D_TIME_BITS=64 -Wdate-time -D_FORTIFY_SOURCE=2 -std=c99 -MD -MT CMakeFiles/cpuinfo_mock.dir/src/linux/smallfile.c.o -MF CMakeFiles/cpuinfo_mock.dir/src/linux/smallfile.c.o.d -o CMakeFiles/cpuinfo_mock.dir/src/linux/smallfile.c.o -c '/build/reproducible-path/cpuinfo-0.0~git20250110.8a1772a/src/linux/smallfile.c'
-[52/78] /usr/bin/cc -DCPUINFO_LOG_LEVEL=5 -DCPUINFO_LOG_TO_STDIO=1 -DCPUINFO_MOCK=1 -D_GNU_SOURCE=1 -I"/build/reproducible-path/cpuinfo-0.0~git20250110.8a1772a/src" -I"/build/reproducible-path/cpuinfo-0.0~git20250110.8a1772a/include" -g -O2 -Werror=implicit-function-declaration -ffile-prefix-map=/build/reproducible-path/cpuinfo-0.0~git20250110.8a1772a=. -fstack-protector-strong -fstack-clash-protection -Wformat -Werror=format-security -D_LARGEFILE_SOURCE -D_FILE_OFFSET_BITS=64 -D_TIME_BITS=64 -Wdate-time -D_FORTIFY_SOURCE=2 -std=c99 -MD -MT CMakeFiles/cpuinfo_mock.dir/src/arm/linux/aarch32-isa.c.o -MF CMakeFiles/cpuinfo_mock.dir/src/arm/linux/aarch32-isa.c.o.d -o CMakeFiles/cpuinfo_mock.dir/src/arm/linux/aarch32-isa.c.o -c '/build/reproducible-path/cpuinfo-0.0~git20250110.8a1772a/src/arm/linux/aarch32-isa.c'
-[53/78] /usr/bin/cc -DCPUINFO_LOG_LEVEL=5 -DCPUINFO_LOG_TO_STDIO=1 -DCPUINFO_MOCK=1 -D_GNU_SOURCE=1 -I"/build/reproducible-path/cpuinfo-0.0~git20250110.8a1772a/src" -I"/build/reproducible-path/cpuinfo-0.0~git20250110.8a1772a/include" -g -O2 -Werror=implicit-function-declaration -ffile-prefix-map=/build/reproducible-path/cpuinfo-0.0~git20250110.8a1772a=. -fstack-protector-strong -fstack-clash-protection -Wformat -Werror=format-security -D_LARGEFILE_SOURCE -D_FILE_OFFSET_BITS=64 -D_TIME_BITS=64 -Wdate-time -D_FORTIFY_SOURCE=2 -std=c99 -MD -MT CMakeFiles/cpuinfo_mock.dir/src/linux/multiline.c.o -MF CMakeFiles/cpuinfo_mock.dir/src/linux/multiline.c.o.d -o CMakeFiles/cpuinfo_mock.dir/src/linux/multiline.c.o -c '/build/reproducible-path/cpuinfo-0.0~git20250110.8a1772a/src/linux/multiline.c'
-[54/78] /usr/bin/cc -DCPUINFO_LOG_LEVEL=5 -DCPUINFO_LOG_TO_STDIO=1 -DCPUINFO_MOCK=1 -D_GNU_SOURCE=1 -I"/build/reproducible-path/cpuinfo-0.0~git20250110.8a1772a/src" -I"/build/reproducible-path/cpuinfo-0.0~git20250110.8a1772a/include" -g -O2 -Werror=implicit-function-declaration -ffile-prefix-map=/build/reproducible-path/cpuinfo-0.0~git20250110.8a1772a=. -fstack-protector-strong -fstack-clash-protection -Wformat -Werror=format-security -D_LARGEFILE_SOURCE -D_FILE_OFFSET_BITS=64 -D_TIME_BITS=64 -Wdate-time -D_FORTIFY_SOURCE=2 -std=c99 -MD -MT CMakeFiles/cpuinfo_mock.dir/src/linux/cpulist.c.o -MF CMakeFiles/cpuinfo_mock.dir/src/linux/cpulist.c.o.d -o CMakeFiles/cpuinfo_mock.dir/src/linux/cpulist.c.o -c '/build/reproducible-path/cpuinfo-0.0~git20250110.8a1772a/src/linux/cpulist.c'
-[55/78] /usr/bin/cc -DCPUINFO_LOG_LEVEL=5 -DCPUINFO_LOG_TO_STDIO=1 -DCPUINFO_MOCK=1 -D_GNU_SOURCE=1 -I"/build/reproducible-path/cpuinfo-0.0~git20250110.8a1772a/src" -I"/build/reproducible-path/cpuinfo-0.0~git20250110.8a1772a/include" -g -O2 -Werror=implicit-function-declaration -ffile-prefix-map=/build/reproducible-path/cpuinfo-0.0~git20250110.8a1772a=. -fstack-protector-strong -fstack-clash-protection -Wformat -Werror=format-security -D_LARGEFILE_SOURCE -D_FILE_OFFSET_BITS=64 -D_TIME_BITS=64 -Wdate-time -D_FORTIFY_SOURCE=2 -std=c99 -MD -MT CMakeFiles/cpuinfo_mock.dir/src/linux/mockfile.c.o -MF CMakeFiles/cpuinfo_mock.dir/src/linux/mockfile.c.o.d -o CMakeFiles/cpuinfo_mock.dir/src/linux/mockfile.c.o -c '/build/reproducible-path/cpuinfo-0.0~git20250110.8a1772a/src/linux/mockfile.c'
-[56/78] /usr/bin/cc -DCPUINFO_LOG_LEVEL=5 -DCPUINFO_LOG_TO_STDIO=1 -DCPUINFO_MOCK=1 -D_GNU_SOURCE=1 -I"/build/reproducible-path/cpuinfo-0.0~git20250110.8a1772a/src" -I"/build/reproducible-path/cpuinfo-0.0~git20250110.8a1772a/include" -g -O2 -Werror=implicit-function-declaration -ffile-prefix-map=/build/reproducible-path/cpuinfo-0.0~git20250110.8a1772a=. -fstack-protector-strong -fstack-clash-protection -Wformat -Werror=format-security -D_LARGEFILE_SOURCE -D_FILE_OFFSET_BITS=64 -D_TIME_BITS=64 -Wdate-time -D_FORTIFY_SOURCE=2 -std=c99 -MD -MT CMakeFiles/cpuinfo_mock.dir/src/linux/processors.c.o -MF CMakeFiles/cpuinfo_mock.dir/src/linux/processors.c.o.d -o CMakeFiles/cpuinfo_mock.dir/src/linux/processors.c.o -c '/build/reproducible-path/cpuinfo-0.0~git20250110.8a1772a/src/linux/processors.c'
-[57/78] /usr/bin/c++ -DCPUINFO_SUPPORTED_PLATFORM=1 -I"/build/reproducible-path/cpuinfo-0.0~git20250110.8a1772a/include" -isystem /usr/src/googletest/googletest/include -isystem /usr/src/googletest/googletest -g -O2 -ffile-prefix-map=/build/reproducible-path/cpuinfo-0.0~git20250110.8a1772a=. -fstack-protector-strong -fstack-clash-protection -Wformat -Werror=format-security -D_LARGEFILE_SOURCE -D_FILE_OFFSET_BITS=64 -D_TIME_BITS=64 -Wdate-time -D_FORTIFY_SOURCE=2 -std=c++14 -DGTEST_HAS_PTHREAD=1 -MD -MT CMakeFiles/get-current-test.dir/test/get-current.cc.o -MF CMakeFiles/get-current-test.dir/test/get-current.cc.o.d -o CMakeFiles/get-current-test.dir/test/get-current.cc.o -c '/build/reproducible-path/cpuinfo-0.0~git20250110.8a1772a/test/get-current.cc'
-[58/78] /usr/bin/cc -DCPUINFO_SUPPORTED_PLATFORM=1 -I"/build/reproducible-path/cpuinfo-0.0~git20250110.8a1772a/include" -g -O2 -Werror=implicit-function-declaration -ffile-prefix-map=/build/reproducible-path/cpuinfo-0.0~git20250110.8a1772a=. -fstack-protector-strong -fstack-clash-protection -Wformat -Werror=format-security -D_LARGEFILE_SOURCE -D_FILE_OFFSET_BITS=64 -D_TIME_BITS=64 -Wdate-time -D_FORTIFY_SOURCE=2 -std=c99 -MD -MT CMakeFiles/isa-info.dir/tools/isa-info.c.o -MF CMakeFiles/isa-info.dir/tools/isa-info.c.o.d -o CMakeFiles/isa-info.dir/tools/isa-info.c.o -c '/build/reproducible-path/cpuinfo-0.0~git20250110.8a1772a/tools/isa-info.c'
-[59/78] /usr/bin/cc -DCPUINFO_SUPPORTED_PLATFORM=1 -I"/build/reproducible-path/cpuinfo-0.0~git20250110.8a1772a/include" -g -O2 -Werror=implicit-function-declaration -ffile-prefix-map=/build/reproducible-path/cpuinfo-0.0~git20250110.8a1772a=. -fstack-protector-strong -fstack-clash-protection -Wformat -Werror=format-security -D_LARGEFILE_SOURCE -D_FILE_OFFSET_BITS=64 -D_TIME_BITS=64 -Wdate-time -D_FORTIFY_SOURCE=2 -std=c99 -MD -MT CMakeFiles/cpu-info.dir/tools/cpu-info.c.o -MF CMakeFiles/cpu-info.dir/tools/cpu-info.c.o.d -o CMakeFiles/cpu-info.dir/tools/cpu-info.c.o -c '/build/reproducible-path/cpuinfo-0.0~git20250110.8a1772a/tools/cpu-info.c'
-[60/78] /usr/bin/cc -DCPUINFO_SUPPORTED_PLATFORM=1 -I"/build/reproducible-path/cpuinfo-0.0~git20250110.8a1772a/include" -g -O2 -Werror=implicit-function-declaration -ffile-prefix-map=/build/reproducible-path/cpuinfo-0.0~git20250110.8a1772a=. -fstack-protector-strong -fstack-clash-protection -Wformat -Werror=format-security -D_LARGEFILE_SOURCE -D_FILE_OFFSET_BITS=64 -D_TIME_BITS=64 -Wdate-time -D_FORTIFY_SOURCE=2 -std=c99 -MD -MT CMakeFiles/cache-info.dir/tools/cache-info.c.o -MF CMakeFiles/cache-info.dir/tools/cache-info.c.o.d -o CMakeFiles/cache-info.dir/tools/cache-info.c.o -c '/build/reproducible-path/cpuinfo-0.0~git20250110.8a1772a/tools/cache-info.c'
-[61/78] /usr/bin/cc -DCPUINFO_SUPPORTED_PLATFORM=1 -I"/build/reproducible-path/cpuinfo-0.0~git20250110.8a1772a/include" -g -O2 -Werror=implicit-function-declaration -ffile-prefix-map=/build/reproducible-path/cpuinfo-0.0~git20250110.8a1772a=. -fstack-protector-strong -fstack-clash-protection -Wformat -Werror=format-security -D_LARGEFILE_SOURCE -D_FILE_OFFSET_BITS=64 -D_TIME_BITS=64 -Wdate-time -D_FORTIFY_SOURCE=2 -std=c99 -MD -MT CMakeFiles/auxv-dump.dir/tools/auxv-dump.c.o -MF CMakeFiles/auxv-dump.dir/tools/auxv-dump.c.o.d -o CMakeFiles/auxv-dump.dir/tools/auxv-dump.c.o -c '/build/reproducible-path/cpuinfo-0.0~git20250110.8a1772a/tools/auxv-dump.c'
-[62/78] /usr/bin/cc   -g -O2 -Werror=implicit-function-declaration -ffile-prefix-map=/build/reproducible-path/cpuinfo-0.0~git20250110.8a1772a=. -fstack-protector-strong -fstack-clash-protection -Wformat -Werror=format-security -D_LARGEFILE_SOURCE -D_FILE_OFFSET_BITS=64 -D_TIME_BITS=64 -Wdate-time -D_FORTIFY_SOURCE=2 -std=c99 -MD -MT CMakeFiles/cpuinfo-dump.dir/tools/cpuinfo-dump.c.o -MF CMakeFiles/cpuinfo-dump.dir/tools/cpuinfo-dump.c.o.d -o CMakeFiles/cpuinfo-dump.dir/tools/cpuinfo-dump.c.o -c '/build/reproducible-path/cpuinfo-0.0~git20250110.8a1772a/tools/cpuinfo-dump.c'
-[63/78] /usr/bin/c++  -isystem /usr/src/googletest/googlemock/include -isystem /usr/src/googletest/googlemock -isystem /usr/src/googletest/googletest/include -isystem /usr/src/googletest/googletest -g -O2 -ffile-prefix-map=/build/reproducible-path/cpuinfo-0.0~git20250110.8a1772a=. -fstack-protector-strong -fstack-clash-protection -Wformat -Werror=format-security -D_LARGEFILE_SOURCE -D_FILE_OFFSET_BITS=64 -D_TIME_BITS=64 -Wdate-time -D_FORTIFY_SOURCE=2 -Wall -Wshadow -Wundef -Wno-error=dangling-else -DGTEST_HAS_PTHREAD=1 -fexceptions -Wextra -Wno-unused-parameter -Wno-missing-field-initializers -DGTEST_HAS_PTHREAD=1 -MD -MT deps/googletest/googlemock/CMakeFiles/gmock_main.dir/src/gmock_main.cc.o -MF deps/googletest/googlemock/CMakeFiles/gmock_main.dir/src/gmock_main.cc.o.d -o deps/googletest/googlemock/CMakeFiles/gmock_main.dir/src/gmock_main.cc.o -c /usr/src/googletest/googlemock/src/gmock_main.cc
-[64/78] : && /usr/bin/cmake -E rm -f libcpuinfo_internals.a && /usr/bin/ar qc libcpuinfo_internals.a  CMakeFiles/cpuinfo_internals.dir/src/api.c.o CMakeFiles/cpuinfo_internals.dir/src/cache.c.o CMakeFiles/cpuinfo_internals.dir/src/init.c.o CMakeFiles/cpuinfo_internals.dir/src/log.c.o CMakeFiles/cpuinfo_internals.dir/src/arm/uarch.c.o CMakeFiles/cpuinfo_internals.dir/src/arm/cache.c.o CMakeFiles/cpuinfo_internals.dir/src/arm/linux/init.c.o CMakeFiles/cpuinfo_internals.dir/src/arm/linux/cpuinfo.c.o CMakeFiles/cpuinfo_internals.dir/src/arm/linux/clusters.c.o CMakeFiles/cpuinfo_internals.dir/src/arm/linux/chipset.c.o CMakeFiles/cpuinfo_internals.dir/src/arm/linux/midr.c.o CMakeFiles/cpuinfo_internals.dir/src/arm/linux/hwcap.c.o CMakeFiles/cpuinfo_internals.dir/src/arm/linux/aarch32-isa.c.o CMakeFiles/cpuinfo_internals.dir/src/linux/smallfile.c.o CMakeFiles/cpuinfo_internals.dir/src/linux/multiline.c.o CMakeFiles/cpuinfo_internals.dir/src/linux/cpulist.c.o CMakeFiles/cpuinfo_internals.dir/src/linux/processors.c.o && /usr/bin/ranlib libcpuinfo_internals.a && :
-[65/78] : && /usr/bin/cmake -E rm -f libcpuinfo_mock.a && /usr/bin/ar qc libcpuinfo_mock.a  CMakeFiles/cpuinfo_mock.dir/src/api.c.o CMakeFiles/cpuinfo_mock.dir/src/cache.c.o CMakeFiles/cpuinfo_mock.dir/src/init.c.o CMakeFiles/cpuinfo_mock.dir/src/log.c.o CMakeFiles/cpuinfo_mock.dir/src/arm/uarch.c.o CMakeFiles/cpuinfo_mock.dir/src/arm/cache.c.o CMakeFiles/cpuinfo_mock.dir/src/arm/linux/init.c.o CMakeFiles/cpuinfo_mock.dir/src/arm/linux/cpuinfo.c.o CMakeFiles/cpuinfo_mock.dir/src/arm/linux/clusters.c.o CMakeFiles/cpuinfo_mock.dir/src/arm/linux/chipset.c.o CMakeFiles/cpuinfo_mock.dir/src/arm/linux/midr.c.o CMakeFiles/cpuinfo_mock.dir/src/arm/linux/hwcap.c.o CMakeFiles/cpuinfo_mock.dir/src/arm/linux/aarch32-isa.c.o CMakeFiles/cpuinfo_mock.dir/src/linux/smallfile.c.o CMakeFiles/cpuinfo_mock.dir/src/linux/multiline.c.o CMakeFiles/cpuinfo_mock.dir/src/linux/cpulist.c.o CMakeFiles/cpuinfo_mock.dir/src/linux/processors.c.o CMakeFiles/cpuinfo_mock.dir/src/linux/mockfile.c.o && /usr/bin/ranlib libcpuinfo_mock.a && :
-[66/78] : && /usr/bin/cc -g -O2 -Werror=implicit-function-declaration -ffile-prefix-map=/build/reproducible-path/cpuinfo-0.0~git20250110.8a1772a=. -fstack-protector-strong -fstack-clash-protection -Wformat -Werror=format-security -D_LARGEFILE_SOURCE -D_FILE_OFFSET_BITS=64 -D_TIME_BITS=64 -Wdate-time -D_FORTIFY_SOURCE=2 -Wl,-z,relro -Wl,-z,now    -Wl,--dependency-file=CMakeFiles/isa-info.dir/link.d CMakeFiles/isa-info.dir/tools/isa-info.c.o -o isa-info  libcpuinfo.so.0 && :
-[67/78] : && /usr/bin/cc -g -O2 -Werror=implicit-function-declaration -ffile-prefix-map=/build/reproducible-path/cpuinfo-0.0~git20250110.8a1772a=. -fstack-protector-strong -fstack-clash-protection -Wformat -Werror=format-security -D_LARGEFILE_SOURCE -D_FILE_OFFSET_BITS=64 -D_TIME_BITS=64 -Wdate-time -D_FORTIFY_SOURCE=2 -Wl,-z,relro -Wl,-z,now    -Wl,--dependency-file=CMakeFiles/cpu-info.dir/link.d CMakeFiles/cpu-info.dir/tools/cpu-info.c.o -o cpu-info  libcpuinfo.so.0 && :
-[68/78] : && /usr/bin/cc -g -O2 -Werror=implicit-function-declaration -ffile-prefix-map=/build/reproducible-path/cpuinfo-0.0~git20250110.8a1772a=. -fstack-protector-strong -fstack-clash-protection -Wformat -Werror=format-security -D_LARGEFILE_SOURCE -D_FILE_OFFSET_BITS=64 -D_TIME_BITS=64 -Wdate-time -D_FORTIFY_SOURCE=2 -Wl,-z,relro -Wl,-z,now    -Wl,--dependency-file=CMakeFiles/cache-info.dir/link.d CMakeFiles/cache-info.dir/tools/cache-info.c.o -o cache-info  libcpuinfo.so.0 && :
-[69/78] : && /usr/bin/cc -g -O2 -Werror=implicit-function-declaration -ffile-prefix-map=/build/reproducible-path/cpuinfo-0.0~git20250110.8a1772a=. -fstack-protector-strong -fstack-clash-protection -Wformat -Werror=format-security -D_LARGEFILE_SOURCE -D_FILE_OFFSET_BITS=64 -D_TIME_BITS=64 -Wdate-time -D_FORTIFY_SOURCE=2 -Wl,-z,relro -Wl,-z,now    -Wl,--dependency-file=CMakeFiles/auxv-dump.dir/link.d CMakeFiles/auxv-dump.dir/tools/auxv-dump.c.o -o auxv-dump  -ldl  libcpuinfo.so.0 && :
-[70/78] : && /usr/bin/cc -g -O2 -Werror=implicit-function-declaration -ffile-prefix-map=/build/reproducible-path/cpuinfo-0.0~git20250110.8a1772a=. -fstack-protector-strong -fstack-clash-protection -Wformat -Werror=format-security -D_LARGEFILE_SOURCE -D_FILE_OFFSET_BITS=64 -D_TIME_BITS=64 -Wdate-time -D_FORTIFY_SOURCE=2 -Wl,-z,relro -Wl,-z,now    -Wl,--dependency-file=CMakeFiles/cpuinfo-dump.dir/link.d CMakeFiles/cpuinfo-dump.dir/tools/cpuinfo-dump.c.o -o cpuinfo-dump   && :
-[71/78] /usr/bin/c++  -I/usr/src/googletest/googletest/include -I/usr/src/googletest/googletest -g -O2 -ffile-prefix-map=/build/reproducible-path/cpuinfo-0.0~git20250110.8a1772a=. -fstack-protector-strong -fstack-clash-protection -Wformat -Werror=format-security -D_LARGEFILE_SOURCE -D_FILE_OFFSET_BITS=64 -D_TIME_BITS=64 -Wdate-time -D_FORTIFY_SOURCE=2 -Wall -Wshadow -Wundef -Wno-error=dangling-else -DGTEST_HAS_PTHREAD=1 -fexceptions -Wextra -Wno-unused-parameter -Wno-missing-field-initializers -MD -MT deps/googletest/googletest/CMakeFiles/gtest.dir/src/gtest-all.cc.o -MF deps/googletest/googletest/CMakeFiles/gtest.dir/src/gtest-all.cc.o.d -o deps/googletest/googletest/CMakeFiles/gtest.dir/src/gtest-all.cc.o -c /usr/src/googletest/googletest/src/gtest-all.cc
-[72/78] : && /usr/bin/cmake -E rm -f lib/libgtest.a && /usr/bin/ar qc lib/libgtest.a  deps/googletest/googletest/CMakeFiles/gtest.dir/src/gtest-all.cc.o && /usr/bin/ranlib lib/libgtest.a && :
-[73/78] : && /usr/bin/cmake -E rm -f lib/libgtest_main.a && /usr/bin/ar qc lib/libgtest_main.a  deps/googletest/googletest/CMakeFiles/gtest_main.dir/src/gtest_main.cc.o && /usr/bin/ranlib lib/libgtest_main.a && :
-[74/78] : && /usr/bin/cmake -E rm -f lib/libgmock.a && /usr/bin/ar qc lib/libgmock.a  deps/googletest/googlemock/CMakeFiles/gmock.dir/src/gmock-all.cc.o && /usr/bin/ranlib lib/libgmock.a && :
-[75/78] : && /usr/bin/cmake -E rm -f lib/libgmock_main.a && /usr/bin/ar qc lib/libgmock_main.a  deps/googletest/googlemock/CMakeFiles/gmock_main.dir/src/gmock_main.cc.o && /usr/bin/ranlib lib/libgmock_main.a && :
-[76/78] : && /usr/bin/c++ -g -O2 -ffile-prefix-map=/build/reproducible-path/cpuinfo-0.0~git20250110.8a1772a=. -fstack-protector-strong -fstack-clash-protection -Wformat -Werror=format-security -D_LARGEFILE_SOURCE -D_FILE_OFFSET_BITS=64 -D_TIME_BITS=64 -Wdate-time -D_FORTIFY_SOURCE=2 -Wl,-z,relro -Wl,-z,now    -Wl,--dependency-file=CMakeFiles/get-current-test.dir/link.d CMakeFiles/get-current-test.dir/test/get-current.cc.o -o get-current-test  libcpuinfo.so.0  lib/libgtest.a  lib/libgtest_main.a  lib/libgtest.a && :
-[77/78] /usr/bin/c++ -DCPUINFO_SUPPORTED_PLATFORM=1 -I"/build/reproducible-path/cpuinfo-0.0~git20250110.8a1772a/include" -isystem /usr/src/googletest/googletest/include -isystem /usr/src/googletest/googletest -g -O2 -ffile-prefix-map=/build/reproducible-path/cpuinfo-0.0~git20250110.8a1772a=. -fstack-protector-strong -fstack-clash-protection -Wformat -Werror=format-security -D_LARGEFILE_SOURCE -D_FILE_OFFSET_BITS=64 -D_TIME_BITS=64 -Wdate-time -D_FORTIFY_SOURCE=2 -std=c++14 -DGTEST_HAS_PTHREAD=1 -MD -MT CMakeFiles/init-test.dir/test/init.cc.o -MF CMakeFiles/init-test.dir/test/init.cc.o.d -o CMakeFiles/init-test.dir/test/init.cc.o -c '/build/reproducible-path/cpuinfo-0.0~git20250110.8a1772a/test/init.cc'
-[78/78] : && /usr/bin/c++ -g -O2 -ffile-prefix-map=/build/reproducible-path/cpuinfo-0.0~git20250110.8a1772a=. -fstack-protector-strong -fstack-clash-protection -Wformat -Werror=format-security -D_LARGEFILE_SOURCE -D_FILE_OFFSET_BITS=64 -D_TIME_BITS=64 -Wdate-time -D_FORTIFY_SOURCE=2 -Wl,-z,relro -Wl,-z,now    -Wl,--dependency-file=CMakeFiles/init-test.dir/link.d CMakeFiles/init-test.dir/test/init.cc.o -o init-test  libcpuinfo.so.0  lib/libgtest.a  lib/libgtest_main.a  lib/libgtest.a && :
-   debian/rules override_dh_auto_test
-make[1]: Entering directory '/build/reproducible-path/cpuinfo-0.0~git20250110.8a1772a'
-if [ -r /proc/cpuinfo ]; then cat /proc/cpuinfo ; else false; fi
-processor	: 0
-model name	: ARMv7 Processor rev 3 (v7l)
-BogoMIPS	: 50.00
-Features	: half thumb fastmult vfp edsp neon vfpv3 tls vfpv4 idiva idivt vfpd32 lpae evtstrm aes pmull sha1 sha2 crc32 
-CPU implementer	: 0x41
-CPU architecture: 7
-CPU variant	: 0x0
-CPU part	: 0xd08
-CPU revision	: 3
-
-processor	: 1
-model name	: ARMv7 Processor rev 3 (v7l)
-BogoMIPS	: 50.00
-Features	: half thumb fastmult vfp edsp neon vfpv3 tls vfpv4 idiva idivt vfpd32 lpae evtstrm aes pmull sha1 sha2 crc32 
-CPU implementer	: 0x41
-CPU architecture: 7
-CPU variant	: 0x0
-CPU part	: 0xd08
-CPU revision	: 3
-
-processor	: 2
-model name	: ARMv7 Processor rev 3 (v7l)
-BogoMIPS	: 50.00
-Features	: half thumb fastmult vfp edsp neon vfpv3 tls vfpv4 idiva idivt vfpd32 lpae evtstrm aes pmull sha1 sha2 crc32 
-CPU implementer	: 0x41
-CPU architecture: 7
-CPU variant	: 0x0
-CPU part	: 0xd08
-CPU revision	: 3
-
-processor	: 3
-model name	: ARMv7 Processor rev 3 (v7l)
-BogoMIPS	: 50.00
-Features	: half thumb fastmult vfp edsp neon vfpv3 tls vfpv4 idiva idivt vfpd32 lpae evtstrm aes pmull sha1 sha2 crc32 
-CPU implementer	: 0x41
-CPU architecture: 7
-CPU variant	: 0x0
-CPU part	: 0xd08
-CPU revision	: 3
-
-Hardware	: Generic DT based system
-Revision	: 0000
-Serial		: 0000000000000000
-if [ -x ./obj-arm-linux-gnueabihf/cpuid-dump ]; then ./obj-arm-linux-gnueabihf/cpuid-dump; fi
-LD_LIBRARY_PATH=/build/reproducible-path/cpuinfo-0.0~git20250110.8a1772a/obj-arm-linux-gnueabihf dh_auto_test
-	cd obj-arm-linux-gnueabihf && LC_ALL=C.UTF-8 MESON_TESTTHREADS=3 ninja test
-[0/1] Running tests...
-Test project /build/reproducible-path/cpuinfo-0.0~git20250110.8a1772a/obj-arm-linux-gnueabihf
-    Start 1: init-test
-1/2 Test #1: init-test ........................   Passed    0.01 sec
-    Start 2: get-current-test
-2/2 Test #2: get-current-test .................   Passed    0.01 sec
-
-100% tests passed, 0 tests failed out of 2
-
-Total Test time (real) =   0.03 sec
-make[1]: Leaving directory '/build/reproducible-path/cpuinfo-0.0~git20250110.8a1772a'
-   create-stamp debian/debhelper-build-stamp
-   dh_prep -O-Scmake\+ninja
-   dh_auto_install -O-Scmake\+ninja
-	cd obj-arm-linux-gnueabihf && DESTDIR=/build/reproducible-path/cpuinfo-0.0\~git20250110.8a1772a/debian/tmp LC_ALL=C.UTF-8 ninja install
-[0/1] Install the project...
--- Install configuration: "None"
--- Installing: /build/reproducible-path/cpuinfo-0.0~git20250110.8a1772a/debian/tmp/usr/lib/arm-linux-gnueabihf/cmake/cpuinfo/cpuinfo-config.cmake
--- Installing: /build/reproducible-path/cpuinfo-0.0~git20250110.8a1772a/debian/tmp/usr/lib/arm-linux-gnueabihf/libcpuinfo.so.0
--- Installing: /build/reproducible-path/cpuinfo-0.0~git20250110.8a1772a/debian/tmp/usr/lib/arm-linux-gnueabihf/libcpuinfo.so
--- Installing: /build/reproducible-path/cpuinfo-0.0~git20250110.8a1772a/debian/tmp/usr/include/cpuinfo.h
--- Installing: /build/reproducible-path/cpuinfo-0.0~git20250110.8a1772a/debian/tmp/usr/lib/arm-linux-gnueabihf/cmake/cpuinfo/cpuinfo-targets.cmake
--- Installing: /build/reproducible-path/cpuinfo-0.0~git20250110.8a1772a/debian/tmp/usr/lib/arm-linux-gnueabihf/cmake/cpuinfo/cpuinfo-targets-none.cmake
--- Installing: /build/reproducible-path/cpuinfo-0.0~git20250110.8a1772a/debian/tmp/usr/bin/isa-info
--- Installing: /build/reproducible-path/cpuinfo-0.0~git20250110.8a1772a/debian/tmp/usr/bin/cpu-info
--- Installing: /build/reproducible-path/cpuinfo-0.0~git20250110.8a1772a/debian/tmp/usr/bin/cache-info
--- Installing: /build/reproducible-path/cpuinfo-0.0~git20250110.8a1772a/debian/tmp/usr/lib/arm-linux-gnueabihf/pkgconfig/libcpuinfo.pc
--- Up-to-date: /build/reproducible-path/cpuinfo-0.0~git20250110.8a1772a/debian/tmp/usr/include
--- Installing: /build/reproducible-path/cpuinfo-0.0~git20250110.8a1772a/debian/tmp/usr/include/gmock
--- Installing: /build/reproducible-path/cpuinfo-0.0~git20250110.8a1772a/debian/tmp/usr/include/gmock/gmock-actions.h
--- Installing: /build/reproducible-path/cpuinfo-0.0~git20250110.8a1772a/debian/tmp/usr/include/gmock/gmock-nice-strict.h
--- Installing: /build/reproducible-path/cpuinfo-0.0~git20250110.8a1772a/debian/tmp/usr/include/gmock/gmock-spec-builders.h
--- Installing: /build/reproducible-path/cpuinfo-0.0~git20250110.8a1772a/debian/tmp/usr/include/gmock/gmock-more-matchers.h
--- Installing: /build/reproducible-path/cpuinfo-0.0~git20250110.8a1772a/debian/tmp/usr/include/gmock/gmock-matchers.h
--- Installing: /build/reproducible-path/cpuinfo-0.0~git20250110.8a1772a/debian/tmp/usr/include/gmock/gmock-cardinalities.h
--- Installing: /build/reproducible-path/cpuinfo-0.0~git20250110.8a1772a/debian/tmp/usr/include/gmock/gmock.h
--- Installing: /build/reproducible-path/cpuinfo-0.0~git20250110.8a1772a/debian/tmp/usr/include/gmock/internal
--- Installing: /build/reproducible-path/cpuinfo-0.0~git20250110.8a1772a/debian/tmp/usr/include/gmock/internal/gmock-port.h
--- Installing: /build/reproducible-path/cpuinfo-0.0~git20250110.8a1772a/debian/tmp/usr/include/gmock/internal/gmock-pp.h
--- Installing: /build/reproducible-path/cpuinfo-0.0~git20250110.8a1772a/debian/tmp/usr/include/gmock/internal/gmock-internal-utils.h
--- Installing: /build/reproducible-path/cpuinfo-0.0~git20250110.8a1772a/debian/tmp/usr/include/gmock/internal/custom
--- Installing: /build/reproducible-path/cpuinfo-0.0~git20250110.8a1772a/debian/tmp/usr/include/gmock/internal/custom/gmock-generated-actions.h
--- Installing: /build/reproducible-path/cpuinfo-0.0~git20250110.8a1772a/debian/tmp/usr/include/gmock/internal/custom/gmock-port.h
--- Installing: /build/reproducible-path/cpuinfo-0.0~git20250110.8a1772a/debian/tmp/usr/include/gmock/internal/custom/gmock-matchers.h
--- Installing: /build/reproducible-path/cpuinfo-0.0~git20250110.8a1772a/debian/tmp/usr/include/gmock/internal/custom/README.md
--- Installing: /build/reproducible-path/cpuinfo-0.0~git20250110.8a1772a/debian/tmp/usr/include/gmock/gmock-function-mocker.h
--- Installing: /build/reproducible-path/cpuinfo-0.0~git20250110.8a1772a/debian/tmp/usr/include/gmock/gmock-more-actions.h
--- Installing: /build/reproducible-path/cpuinfo-0.0~git20250110.8a1772a/debian/tmp/usr/lib/arm-linux-gnueabihf/libgmock.a
--- Installing: /build/reproducible-path/cpuinfo-0.0~git20250110.8a1772a/debian/tmp/usr/lib/arm-linux-gnueabihf/libgmock_main.a
--- Installing: /build/reproducible-path/cpuinfo-0.0~git20250110.8a1772a/debian/tmp/usr/lib/arm-linux-gnueabihf/pkgconfig/gmock.pc
--- Installing: /build/reproducible-path/cpuinfo-0.0~git20250110.8a1772a/debian/tmp/usr/lib/arm-linux-gnueabihf/pkgconfig/gmock_main.pc
--- Installing: /build/reproducible-path/cpuinfo-0.0~git20250110.8a1772a/debian/tmp/usr/lib/arm-linux-gnueabihf/cmake/GTest/GMockTargets.cmake
--- Installing: /build/reproducible-path/cpuinfo-0.0~git20250110.8a1772a/debian/tmp/usr/lib/arm-linux-gnueabihf/cmake/GTest/GMockTargets-none.cmake
--- Installing: /build/reproducible-path/cpuinfo-0.0~git20250110.8a1772a/debian/tmp/usr/lib/arm-linux-gnueabihf/cmake/GTest/GTestTargets.cmake
--- Installing: /build/reproducible-path/cpuinfo-0.0~git20250110.8a1772a/debian/tmp/usr/lib/arm-linux-gnueabihf/cmake/GTest/GTestTargets-none.cmake
--- Installing: /build/reproducible-path/cpuinfo-0.0~git20250110.8a1772a/debian/tmp/usr/lib/arm-linux-gnueabihf/cmake/GTest/GTestConfigVersion.cmake
--- Installing: /build/reproducible-path/cpuinfo-0.0~git20250110.8a1772a/debian/tmp/usr/lib/arm-linux-gnueabihf/cmake/GTest/GTestConfig.cmake
--- Up-to-date: /build/reproducible-path/cpuinfo-0.0~git20250110.8a1772a/debian/tmp/usr/include
--- Installing: /build/reproducible-path/cpuinfo-0.0~git20250110.8a1772a/debian/tmp/usr/include/gtest
--- Installing: /build/reproducible-path/cpuinfo-0.0~git20250110.8a1772a/debian/tmp/usr/include/gtest/gtest-matchers.h
--- Installing: /build/reproducible-path/cpuinfo-0.0~git20250110.8a1772a/debian/tmp/usr/include/gtest/gtest-spi.h
--- Installing: /build/reproducible-path/cpuinfo-0.0~git20250110.8a1772a/debian/tmp/usr/include/gtest/gtest-printers.h
--- Installing: /build/reproducible-path/cpuinfo-0.0~git20250110.8a1772a/debian/tmp/usr/include/gtest/gtest-death-test.h
--- Installing: /build/reproducible-path/cpuinfo-0.0~git20250110.8a1772a/debian/tmp/usr/include/gtest/gtest_pred_impl.h
--- Installing: /build/reproducible-path/cpuinfo-0.0~git20250110.8a1772a/debian/tmp/usr/include/gtest/gtest-param-test.h
--- Installing: /build/reproducible-path/cpuinfo-0.0~git20250110.8a1772a/debian/tmp/usr/include/gtest/internal
--- Installing: /build/reproducible-path/cpuinfo-0.0~git20250110.8a1772a/debian/tmp/usr/include/gtest/internal/gtest-param-util.h
--- Installing: /build/reproducible-path/cpuinfo-0.0~git20250110.8a1772a/debian/tmp/usr/include/gtest/internal/gtest-death-test-internal.h
--- Installing: /build/reproducible-path/cpuinfo-0.0~git20250110.8a1772a/debian/tmp/usr/include/gtest/internal/gtest-internal.h
--- Installing: /build/reproducible-path/cpuinfo-0.0~git20250110.8a1772a/debian/tmp/usr/include/gtest/internal/gtest-filepath.h
--- Installing: /build/reproducible-path/cpuinfo-0.0~git20250110.8a1772a/debian/tmp/usr/include/gtest/internal/gtest-string.h
--- Installing: /build/reproducible-path/cpuinfo-0.0~git20250110.8a1772a/debian/tmp/usr/include/gtest/internal/gtest-port.h
--- Installing: /build/reproducible-path/cpuinfo-0.0~git20250110.8a1772a/debian/tmp/usr/include/gtest/internal/gtest-port-arch.h
--- Installing: /build/reproducible-path/cpuinfo-0.0~git20250110.8a1772a/debian/tmp/usr/include/gtest/internal/custom
--- Installing: /build/reproducible-path/cpuinfo-0.0~git20250110.8a1772a/debian/tmp/usr/include/gtest/internal/custom/gtest-printers.h
--- Installing: /build/reproducible-path/cpuinfo-0.0~git20250110.8a1772a/debian/tmp/usr/include/gtest/internal/custom/README.md
--- Installing: /build/reproducible-path/cpuinfo-0.0~git20250110.8a1772a/debian/tmp/usr/include/gtest/internal/custom/gtest-port.h
--- Installing: /build/reproducible-path/cpuinfo-0.0~git20250110.8a1772a/debian/tmp/usr/include/gtest/internal/custom/gtest.h
--- Installing: /build/reproducible-path/cpuinfo-0.0~git20250110.8a1772a/debian/tmp/usr/include/gtest/internal/gtest-type-util.h
--- Installing: /build/reproducible-path/cpuinfo-0.0~git20250110.8a1772a/debian/tmp/usr/include/gtest/gtest-test-part.h
--- Installing: /build/reproducible-path/cpuinfo-0.0~git20250110.8a1772a/debian/tmp/usr/include/gtest/gtest-message.h
--- Installing: /build/reproducible-path/cpuinfo-0.0~git20250110.8a1772a/debian/tmp/usr/include/gtest/gtest-assertion-result.h
--- Installing: /build/reproducible-path/cpuinfo-0.0~git20250110.8a1772a/debian/tmp/usr/include/gtest/gtest.h
--- Installing: /build/reproducible-path/cpuinfo-0.0~git20250110.8a1772a/debian/tmp/usr/include/gtest/gtest_prod.h
--- Installing: /build/reproducible-path/cpuinfo-0.0~git20250110.8a1772a/debian/tmp/usr/include/gtest/gtest-typed-test.h
--- Installing: /build/reproducible-path/cpuinfo-0.0~git20250110.8a1772a/debian/tmp/usr/lib/arm-linux-gnueabihf/libgtest.a
--- Installing: /build/reproducible-path/cpuinfo-0.0~git20250110.8a1772a/debian/tmp/usr/lib/arm-linux-gnueabihf/libgtest_main.a
--- Installing: /build/reproducible-path/cpuinfo-0.0~git20250110.8a1772a/debian/tmp/usr/lib/arm-linux-gnueabihf/pkgconfig/gtest.pc
--- Installing: /build/reproducible-path/cpuinfo-0.0~git20250110.8a1772a/debian/tmp/usr/lib/arm-linux-gnueabihf/pkgconfig/gtest_main.pc
-   dh_install -O-Scmake\+ninja
-   dh_installdocs -O-Scmake\+ninja
-   dh_installchangelogs -O-Scmake\+ninja
-   dh_installinit -O-Scmake\+ninja
-   dh_lintian -O-Scmake\+ninja
-   dh_perl -O-Scmake\+ninja
-   dh_link -O-Scmake\+ninja
-   dh_strip_nondeterminism -O-Scmake\+ninja
-   dh_compress -O-Scmake\+ninja
-   dh_fixperms -O-Scmake\+ninja
-   debian/rules override_dh_missing
-make[1]: Entering directory '/build/reproducible-path/cpuinfo-0.0~git20250110.8a1772a'
-dh_missing --list-missing
-make[1]: Leaving directory '/build/reproducible-path/cpuinfo-0.0~git20250110.8a1772a'
-   dh_dwz -a -O-Scmake\+ninja
-   dh_strip -a -O-Scmake\+ninja
-   dh_makeshlibs -a -O-Scmake\+ninja
-   dh_shlibdeps -a -O-Scmake\+ninja
-dpkg-shlibdeps: warning: diversions involved - output may be incorrect
- diversion by libc6 from: /lib/ld-linux-armhf.so.3
-dpkg-shlibdeps: warning: diversions involved - output may be incorrect
- diversion by libc6 to: /lib/ld-linux-armhf.so.3.usr-is-merged
-   dh_installdeb -O-Scmake\+ninja
-   dh_gencontrol -O-Scmake\+ninja
-   dh_md5sums -O-Scmake\+ninja
-   dh_builddeb -O-Scmake\+ninja
-dpkg-deb: building package 'cpuinfo' in '../cpuinfo_0.0~git20250110.8a1772a-1_armhf.deb'.
-dpkg-deb: building package 'libcpuinfo-dev' in '../libcpuinfo-dev_0.0~git20250110.8a1772a-1_armhf.deb'.
-dpkg-deb: building package 'libcpuinfo0-dbgsym' in '../libcpuinfo0-dbgsym_0.0~git20250110.8a1772a-1_armhf.deb'.
-dpkg-deb: building package 'cpuinfo-dbgsym' in '../cpuinfo-dbgsym_0.0~git20250110.8a1772a-1_armhf.deb'.
-dpkg-deb: building package 'libcpuinfo0' in '../libcpuinfo0_0.0~git20250110.8a1772a-1_armhf.deb'.
- dpkg-genbuildinfo --build=binary -O../cpuinfo_0.0~git20250110.8a1772a-1_armhf.buildinfo
- dpkg-genchanges --build=binary -O../cpuinfo_0.0~git20250110.8a1772a-1_armhf.changes
-dpkg-genchanges: info: binary-only upload (no source code included)
- dpkg-source --after-build .
-dpkg-buildpackage: info: binary-only upload (no source included)
-dpkg-genchanges: info: including full source code in upload
+[3/78] /usr/bin/cc -DCPUINFO_LOG_LEVEL=2 -DCPUINFO_LOG_TO_STDIO=1 -D_GNU_SOURCE=1 -Dcpuinfo_EXPORTS -I"/build/reproducible-path/cpuinfo-0.0~git20250110.8a1772a/src" -I"/build/reproducible-path/cpuinfo-0.0~git20250110.8a1772a/include" -g -O2 -Werror=implicit-function-declaration -ffile-prefix-map=/build/reproducible-path/cpuinfo-0.0~git20250110.8a1772a=. -fstack-protector-strong -fstack-clash-protection -Wformat -Werror=format-security -D_LARGEFILE_SOURCE -D_FILE_OFFSET_BITS=64 -D_TIME_BITS=64 -Wdate-time -D_FORTIFY_SOURCE=2 -std=c99 -fPIC -MD -MT CMakeFiles/cpuinfo.dir/src/arm/uarch.c.o -MF CMakeFiles/cpuinfo.dir/src/arm/uarch.c.o.d -o CMakeFiles/cpuinfo.dir/src/arm/uarch.c.o -c '/build/reproducible-path/cpuinfo-0.0~git20250110.8a1772a/src/arm/uarch.c'
+[4/78] /usr/bin/cc -DCPUINFO_LOG_LEVEL=2 -DCPUINFO_LOG_TO_STDIO=1 -D_GNU_SOURCE=1 -Dcpuinfo_EXPORTS -I"/build/reproducible-path/cpuinfo-0.0~git20250110.8a1772a/src" -I"/build/reproducible-path/cpuinfo-0.0~git20250110.8a1772a/include" -g -O2 -Werror=implicit-function-declaration -ffile-prefix-map=/build/reproducible-path/cpuinfo-0.0~git20250110.8a1772a=. -fstack-protector-strong -fstack-clash-protection -Wformat -Werror=format-security -D_LARGEFILE_SOURCE -D_FILE_OFFSET_BITS=64 -D_TIME_BITS=64 -Wdate-time -D_FORTIFY_SOURCE=2 -std=c99 -fPIC -MD -MT CMakeFiles/cpuinfo.dir/src/log.c.o -MF CMakeFiles/cpuinfo.dir/src/log.c.o.d -o CMakeFiles/cpuinfo.dir/src/log.c.o -c '/build/reproducible-path/cpuinfo-0.0~git20250110.8a1772a/src/log.c'
+[5/78] /usr/bin/cc -DCPUINFO_LOG_LEVEL=2 -DCPUINFO_LOG_TO_STDIO=1 -D_GNU_SOURCE=1 -Dcpuinfo_EXPORTS -I"/build/reproducible-path/cpuinfo-0.0~git20250110.8a1772a/src" -I"/build/reproducible-path/cpuinfo-0.0~git20250110.8a1772a/include" -g -O2 -Werror=implicit-function-declaration -ffile-prefix-map=/build/reproducible-path/cpuinfo-0.0~git20250110.8a1772a=. -fstack-protector-strong -fstack-clash-protection -Wformat -Werror=format-security -D_LARGEFILE_SOURCE -D_FILE_OFFSET_BITS=64 -D_TIME_BITS=64 -Wdate-time -D_FORTIFY_SOURCE=2 -std=c99 -fPIC -MD -MT CMakeFiles/cpuinfo.dir/src/arm/cache.c.o -MF CMakeFiles/cpuinfo.dir/src/arm/cache.c.o.d -o CMakeFiles/cpuinfo.dir/src/arm/cache.c.o -c '/build/reproducible-path/cpuinfo-0.0~git20250110.8a1772a/src/arm/cache.c'
+[6/78] /usr/bin/cc -DCPUINFO_LOG_LEVEL=2 -DCPUINFO_LOG_TO_STDIO=1 -D_GNU_SOURCE=1 -Dcpuinfo_EXPORTS -I"/build/reproducible-path/cpuinfo-0.0~git20250110.8a1772a/src" -I"/build/reproducible-path/cpuinfo-0.0~git20250110.8a1772a/include" -g -O2 -Werror=implicit-function-declaration -ffile-prefix-map=/build/reproducible-path/cpuinfo-0.0~git20250110.8a1772a=. -fstack-protector-strong -fstack-clash-protection -Wformat -Werror=format-security -D_LARGEFILE_SOURCE -D_FILE_OFFSET_BITS=64 -D_TIME_BITS=64 -Wdate-time -D_FORTIFY_SOURCE=2 -std=c99 -fPIC -MD -MT CMakeFiles/cpuinfo.dir/src/api.c.o -MF CMakeFiles/cpuinfo.dir/src/api.c.o.d -o CMakeFiles/cpuinfo.dir/src/api.c.o -c '/build/reproducible-path/cpuinfo-0.0~git20250110.8a1772a/src/api.c'
+[7/78] /usr/bin/cc -DCPUINFO_LOG_LEVEL=2 -DCPUINFO_LOG_TO_STDIO=1 -D_GNU_SOURCE=1 -Dcpuinfo_EXPORTS -I"/build/reproducible-path/cpuinfo-0.0~git20250110.8a1772a/src" -I"/build/reproducible-path/cpuinfo-0.0~git20250110.8a1772a/include" -g -O2 -Werror=implicit-function-declaration -ffile-prefix-map=/build/reproducible-path/cpuinfo-0.0~git20250110.8a1772a=. -fstack-protector-strong -fstack-clash-protection -Wformat -Werror=format-security -D_LARGEFILE_SOURCE -D_FILE_OFFSET_BITS=64 -D_TIME_BITS=64 -Wdate-time -D_FORTIFY_SOURCE=2 -std=c99 -fPIC -MD -MT CMakeFiles/cpuinfo.dir/src/arm/linux/clusters.c.o -MF CMakeFiles/cpuinfo.dir/src/arm/linux/clusters.c.o.d -o CMakeFiles/cpuinfo.dir/src/arm/linux/clusters.c.o -c '/build/reproducible-path/cpuinfo-0.0~git20250110.8a1772a/src/arm/linux/clusters.c'
+[8/78] /usr/bin/cc -DCPUINFO_LOG_LEVEL=2 -DCPUINFO_LOG_TO_STDIO=1 -D_GNU_SOURCE=1 -Dcpuinfo_EXPORTS -I"/build/reproducible-path/cpuinfo-0.0~git20250110.8a1772a/src" -I"/build/reproducible-path/cpuinfo-0.0~git20250110.8a1772a/include" -g -O2 -Werror=implicit-function-declaration -ffile-prefix-map=/build/reproducible-path/cpuinfo-0.0~git20250110.8a1772a=. -fstack-protector-strong -fstack-clash-protection -Wformat -Werror=format-security -D_LARGEFILE_SOURCE -D_FILE_OFFSET_BITS=64 -D_TIME_BITS=64 -Wdate-time -D_FORTIFY_SOURCE=2 -std=c99 -fPIC -MD -MT CMakeFiles/cpuinfo.dir/src/arm/linux/hwcap.c.o -MF CMakeFiles/cpuinfo.dir/src/arm/linux/hwcap.c.o.d -o CMakeFiles/cpuinfo.dir/src/arm/linux/hwcap.c.o -c '/build/reproducible-path/cpuinfo-0.0~git20250110.8a1772a/src/arm/linux/hwcap.c'
+[9/78] /usr/bin/cc -DCPUINFO_LOG_LEVEL=2 -DCPUINFO_LOG_TO_STDIO=1 -D_GNU_SOURCE=1 -Dcpuinfo_EXPORTS -I"/build/reproducible-path/cpuinfo-0.0~git20250110.8a1772a/src" -I"/build/reproducible-path/cpuinfo-0.0~git20250110.8a1772a/include" -g -O2 -Werror=implicit-function-declaration -ffile-prefix-map=/build/reproducible-path/cpuinfo-0.0~git20250110.8a1772a=. -fstack-protector-strong -fstack-clash-protection -Wformat -Werror=format-security -D_LARGEFILE_SOURCE -D_FILE_OFFSET_BITS=64 -D_TIME_BITS=64 -Wdate-time -D_FORTIFY_SOURCE=2 -std=c99 -fPIC -MD -MT CMakeFiles/cpuinfo.dir/src/arm/linux/aarch64-isa.c.o -MF CMakeFiles/cpuinfo.dir/src/arm/linux/aarch64-isa.c.o.d -o CMakeFiles/cpuinfo.dir/src/arm/linux/aarch64-isa.c.o -c '/build/reproducible-path/cpuinfo-0.0~git20250110.8a1772a/src/arm/linux/aarch64-isa.c'
+FAILED: CMakeFiles/cpuinfo.dir/src/arm/linux/aarch64-isa.c.o 
+/usr/bin/cc -DCPUINFO_LOG_LEVEL=2 -DCPUINFO_LOG_TO_STDIO=1 -D_GNU_SOURCE=1 -Dcpuinfo_EXPORTS -I"/build/reproducible-path/cpuinfo-0.0~git20250110.8a1772a/src" -I"/build/reproducible-path/cpuinfo-0.0~git20250110.8a1772a/include" -g -O2 -Werror=implicit-function-declaration -ffile-prefix-map=/build/reproducible-path/cpuinfo-0.0~git20250110.8a1772a=. -fstack-protector-strong -fstack-clash-protection -Wformat -Werror=format-security -D_LARGEFILE_SOURCE -D_FILE_OFFSET_BITS=64 -D_TIME_BITS=64 -Wdate-time -D_FORTIFY_SOURCE=2 -std=c99 -fPIC -MD -MT CMakeFiles/cpuinfo.dir/src/arm/linux/aarch64-isa.c.o -MF CMakeFiles/cpuinfo.dir/src/arm/linux/aarch64-isa.c.o.d -o CMakeFiles/cpuinfo.dir/src/arm/linux/aarch64-isa.c.o -c '/build/reproducible-path/cpuinfo-0.0~git20250110.8a1772a/src/arm/linux/aarch64-isa.c'
+/build/reproducible-path/cpuinfo-0.0~git20250110.8a1772a/src/arm/linux/aarch64-isa.c: In function ‘cpuinfo_arm64_linux_decode_isa_from_proc_cpuinfo’:
+/build/reproducible-path/cpuinfo-0.0~git20250110.8a1772a/src/arm/linux/aarch64-isa.c:14:24: error: ‘CPUINFO_ARM_LINUX_FEATURE_AES’ undeclared (first use in this function); did you mean ‘CPUINFO_ARM_LINUX_FEATURE2_AES’?
+   14 |         if (features & CPUINFO_ARM_LINUX_FEATURE_AES) {
+      |                        ^~~~~~~~~~~~~~~~~~~~~~~~~~~~~
+      |                        CPUINFO_ARM_LINUX_FEATURE2_AES
+/build/reproducible-path/cpuinfo-0.0~git20250110.8a1772a/src/arm/linux/aarch64-isa.c:14:24: note: each undeclared identifier is reported only once for each function it appears in
+/build/reproducible-path/cpuinfo-0.0~git20250110.8a1772a/src/arm/linux/aarch64-isa.c:17:24: error: ‘CPUINFO_ARM_LINUX_FEATURE_PMULL’ undeclared (first use in this function); did you mean ‘CPUINFO_ARM_LINUX_FEATURE2_PMULL’?
+   17 |         if (features & CPUINFO_ARM_LINUX_FEATURE_PMULL) {
+      |                        ^~~~~~~~~~~~~~~~~~~~~~~~~~~~~~~
+      |                        CPUINFO_ARM_LINUX_FEATURE2_PMULL
+/build/reproducible-path/cpuinfo-0.0~git20250110.8a1772a/src/arm/linux/aarch64-isa.c:20:24: error: ‘CPUINFO_ARM_LINUX_FEATURE_SHA1’ undeclared (first use in this function); did you mean ‘CPUINFO_ARM_LINUX_FEATURE2_SHA1’?
+   20 |         if (features & CPUINFO_ARM_LINUX_FEATURE_SHA1) {
+      |                        ^~~~~~~~~~~~~~~~~~~~~~~~~~~~~~
+      |                        CPUINFO_ARM_LINUX_FEATURE2_SHA1
+/build/reproducible-path/cpuinfo-0.0~git20250110.8a1772a/src/arm/linux/aarch64-isa.c:23:24: error: ‘CPUINFO_ARM_LINUX_FEATURE_SHA2’ undeclared (first use in this function); did you mean ‘CPUINFO_ARM_LINUX_FEATURE2_SHA2’?
+   23 |         if (features & CPUINFO_ARM_LINUX_FEATURE_SHA2) {
+      |                        ^~~~~~~~~~~~~~~~~~~~~~~~~~~~~~
+      |                        CPUINFO_ARM_LINUX_FEATURE2_SHA2
+/build/reproducible-path/cpuinfo-0.0~git20250110.8a1772a/src/arm/linux/aarch64-isa.c:26:24: error: ‘CPUINFO_ARM_LINUX_FEATURE_CRC32’ undeclared (first use in this function); did you mean ‘CPUINFO_ARM_LINUX_FEATURE2_CRC32’?
+   26 |         if (features & CPUINFO_ARM_LINUX_FEATURE_CRC32) {
+      |                        ^~~~~~~~~~~~~~~~~~~~~~~~~~~~~~~
+      |                        CPUINFO_ARM_LINUX_FEATURE2_CRC32
+/build/reproducible-path/cpuinfo-0.0~git20250110.8a1772a/src/arm/linux/aarch64-isa.c:29:24: error: ‘CPUINFO_ARM_LINUX_FEATURE_ATOMICS’ undeclared (first use in this function); did you mean ‘CPUINFO_ARM_LINUX_FEATURE_TLS’?
+   29 |         if (features & CPUINFO_ARM_LINUX_FEATURE_ATOMICS) {
+      |                        ^~~~~~~~~~~~~~~~~~~~~~~~~~~~~~~~~
+      |                        CPUINFO_ARM_LINUX_FEATURE_TLS
+/build/reproducible-path/cpuinfo-0.0~git20250110.8a1772a/src/arm/linux/aarch64-isa.c:30:20: error: ‘struct cpuinfo_arm_isa’ has no member named ‘atomics’
+   30 |                 isa->atomics = true;
+      |                    ^~
+/build/reproducible-path/cpuinfo-0.0~git20250110.8a1772a/src/arm/linux/aarch64-isa.c:56:49: error: ‘CPUINFO_ARM_LINUX_FEATURE_FPHP’ undeclared (first use in this function); did you mean ‘CPUINFO_ARM_LINUX_FEATURE_FPA’?
+   56 |                 const uint32_t fp16arith_mask = CPUINFO_ARM_LINUX_FEATURE_FPHP | CPUINFO_ARM_LINUX_FEATURE_ASIMDHP;
+      |                                                 ^~~~~~~~~~~~~~~~~~~~~~~~~~~~~~
+      |                                                 CPUINFO_ARM_LINUX_FEATURE_FPA
+/build/reproducible-path/cpuinfo-0.0~git20250110.8a1772a/src/arm/linux/aarch64-isa.c:56:82: error: ‘CPUINFO_ARM_LINUX_FEATURE_ASIMDHP’ undeclared (first use in this function); did you mean ‘CPUINFO_ARM_LINUX_FEATURE_EDSP’?
+   56 |                 const uint32_t fp16arith_mask = CPUINFO_ARM_LINUX_FEATURE_FPHP | CPUINFO_ARM_LINUX_FEATURE_ASIMDHP;
+      |                                                                                  ^~~~~~~~~~~~~~~~~~~~~~~~~~~~~~~~~
+      |                                                                                  CPUINFO_ARM_LINUX_FEATURE_EDSP
+/build/reproducible-path/cpuinfo-0.0~git20250110.8a1772a/src/arm/linux/aarch64-isa.c:88:48: error: ‘CPUINFO_ARM_LINUX_FEATURE_ASIMDRDM’ undeclared (first use in this function); did you mean ‘CPUINFO_ARM_LINUX_FEATURE_IDIVT’?
+   88 |                                 if (features & CPUINFO_ARM_LINUX_FEATURE_ASIMDRDM) {
+      |                                                ^~~~~~~~~~~~~~~~~~~~~~~~~~~~~~~~~~
+      |                                                CPUINFO_ARM_LINUX_FEATURE_IDIVT
+/build/reproducible-path/cpuinfo-0.0~git20250110.8a1772a/src/arm/linux/aarch64-isa.c:94:25: error: ‘CPUINFO_ARM_LINUX_FEATURE2_I8MM’ undeclared (first use in this function); did you mean ‘CPUINFO_ARM_LINUX_FEATURE_IWMMXT’?
+   94 |         if (features2 & CPUINFO_ARM_LINUX_FEATURE2_I8MM) {
+      |                         ^~~~~~~~~~~~~~~~~~~~~~~~~~~~~~~
+      |                         CPUINFO_ARM_LINUX_FEATURE_IWMMXT
+/build/reproducible-path/cpuinfo-0.0~git20250110.8a1772a/src/arm/linux/aarch64-isa.c:95:20: error: ‘struct cpuinfo_arm_isa’ has no member named ‘i8mm’
+   95 |                 isa->i8mm = true;
+      |                    ^~
+/build/reproducible-path/cpuinfo-0.0~git20250110.8a1772a/src/arm/linux/aarch64-isa.c:127:40: error: ‘CPUINFO_ARM_LINUX_FEATURE_ASIMDDP’ undeclared (first use in this function); did you mean ‘CPUINFO_ARM_LINUX_FEATURE_EDSP’?
+  127 |                         if (features & CPUINFO_ARM_LINUX_FEATURE_ASIMDDP) {
+      |                                        ^~~~~~~~~~~~~~~~~~~~~~~~~~~~~~~~~
+      |                                        CPUINFO_ARM_LINUX_FEATURE_EDSP
+/build/reproducible-path/cpuinfo-0.0~git20250110.8a1772a/src/arm/linux/aarch64-isa.c:132:24: error: ‘CPUINFO_ARM_LINUX_FEATURE_JSCVT’ undeclared (first use in this function); did you mean ‘CPUINFO_ARM_LINUX_FEATURE_IDIVT’?
+  132 |         if (features & CPUINFO_ARM_LINUX_FEATURE_JSCVT) {
+      |                        ^~~~~~~~~~~~~~~~~~~~~~~~~~~~~~~
+      |                        CPUINFO_ARM_LINUX_FEATURE_IDIVT
+/build/reproducible-path/cpuinfo-0.0~git20250110.8a1772a/src/arm/linux/aarch64-isa.c:138:24: error: ‘CPUINFO_ARM_LINUX_FEATURE_FCMA’ undeclared (first use in this function); did you mean ‘CPUINFO_ARM_LINUX_FEATURE_FPA’?
+  138 |         if (features & CPUINFO_ARM_LINUX_FEATURE_FCMA) {
+      |                        ^~~~~~~~~~~~~~~~~~~~~~~~~~~~~~
+      |                        CPUINFO_ARM_LINUX_FEATURE_FPA
+/build/reproducible-path/cpuinfo-0.0~git20250110.8a1772a/src/arm/linux/aarch64-isa.c:141:24: error: ‘CPUINFO_ARM_LINUX_FEATURE_SVE’ undeclared (first use in this function); did you mean ‘CPUINFO_ARM_LINUX_FEATURE_SWP’?
+  141 |         if (features & CPUINFO_ARM_LINUX_FEATURE_SVE) {
+      |                        ^~~~~~~~~~~~~~~~~~~~~~~~~~~~~
+      |                        CPUINFO_ARM_LINUX_FEATURE_SWP
+/build/reproducible-path/cpuinfo-0.0~git20250110.8a1772a/src/arm/linux/aarch64-isa.c:142:20: error: ‘struct cpuinfo_arm_isa’ has no member named ‘sve’
+  142 |                 isa->sve = true;
+      |                    ^~
+/build/reproducible-path/cpuinfo-0.0~git20250110.8a1772a/src/arm/linux/aarch64-isa.c:144:25: error: ‘CPUINFO_ARM_LINUX_FEATURE2_SVE2’ undeclared (first use in this function); did you mean ‘CPUINFO_ARM_LINUX_FEATURE2_SHA2’?
+  144 |         if (features2 & CPUINFO_ARM_LINUX_FEATURE2_SVE2) {
+      |                         ^~~~~~~~~~~~~~~~~~~~~~~~~~~~~~~
+      |                         CPUINFO_ARM_LINUX_FEATURE2_SHA2
+/build/reproducible-path/cpuinfo-0.0~git20250110.8a1772a/src/arm/linux/aarch64-isa.c:145:20: error: ‘struct cpuinfo_arm_isa’ has no member named ‘sve2’
+  145 |                 isa->sve2 = true;
+      |                    ^~
+/build/reproducible-path/cpuinfo-0.0~git20250110.8a1772a/src/arm/linux/aarch64-isa.c:147:25: error: ‘CPUINFO_ARM_LINUX_FEATURE2_SME’ undeclared (first use in this function); did you mean ‘CPUINFO_ARM_LINUX_FEATURE_SWP’?
+  147 |         if (features2 & CPUINFO_ARM_LINUX_FEATURE2_SME) {
+      |                         ^~~~~~~~~~~~~~~~~~~~~~~~~~~~~~
+      |                         CPUINFO_ARM_LINUX_FEATURE_SWP
+/build/reproducible-path/cpuinfo-0.0~git20250110.8a1772a/src/arm/linux/aarch64-isa.c:148:20: error: ‘struct cpuinfo_arm_isa’ has no member named ‘sme’
+  148 |                 isa->sme = true;
+      |                    ^~
+/build/reproducible-path/cpuinfo-0.0~git20250110.8a1772a/src/arm/linux/aarch64-isa.c:150:25: error: ‘CPUINFO_ARM_LINUX_FEATURE2_SME2’ undeclared (first use in this function); did you mean ‘CPUINFO_ARM_LINUX_FEATURE2_SHA2’?
+  150 |         if (features2 & CPUINFO_ARM_LINUX_FEATURE2_SME2) {
+      |                         ^~~~~~~~~~~~~~~~~~~~~~~~~~~~~~~
+      |                         CPUINFO_ARM_LINUX_FEATURE2_SHA2
+/build/reproducible-path/cpuinfo-0.0~git20250110.8a1772a/src/arm/linux/aarch64-isa.c:151:20: error: ‘struct cpuinfo_arm_isa’ has no member named ‘sme2’
+  151 |                 isa->sme2 = true;
+      |                    ^~
+/build/reproducible-path/cpuinfo-0.0~git20250110.8a1772a/src/arm/linux/aarch64-isa.c:153:25: error: ‘CPUINFO_ARM_LINUX_FEATURE2_SME2P1’ undeclared (first use in this function); did you mean ‘CPUINFO_ARM_LINUX_FEATURE2_SHA1’?
+  153 |         if (features2 & CPUINFO_ARM_LINUX_FEATURE2_SME2P1) {
+      |                         ^~~~~~~~~~~~~~~~~~~~~~~~~~~~~~~~~
+      |                         CPUINFO_ARM_LINUX_FEATURE2_SHA1
+/build/reproducible-path/cpuinfo-0.0~git20250110.8a1772a/src/arm/linux/aarch64-isa.c:154:20: error: ‘struct cpuinfo_arm_isa’ has no member named ‘sme2p1’
+  154 |                 isa->sme2p1 = true;
+      |                    ^~
+/build/reproducible-path/cpuinfo-0.0~git20250110.8a1772a/src/arm/linux/aarch64-isa.c:156:25: error: ‘CPUINFO_ARM_LINUX_FEATURE2_SME_I16I32’ undeclared (first use in this function); did you mean ‘CPUINFO_ARM_LINUX_FEATURE2_CRC32’?
+  156 |         if (features2 & CPUINFO_ARM_LINUX_FEATURE2_SME_I16I32) {
+      |                         ^~~~~~~~~~~~~~~~~~~~~~~~~~~~~~~~~~~~~
+      |                         CPUINFO_ARM_LINUX_FEATURE2_CRC32
+/build/reproducible-path/cpuinfo-0.0~git20250110.8a1772a/src/arm/linux/aarch64-isa.c:157:20: error: ‘struct cpuinfo_arm_isa’ has no member named ‘sme_i16i32’
+  157 |                 isa->sme_i16i32 = true;
+      |                    ^~
+/build/reproducible-path/cpuinfo-0.0~git20250110.8a1772a/src/arm/linux/aarch64-isa.c:159:25: error: ‘CPUINFO_ARM_LINUX_FEATURE2_SME_BI32I32’ undeclared (first use in this function); did you mean ‘CPUINFO_ARM_LINUX_FEATURE2_CRC32’?
+  159 |         if (features2 & CPUINFO_ARM_LINUX_FEATURE2_SME_BI32I32) {
+      |                         ^~~~~~~~~~~~~~~~~~~~~~~~~~~~~~~~~~~~~~
+      |                         CPUINFO_ARM_LINUX_FEATURE2_CRC32
+/build/reproducible-path/cpuinfo-0.0~git20250110.8a1772a/src/arm/linux/aarch64-isa.c:160:20: error: ‘struct cpuinfo_arm_isa’ has no member named ‘sme_bi32i32’
+  160 |                 isa->sme_bi32i32 = true;
+      |                    ^~
+/build/reproducible-path/cpuinfo-0.0~git20250110.8a1772a/src/arm/linux/aarch64-isa.c:162:25: error: ‘CPUINFO_ARM_LINUX_FEATURE2_SME_B16B16’ undeclared (first use in this function); did you mean ‘CPUINFO_ARM_LINUX_FEATURE2_SHA1’?
+  162 |         if (features2 & CPUINFO_ARM_LINUX_FEATURE2_SME_B16B16) {
+      |                         ^~~~~~~~~~~~~~~~~~~~~~~~~~~~~~~~~~~~~
+      |                         CPUINFO_ARM_LINUX_FEATURE2_SHA1
+/build/reproducible-path/cpuinfo-0.0~git20250110.8a1772a/src/arm/linux/aarch64-isa.c:163:20: error: ‘struct cpuinfo_arm_isa’ has no member named ‘sme_b16b16’
+  163 |                 isa->sme_b16b16 = true;
+      |                    ^~
+/build/reproducible-path/cpuinfo-0.0~git20250110.8a1772a/src/arm/linux/aarch64-isa.c:165:25: error: ‘CPUINFO_ARM_LINUX_FEATURE2_SME_F16F16’ undeclared (first use in this function); did you mean ‘CPUINFO_ARM_LINUX_FEATURE2_SHA1’?
+  165 |         if (features2 & CPUINFO_ARM_LINUX_FEATURE2_SME_F16F16) {
+      |                         ^~~~~~~~~~~~~~~~~~~~~~~~~~~~~~~~~~~~~
+      |                         CPUINFO_ARM_LINUX_FEATURE2_SHA1
+/build/reproducible-path/cpuinfo-0.0~git20250110.8a1772a/src/arm/linux/aarch64-isa.c:166:20: error: ‘struct cpuinfo_arm_isa’ has no member named ‘sme_f16f16’
+  166 |                 isa->sme_f16f16 = true;
+      |                    ^~
+/build/reproducible-path/cpuinfo-0.0~git20250110.8a1772a/src/arm/linux/aarch64-isa.c:171:26: error: ‘CPUINFO_ARM_LINUX_FEATURE2_BF16’ undeclared (first use in this function); did you mean ‘CPUINFO_ARM_LINUX_FEATURE_FPA’?
+  171 |         if (features2 & (CPUINFO_ARM_LINUX_FEATURE2_BF16 | CPUINFO_ARM_LINUX_FEATURE2_SVEBF16)) {
+      |                          ^~~~~~~~~~~~~~~~~~~~~~~~~~~~~~~
+      |                          CPUINFO_ARM_LINUX_FEATURE_FPA
+/build/reproducible-path/cpuinfo-0.0~git20250110.8a1772a/src/arm/linux/aarch64-isa.c:171:60: error: ‘CPUINFO_ARM_LINUX_FEATURE2_SVEBF16’ undeclared (first use in this function); did you mean ‘CPUINFO_ARM_LINUX_FEATURE2_SHA1’?
+  171 |         if (features2 & (CPUINFO_ARM_LINUX_FEATURE2_BF16 | CPUINFO_ARM_LINUX_FEATURE2_SVEBF16)) {
+      |                                                            ^~~~~~~~~~~~~~~~~~~~~~~~~~~~~~~~~~
+      |                                                            CPUINFO_ARM_LINUX_FEATURE2_SHA1
+/build/reproducible-path/cpuinfo-0.0~git20250110.8a1772a/src/arm/linux/aarch64-isa.c:172:20: error: ‘struct cpuinfo_arm_isa’ has no member named ‘bf16’
+  172 |                 isa->bf16 = true;
+      |                    ^~
+/build/reproducible-path/cpuinfo-0.0~git20250110.8a1772a/src/arm/linux/aarch64-isa.c:174:24: error: ‘CPUINFO_ARM_LINUX_FEATURE_ASIMDFHM’ undeclared (first use in this function); did you mean ‘CPUINFO_ARM_LINUX_FEATURE_IDIVT’?
+  174 |         if (features & CPUINFO_ARM_LINUX_FEATURE_ASIMDFHM) {
+      |                        ^~~~~~~~~~~~~~~~~~~~~~~~~~~~~~~~~~
+      |                        CPUINFO_ARM_LINUX_FEATURE_IDIVT
+/build/reproducible-path/cpuinfo-0.0~git20250110.8a1772a/src/arm/linux/aarch64-isa.c:189:20: error: ‘struct cpuinfo_arm_isa’ has no member named ‘svelen’
+  189 |                 isa->svelen = 0; // Assume no SVE support if the call fails
+      |                    ^~
+/build/reproducible-path/cpuinfo-0.0~git20250110.8a1772a/src/arm/linux/aarch64-isa.c:192:20: error: ‘struct cpuinfo_arm_isa’ has no member named ‘svelen’
+  192 |                 isa->svelen = ret & PR_SVE_VL_LEN_MASK;
+      |                    ^~
+[10/78] /usr/bin/cc -DCPUINFO_LOG_LEVEL=2 -DCPUINFO_LOG_TO_STDIO=1 -D_GNU_SOURCE=1 -Dcpuinfo_EXPORTS -I"/build/reproducible-path/cpuinfo-0.0~git20250110.8a1772a/src" -I"/build/reproducible-path/cpuinfo-0.0~git20250110.8a1772a/include" -g -O2 -Werror=implicit-function-declaration -ffile-prefix-map=/build/reproducible-path/cpuinfo-0.0~git20250110.8a1772a=. -fstack-protector-strong -fstack-clash-protection -Wformat -Werror=format-security -D_LARGEFILE_SOURCE -D_FILE_OFFSET_BITS=64 -D_TIME_BITS=64 -Wdate-time -D_FORTIFY_SOURCE=2 -std=c99 -fPIC -MD -MT CMakeFiles/cpuinfo.dir/src/arm/linux/midr.c.o -MF CMakeFiles/cpuinfo.dir/src/arm/linux/midr.c.o.d -o CMakeFiles/cpuinfo.dir/src/arm/linux/midr.c.o -c '/build/reproducible-path/cpuinfo-0.0~git20250110.8a1772a/src/arm/linux/midr.c'
+[11/78] /usr/bin/cc -DCPUINFO_LOG_LEVEL=2 -DCPUINFO_LOG_TO_STDIO=1 -D_GNU_SOURCE=1 -Dcpuinfo_EXPORTS -I"/build/reproducible-path/cpuinfo-0.0~git20250110.8a1772a/src" -I"/build/reproducible-path/cpuinfo-0.0~git20250110.8a1772a/include" -g -O2 -Werror=implicit-function-declaration -ffile-prefix-map=/build/reproducible-path/cpuinfo-0.0~git20250110.8a1772a=. -fstack-protector-strong -fstack-clash-protection -Wformat -Werror=format-security -D_LARGEFILE_SOURCE -D_FILE_OFFSET_BITS=64 -D_TIME_BITS=64 -Wdate-time -D_FORTIFY_SOURCE=2 -std=c99 -fPIC -MD -MT CMakeFiles/cpuinfo.dir/src/linux/smallfile.c.o -MF CMakeFiles/cpuinfo.dir/src/linux/smallfile.c.o.d -o CMakeFiles/cpuinfo.dir/src/linux/smallfile.c.o -c '/build/reproducible-path/cpuinfo-0.0~git20250110.8a1772a/src/linux/smallfile.c'
+[12/78] /usr/bin/cc -DCPUINFO_LOG_LEVEL=2 -DCPUINFO_LOG_TO_STDIO=1 -D_GNU_SOURCE=1 -Dcpuinfo_EXPORTS -I"/build/reproducible-path/cpuinfo-0.0~git20250110.8a1772a/src" -I"/build/reproducible-path/cpuinfo-0.0~git20250110.8a1772a/include" -g -O2 -Werror=implicit-function-declaration -ffile-prefix-map=/build/reproducible-path/cpuinfo-0.0~git20250110.8a1772a=. -fstack-protector-strong -fstack-clash-protection -Wformat -Werror=format-security -D_LARGEFILE_SOURCE -D_FILE_OFFSET_BITS=64 -D_TIME_BITS=64 -Wdate-time -D_FORTIFY_SOURCE=2 -std=c99 -fPIC -MD -MT CMakeFiles/cpuinfo.dir/src/arm/linux/init.c.o -MF CMakeFiles/cpuinfo.dir/src/arm/linux/init.c.o.d -o CMakeFiles/cpuinfo.dir/src/arm/linux/init.c.o -c '/build/reproducible-path/cpuinfo-0.0~git20250110.8a1772a/src/arm/linux/init.c'
+[13/78] /usr/bin/cc -DCPUINFO_LOG_LEVEL=2 -DCPUINFO_LOG_TO_STDIO=1 -D_GNU_SOURCE=1 -Dcpuinfo_EXPORTS -I"/build/reproducible-path/cpuinfo-0.0~git20250110.8a1772a/src" -I"/build/reproducible-path/cpuinfo-0.0~git20250110.8a1772a/include" -g -O2 -Werror=implicit-function-declaration -ffile-prefix-map=/build/reproducible-path/cpuinfo-0.0~git20250110.8a1772a=. -fstack-protector-strong -fstack-clash-protection -Wformat -Werror=format-security -D_LARGEFILE_SOURCE -D_FILE_OFFSET_BITS=64 -D_TIME_BITS=64 -Wdate-time -D_FORTIFY_SOURCE=2 -std=c99 -fPIC -MD -MT CMakeFiles/cpuinfo.dir/src/arm/linux/cpuinfo.c.o -MF CMakeFiles/cpuinfo.dir/src/arm/linux/cpuinfo.c.o.d -o CMakeFiles/cpuinfo.dir/src/arm/linux/cpuinfo.c.o -c '/build/reproducible-path/cpuinfo-0.0~git20250110.8a1772a/src/arm/linux/cpuinfo.c'
+[14/78] /usr/bin/cc -DCPUINFO_LOG_LEVEL=2 -DCPUINFO_LOG_TO_STDIO=1 -D_GNU_SOURCE=1 -Dcpuinfo_EXPORTS -I"/build/reproducible-path/cpuinfo-0.0~git20250110.8a1772a/src" -I"/build/reproducible-path/cpuinfo-0.0~git20250110.8a1772a/include" -g -O2 -Werror=implicit-function-declaration -ffile-prefix-map=/build/reproducible-path/cpuinfo-0.0~git20250110.8a1772a=. -fstack-protector-strong -fstack-clash-protection -Wformat -Werror=format-security -D_LARGEFILE_SOURCE -D_FILE_OFFSET_BITS=64 -D_TIME_BITS=64 -Wdate-time -D_FORTIFY_SOURCE=2 -std=c99 -fPIC -MD -MT CMakeFiles/cpuinfo.dir/src/arm/linux/chipset.c.o -MF CMakeFiles/cpuinfo.dir/src/arm/linux/chipset.c.o.d -o CMakeFiles/cpuinfo.dir/src/arm/linux/chipset.c.o -c '/build/reproducible-path/cpuinfo-0.0~git20250110.8a1772a/src/arm/linux/chipset.c'
+ninja: build stopped: subcommand failed.
+dh_auto_build: error: cd obj-arm-linux-gnueabihf && LC_ALL=C.UTF-8 ninja -j6 -v returned exit code 1
+make: *** [debian/rules:5: binary] Error 25
+dpkg-buildpackage: error: debian/rules binary subprocess returned exit status 2
 I: copying local configuration
+E: Failed autobuilding of package
+I: user script /srv/workspace/pbuilder/16425/tmp/hooks/C01_cleanup starting
+debug output: disk usage on i-capture-the-hostname at Thu Jan 30 04:54:33 UTC 2025
+Filesystem      Size  Used Avail Use% Mounted on
+tmpfs           1.9G     0  1.9G   0% /dev/shm
+
+I: user script /srv/workspace/pbuilder/16425/tmp/hooks/C01_cleanup finished
 I: unmounting dev/ptmx filesystem
 I: unmounting dev/pts filesystem
 I: unmounting dev/shm filesystem
 I: unmounting proc filesystem
 I: unmounting sys filesystem
 I: cleaning the build env 
-I: removing directory /srv/workspace/pbuilder/29058 and its subdirectories
-I: Current time: Wed Jan 29 16:52:29 -12 2025
-I: pbuilder-time-stamp: 1738212749
+I: removing directory /srv/workspace/pbuilder/16425 and its subdirectories