Diff of the two buildlogs:

--
--- b1/build.log	2025-01-23 09:11:35.761881640 +0000
+++ b2/build.log	2025-01-23 09:14:14.922761409 +0000
@@ -1,6 +1,6 @@
 I: pbuilder: network access will be disabled during build
-I: Current time: Wed Jan 22 21:05:31 -12 2025
-I: pbuilder-time-stamp: 1737623131
+I: Current time: Thu Jan 23 23:11:44 +14 2025
+I: pbuilder-time-stamp: 1737623504
 I: Building the build Environment
 I: extracting base tarball [/var/cache/pbuilder/trixie-reproducible-base.tgz]
 I: copying local configuration
@@ -24,52 +24,84 @@
 dpkg-source: info: applying 0001-use-local-googletest-src.patch
 I: Not using root during the build.
 I: Installing the build-deps
-I: user script /srv/workspace/pbuilder/20304/tmp/hooks/D02_print_environment starting
+I: user script /srv/workspace/pbuilder/31041/tmp/hooks/D01_modify_environment starting
+debug: Running on virt64a.
+I: Changing host+domainname to test build reproducibility
+I: Adding a custom variable just for the fun of it...
+I: Changing /bin/sh to bash
+'/bin/sh' -> '/bin/bash'
+lrwxrwxrwx 1 root root 9 Jan 23 09:11 /bin/sh -> /bin/bash
+I: Setting pbuilder2's login shell to /bin/bash
+I: Setting pbuilder2's GECOS to second user,second room,second work-phone,second home-phone,second other
+I: user script /srv/workspace/pbuilder/31041/tmp/hooks/D01_modify_environment finished
+I: user script /srv/workspace/pbuilder/31041/tmp/hooks/D02_print_environment starting
 I: set
-  BUILDDIR='/build/reproducible-path'
-  BUILDUSERGECOS='first user,first room,first work-phone,first home-phone,first other'
-  BUILDUSERNAME='pbuilder1'
-  BUILD_ARCH='armhf'
-  DEBIAN_FRONTEND='noninteractive'
-  DEB_BUILD_OPTIONS='buildinfo=+all reproducible=+all parallel=3 '
-  DISTRIBUTION='trixie'
-  HOME='/root'
-  HOST_ARCH='armhf'
+  BASH=/bin/sh
+  BASHOPTS=checkwinsize:cmdhist:complete_fullquote:extquote:force_fignore:globasciiranges:globskipdots:hostcomplete:interactive_comments:patsub_replacement:progcomp:promptvars:sourcepath
+  BASH_ALIASES=()
+  BASH_ARGC=()
+  BASH_ARGV=()
+  BASH_CMDS=()
+  BASH_LINENO=([0]="12" [1]="0")
+  BASH_LOADABLES_PATH=/usr/local/lib/bash:/usr/lib/bash:/opt/local/lib/bash:/usr/pkg/lib/bash:/opt/pkg/lib/bash:.
+  BASH_SOURCE=([0]="/tmp/hooks/D02_print_environment" [1]="/tmp/hooks/D02_print_environment")
+  BASH_VERSINFO=([0]="5" [1]="2" [2]="37" [3]="1" [4]="release" [5]="arm-unknown-linux-gnueabihf")
+  BASH_VERSION='5.2.37(1)-release'
+  BUILDDIR=/build/reproducible-path
+  BUILDUSERGECOS='second user,second room,second work-phone,second home-phone,second other'
+  BUILDUSERNAME=pbuilder2
+  BUILD_ARCH=armhf
+  DEBIAN_FRONTEND=noninteractive
+  DEB_BUILD_OPTIONS='buildinfo=+all reproducible=+all parallel=4 '
+  DIRSTACK=()
+  DISTRIBUTION=trixie
+  EUID=0
+  FUNCNAME=([0]="Echo" [1]="main")
+  GROUPS=()
+  HOME=/root
+  HOSTNAME=i-capture-the-hostname
+  HOSTTYPE=arm
+  HOST_ARCH=armhf
   IFS=' 	
   '
-  INVOCATION_ID='73e09863c40d4d0caaf09d0e1acd0764'
-  LANG='C'
-  LANGUAGE='en_US:en'
-  LC_ALL='C'
-  MAIL='/var/mail/root'
-  OPTIND='1'
-  PATH='/usr/sbin:/usr/bin:/sbin:/bin:/usr/games'
-  PBCURRENTCOMMANDLINEOPERATION='build'
-  PBUILDER_OPERATION='build'
-  PBUILDER_PKGDATADIR='/usr/share/pbuilder'
-  PBUILDER_PKGLIBDIR='/usr/lib/pbuilder'
-  PBUILDER_SYSCONFDIR='/etc'
-  PPID='20304'
-  PS1='# '
-  PS2='> '
+  INVOCATION_ID=807467fc5a194cf3ae53ff0d92381020
+  LANG=C
+  LANGUAGE=it_CH:it
+  LC_ALL=C
+  MACHTYPE=arm-unknown-linux-gnueabihf
+  MAIL=/var/mail/root
+  OPTERR=1
+  OPTIND=1
+  OSTYPE=linux-gnueabihf
+  PATH=/usr/sbin:/usr/bin:/sbin:/bin:/usr/games:/i/capture/the/path
+  PBCURRENTCOMMANDLINEOPERATION=build
+  PBUILDER_OPERATION=build
+  PBUILDER_PKGDATADIR=/usr/share/pbuilder
+  PBUILDER_PKGLIBDIR=/usr/lib/pbuilder
+  PBUILDER_SYSCONFDIR=/etc
+  PIPESTATUS=([0]="0")
+  POSIXLY_CORRECT=y
+  PPID=31041
   PS4='+ '
-  PWD='/'
-  SHELL='/bin/bash'
-  SHLVL='2'
-  SUDO_COMMAND='/usr/bin/timeout -k 18.1h 18h /usr/bin/ionice -c 3 /usr/bin/nice /usr/sbin/pbuilder --build --configfile /srv/reproducible-results/rbuild-debian/r-b-build.oszS0OgT/pbuilderrc_qJOC --distribution trixie --hookdir /etc/pbuilder/first-build-hooks --debbuildopts -b --basetgz /var/cache/pbuilder/trixie-reproducible-base.tgz --buildresult /srv/reproducible-results/rbuild-debian/r-b-build.oszS0OgT/b1 --logfile b1/build.log cpu-features_0.9.0-1.dsc'
-  SUDO_GID='110'
-  SUDO_UID='103'
-  SUDO_USER='jenkins'
-  TERM='unknown'
-  TZ='/usr/share/zoneinfo/Etc/GMT+12'
-  USER='root'
-  _='/usr/bin/systemd-run'
-  http_proxy='http://10.0.0.15:3142/'
+  PWD=/
+  SHELL=/bin/bash
+  SHELLOPTS=braceexpand:errexit:hashall:interactive-comments:posix
+  SHLVL=3
+  SUDO_COMMAND='/usr/bin/timeout -k 24.1h 24h /usr/bin/ionice -c 3 /usr/bin/nice -n 11 /usr/bin/unshare --uts -- /usr/sbin/pbuilder --build --configfile /srv/reproducible-results/rbuild-debian/r-b-build.oszS0OgT/pbuilderrc_gPti --distribution trixie --hookdir /etc/pbuilder/rebuild-hooks --debbuildopts -b --basetgz /var/cache/pbuilder/trixie-reproducible-base.tgz --buildresult /srv/reproducible-results/rbuild-debian/r-b-build.oszS0OgT/b2 --logfile b2/build.log cpu-features_0.9.0-1.dsc'
+  SUDO_GID=114
+  SUDO_UID=108
+  SUDO_USER=jenkins
+  TERM=unknown
+  TZ=/usr/share/zoneinfo/Etc/GMT-14
+  UID=0
+  USER=root
+  _='I: set'
+  http_proxy=http://10.0.0.15:3142/
 I: uname -a
-  Linux virt32z 6.1.0-30-armmp-lpae #1 SMP Debian 6.1.124-1 (2025-01-12) armv7l GNU/Linux
+  Linux i-capture-the-hostname 6.1.0-30-arm64 #1 SMP Debian 6.1.124-1 (2025-01-12) aarch64 GNU/Linux
 I: ls -l /bin
   lrwxrwxrwx 1 root root 7 Nov 22 14:40 /bin -> usr/bin
-I: user script /srv/workspace/pbuilder/20304/tmp/hooks/D02_print_environment finished
+I: user script /srv/workspace/pbuilder/31041/tmp/hooks/D02_print_environment finished
  -> Attempting to satisfy build-dependencies
  -> Creating pbuilder-satisfydepends-dummy package
 Package: pbuilder-satisfydepends-dummy
@@ -169,7 +201,7 @@
 Get: 58 http://deb.debian.org/debian trixie/main armhf po-debconf all 1.0.21+nmu1 [248 kB]
 Get: 59 http://deb.debian.org/debian trixie/main armhf debhelper all 13.23 [919 kB]
 Get: 60 http://deb.debian.org/debian trixie/main armhf googletest all 1.15.2-1 [514 kB]
-Fetched 33.6 MB in 11s (3025 kB/s)
+Fetched 33.6 MB in 1s (58.7 MB/s)
 Preconfiguring packages ...
 Selecting previously unselected package libproc2-0:armhf.
 (Reading database ... 
(Reading database ... 5%
(Reading database ... 10%
(Reading database ... 15%
(Reading database ... 20%
(Reading database ... 25%
(Reading database ... 30%
(Reading database ... 35%
(Reading database ... 40%
(Reading database ... 45%
(Reading database ... 50%
(Reading database ... 55%
(Reading database ... 60%
(Reading database ... 65%
(Reading database ... 70%
(Reading database ... 75%
(Reading database ... 80%
(Reading database ... 85%
(Reading database ... 90%
(Reading database ... 95%
(Reading database ... 100%
(Reading database ... 19569 files and directories currently installed.)
@@ -424,7 +456,11 @@
 Building tag database...
  -> Finished parsing the build-deps
 I: Building the package
-I: Running cd /build/reproducible-path/cpu-features-0.9.0/ && env PATH="/usr/sbin:/usr/bin:/sbin:/bin:/usr/games" HOME="/nonexistent/first-build" dpkg-buildpackage -us -uc -b && env PATH="/usr/sbin:/usr/bin:/sbin:/bin:/usr/games" HOME="/nonexistent/first-build" dpkg-genchanges -S  > ../cpu-features_0.9.0-1_source.changes
+I: user script /srv/workspace/pbuilder/31041/tmp/hooks/A99_set_merged_usr starting
+Not re-configuring usrmerge for trixie
+I: user script /srv/workspace/pbuilder/31041/tmp/hooks/A99_set_merged_usr finished
+hostname: Name or service not known
+I: Running cd /build/reproducible-path/cpu-features-0.9.0/ && env PATH="/usr/sbin:/usr/bin:/sbin:/bin:/usr/games:/i/capture/the/path" HOME="/nonexistent/second-build" dpkg-buildpackage -us -uc -b && env PATH="/usr/sbin:/usr/bin:/sbin:/bin:/usr/games:/i/capture/the/path" HOME="/nonexistent/second-build" dpkg-genchanges -S  > ../cpu-features_0.9.0-1_source.changes
 dpkg-buildpackage: info: source package cpu-features
 dpkg-buildpackage: info: source version 0.9.0-1
 dpkg-buildpackage: info: source distribution unstable
@@ -467,7 +503,7 @@
   to work with policies introduced by <max> or earlier.
 
 
--- Configuring done (0.3s)
+-- Configuring done (0.1s)
 -- Generating done (0.0s)
 -- Build files have been written to: /build/reproducible-path/cpu-features-0.9.0/obj-arm-linux-gnueabihf/googletest-download
 gmake[2]: Entering directory '/build/reproducible-path/cpu-features-0.9.0/obj-arm-linux-gnueabihf/googletest-download'
@@ -485,8 +521,8 @@
 -- Performing Test CMAKE_HAVE_LIBC_PTHREAD
 -- Performing Test CMAKE_HAVE_LIBC_PTHREAD - Success
 -- Found Threads: TRUE
--- Configuring done (14.0s)
--- Generating done (0.5s)
+-- Configuring done (3.6s)
+-- Generating done (0.2s)
 CMake Warning:
   Manually-specified variables were not used by the project:
 
@@ -498,7 +534,7 @@
 -- Build files have been written to: /build/reproducible-path/cpu-features-0.9.0/obj-arm-linux-gnueabihf
 make[1]: Leaving directory '/build/reproducible-path/cpu-features-0.9.0'
    dh_auto_build
-	cd obj-arm-linux-gnueabihf && make -j3 "INSTALL=install --strip-program=true" VERBOSE=1
+	cd obj-arm-linux-gnueabihf && make -j4 "INSTALL=install --strip-program=true" VERBOSE=1
 make[1]: Entering directory '/build/reproducible-path/cpu-features-0.9.0/obj-arm-linux-gnueabihf'
 /usr/bin/cmake -P /build/reproducible-path/cpu-features-0.9.0/obj-arm-linux-gnueabihf/CMakeFiles/VerifyGlobs.cmake
 /usr/bin/cmake -S/build/reproducible-path/cpu-features-0.9.0 -B/build/reproducible-path/cpu-features-0.9.0/obj-arm-linux-gnueabihf --check-build-system CMakeFiles/Makefile.cmake 0
@@ -506,472 +542,280 @@
 make  -f CMakeFiles/Makefile2 all
 make[2]: Entering directory '/build/reproducible-path/cpu-features-0.9.0/obj-arm-linux-gnueabihf'
 make  -f CMakeFiles/utils.dir/build.make CMakeFiles/utils.dir/depend
+make  -f CMakeFiles/unix_based_hardware_detection.dir/build.make CMakeFiles/unix_based_hardware_detection.dir/depend
+make  -f test/CMakeFiles/string_view.dir/build.make test/CMakeFiles/string_view.dir/depend
 make[3]: Entering directory '/build/reproducible-path/cpu-features-0.9.0/obj-arm-linux-gnueabihf'
 cd /build/reproducible-path/cpu-features-0.9.0/obj-arm-linux-gnueabihf && /usr/bin/cmake -E cmake_depends "Unix Makefiles" /build/reproducible-path/cpu-features-0.9.0 /build/reproducible-path/cpu-features-0.9.0 /build/reproducible-path/cpu-features-0.9.0/obj-arm-linux-gnueabihf /build/reproducible-path/cpu-features-0.9.0/obj-arm-linux-gnueabihf /build/reproducible-path/cpu-features-0.9.0/obj-arm-linux-gnueabihf/CMakeFiles/utils.dir/DependInfo.cmake "--color="
-make  -f CMakeFiles/unix_based_hardware_detection.dir/build.make CMakeFiles/unix_based_hardware_detection.dir/depend
 make[3]: Entering directory '/build/reproducible-path/cpu-features-0.9.0/obj-arm-linux-gnueabihf'
 cd /build/reproducible-path/cpu-features-0.9.0/obj-arm-linux-gnueabihf && /usr/bin/cmake -E cmake_depends "Unix Makefiles" /build/reproducible-path/cpu-features-0.9.0 /build/reproducible-path/cpu-features-0.9.0 /build/reproducible-path/cpu-features-0.9.0/obj-arm-linux-gnueabihf /build/reproducible-path/cpu-features-0.9.0/obj-arm-linux-gnueabihf /build/reproducible-path/cpu-features-0.9.0/obj-arm-linux-gnueabihf/CMakeFiles/unix_based_hardware_detection.dir/DependInfo.cmake "--color="
-make  -f test/CMakeFiles/string_view.dir/build.make test/CMakeFiles/string_view.dir/depend
 make[3]: Entering directory '/build/reproducible-path/cpu-features-0.9.0/obj-arm-linux-gnueabihf'
+make  -f test/CMakeFiles/filesystem_for_testing.dir/build.make test/CMakeFiles/filesystem_for_testing.dir/depend
 cd /build/reproducible-path/cpu-features-0.9.0/obj-arm-linux-gnueabihf && /usr/bin/cmake -E cmake_depends "Unix Makefiles" /build/reproducible-path/cpu-features-0.9.0 /build/reproducible-path/cpu-features-0.9.0/test /build/reproducible-path/cpu-features-0.9.0/obj-arm-linux-gnueabihf /build/reproducible-path/cpu-features-0.9.0/obj-arm-linux-gnueabihf/test /build/reproducible-path/cpu-features-0.9.0/obj-arm-linux-gnueabihf/test/CMakeFiles/string_view.dir/DependInfo.cmake "--color="
+make[3]: Entering directory '/build/reproducible-path/cpu-features-0.9.0/obj-arm-linux-gnueabihf'
+cd /build/reproducible-path/cpu-features-0.9.0/obj-arm-linux-gnueabihf && /usr/bin/cmake -E cmake_depends "Unix Makefiles" /build/reproducible-path/cpu-features-0.9.0 /build/reproducible-path/cpu-features-0.9.0/test /build/reproducible-path/cpu-features-0.9.0/obj-arm-linux-gnueabihf /build/reproducible-path/cpu-features-0.9.0/obj-arm-linux-gnueabihf/test /build/reproducible-path/cpu-features-0.9.0/obj-arm-linux-gnueabihf/test/CMakeFiles/filesystem_for_testing.dir/DependInfo.cmake "--color="
 make[3]: Leaving directory '/build/reproducible-path/cpu-features-0.9.0/obj-arm-linux-gnueabihf'
 make  -f CMakeFiles/unix_based_hardware_detection.dir/build.make CMakeFiles/unix_based_hardware_detection.dir/build
-make[3]: Entering directory '/build/reproducible-path/cpu-features-0.9.0/obj-arm-linux-gnueabihf'
 make[3]: Leaving directory '/build/reproducible-path/cpu-features-0.9.0/obj-arm-linux-gnueabihf'
 make  -f test/CMakeFiles/string_view.dir/build.make test/CMakeFiles/string_view.dir/build
-make[3]: Leaving directory '/build/reproducible-path/cpu-features-0.9.0/obj-arm-linux-gnueabihf'
 make[3]: Entering directory '/build/reproducible-path/cpu-features-0.9.0/obj-arm-linux-gnueabihf'
-make  -f CMakeFiles/utils.dir/build.make CMakeFiles/utils.dir/build
 make[3]: Entering directory '/build/reproducible-path/cpu-features-0.9.0/obj-arm-linux-gnueabihf'
-[  2%] Building C object CMakeFiles/unix_based_hardware_detection.dir/src/hwcaps.c.o
-/usr/bin/cc -DHAVE_DLFCN_H -DHAVE_STRONG_GETAUXVAL -DSTACK_LINE_READER_BUFFER_SIZE=1024 -I/build/reproducible-path/cpu-features-0.9.0/include -I/build/reproducible-path/cpu-features-0.9.0/include/internal -g -O2 -Werror=implicit-function-declaration -ffile-prefix-map=/build/reproducible-path/cpu-features-0.9.0=. -fstack-protector-strong -fstack-clash-protection -Wformat -Werror=format-security -D_LARGEFILE_SOURCE -D_FILE_OFFSET_BITS=64 -D_TIME_BITS=64 -Wdate-time -D_FORTIFY_SOURCE=2 -std=gnu99 -MD -MT CMakeFiles/unix_based_hardware_detection.dir/src/hwcaps.c.o -MF CMakeFiles/unix_based_hardware_detection.dir/src/hwcaps.c.o.d -o CMakeFiles/unix_based_hardware_detection.dir/src/hwcaps.c.o -c /build/reproducible-path/cpu-features-0.9.0/src/hwcaps.c
-[  4%] Building C object CMakeFiles/utils.dir/src/filesystem.c.o
-/usr/bin/cc -DSTACK_LINE_READER_BUFFER_SIZE=1024 -I/build/reproducible-path/cpu-features-0.9.0/include -I/build/reproducible-path/cpu-features-0.9.0/include/internal -g -O2 -Werror=implicit-function-declaration -ffile-prefix-map=/build/reproducible-path/cpu-features-0.9.0=. -fstack-protector-strong -fstack-clash-protection -Wformat -Werror=format-security -D_LARGEFILE_SOURCE -D_FILE_OFFSET_BITS=64 -D_TIME_BITS=64 -Wdate-time -D_FORTIFY_SOURCE=2 -std=gnu99 -MD -MT CMakeFiles/utils.dir/src/filesystem.c.o -MF CMakeFiles/utils.dir/src/filesystem.c.o.d -o CMakeFiles/utils.dir/src/filesystem.c.o -c /build/reproducible-path/cpu-features-0.9.0/src/filesystem.c
-[  6%] Building C object test/CMakeFiles/string_view.dir/__/src/string_view.c.o
-cd /build/reproducible-path/cpu-features-0.9.0/obj-arm-linux-gnueabihf/test && /usr/bin/cc -DCPU_FEATURES_TEST -I/build/reproducible-path/cpu-features-0.9.0/test/../include -g -O2 -Werror=implicit-function-declaration -ffile-prefix-map=/build/reproducible-path/cpu-features-0.9.0=. -fstack-protector-strong -fstack-clash-protection -Wformat -Werror=format-security -D_LARGEFILE_SOURCE -D_FILE_OFFSET_BITS=64 -D_TIME_BITS=64 -Wdate-time -D_FORTIFY_SOURCE=2 -std=gnu99 -MD -MT test/CMakeFiles/string_view.dir/__/src/string_view.c.o -MF CMakeFiles/string_view.dir/__/src/string_view.c.o.d -o CMakeFiles/string_view.dir/__/src/string_view.c.o -c /build/reproducible-path/cpu-features-0.9.0/src/string_view.c
 make[3]: Leaving directory '/build/reproducible-path/cpu-features-0.9.0/obj-arm-linux-gnueabihf'
-[  8%] Building C object CMakeFiles/utils.dir/src/stack_line_reader.c.o
-/usr/bin/cc -DSTACK_LINE_READER_BUFFER_SIZE=1024 -I/build/reproducible-path/cpu-features-0.9.0/include -I/build/reproducible-path/cpu-features-0.9.0/include/internal -g -O2 -Werror=implicit-function-declaration -ffile-prefix-map=/build/reproducible-path/cpu-features-0.9.0=. -fstack-protector-strong -fstack-clash-protection -Wformat -Werror=format-security -D_LARGEFILE_SOURCE -D_FILE_OFFSET_BITS=64 -D_TIME_BITS=64 -Wdate-time -D_FORTIFY_SOURCE=2 -std=gnu99 -MD -MT CMakeFiles/utils.dir/src/stack_line_reader.c.o -MF CMakeFiles/utils.dir/src/stack_line_reader.c.o.d -o CMakeFiles/utils.dir/src/stack_line_reader.c.o -c /build/reproducible-path/cpu-features-0.9.0/src/stack_line_reader.c
-[  8%] Built target unix_based_hardware_detection
-make  -f test/CMakeFiles/filesystem_for_testing.dir/build.make test/CMakeFiles/filesystem_for_testing.dir/depend
-make[3]: Entering directory '/build/reproducible-path/cpu-features-0.9.0/obj-arm-linux-gnueabihf'
-cd /build/reproducible-path/cpu-features-0.9.0/obj-arm-linux-gnueabihf && /usr/bin/cmake -E cmake_depends "Unix Makefiles" /build/reproducible-path/cpu-features-0.9.0 /build/reproducible-path/cpu-features-0.9.0/test /build/reproducible-path/cpu-features-0.9.0/obj-arm-linux-gnueabihf /build/reproducible-path/cpu-features-0.9.0/obj-arm-linux-gnueabihf/test /build/reproducible-path/cpu-features-0.9.0/obj-arm-linux-gnueabihf/test/CMakeFiles/filesystem_for_testing.dir/DependInfo.cmake "--color="
+make  -f CMakeFiles/utils.dir/build.make CMakeFiles/utils.dir/build
 make[3]: Leaving directory '/build/reproducible-path/cpu-features-0.9.0/obj-arm-linux-gnueabihf'
+[  4%] Building C object CMakeFiles/unix_based_hardware_detection.dir/src/hwcaps.c.o
+[  4%] Building C object test/CMakeFiles/string_view.dir/__/src/string_view.c.o
+/usr/bin/cc -DHAVE_DLFCN_H -DHAVE_STRONG_GETAUXVAL -DSTACK_LINE_READER_BUFFER_SIZE=1024 -I/build/reproducible-path/cpu-features-0.9.0/include -I/build/reproducible-path/cpu-features-0.9.0/include/internal -g -O2 -Werror=implicit-function-declaration -ffile-prefix-map=/build/reproducible-path/cpu-features-0.9.0=. -fstack-protector-strong -fstack-clash-protection -Wformat -Werror=format-security -D_LARGEFILE_SOURCE -D_FILE_OFFSET_BITS=64 -D_TIME_BITS=64 -Wdate-time -D_FORTIFY_SOURCE=2 -std=gnu99 -MD -MT CMakeFiles/unix_based_hardware_detection.dir/src/hwcaps.c.o -MF CMakeFiles/unix_based_hardware_detection.dir/src/hwcaps.c.o.d -o CMakeFiles/unix_based_hardware_detection.dir/src/hwcaps.c.o -c /build/reproducible-path/cpu-features-0.9.0/src/hwcaps.c
+make[3]: Entering directory '/build/reproducible-path/cpu-features-0.9.0/obj-arm-linux-gnueabihf'
 make  -f test/CMakeFiles/filesystem_for_testing.dir/build.make test/CMakeFiles/filesystem_for_testing.dir/build
+cd /build/reproducible-path/cpu-features-0.9.0/obj-arm-linux-gnueabihf/test && /usr/bin/cc -DCPU_FEATURES_TEST -I/build/reproducible-path/cpu-features-0.9.0/test/../include -g -O2 -Werror=implicit-function-declaration -ffile-prefix-map=/build/reproducible-path/cpu-features-0.9.0=. -fstack-protector-strong -fstack-clash-protection -Wformat -Werror=format-security -D_LARGEFILE_SOURCE -D_FILE_OFFSET_BITS=64 -D_TIME_BITS=64 -Wdate-time -D_FORTIFY_SOURCE=2 -std=gnu99 -MD -MT test/CMakeFiles/string_view.dir/__/src/string_view.c.o -MF CMakeFiles/string_view.dir/__/src/string_view.c.o.d -o CMakeFiles/string_view.dir/__/src/string_view.c.o -c /build/reproducible-path/cpu-features-0.9.0/src/string_view.c
 make[3]: Entering directory '/build/reproducible-path/cpu-features-0.9.0/obj-arm-linux-gnueabihf'
-[ 10%] Linking C static library libstring_view.a
-[ 12%] Building CXX object test/CMakeFiles/filesystem_for_testing.dir/filesystem_for_testing.cc.o
+[  6%] Building C object CMakeFiles/utils.dir/src/filesystem.c.o
+[  8%] Building CXX object test/CMakeFiles/filesystem_for_testing.dir/filesystem_for_testing.cc.o
+/usr/bin/cc -DSTACK_LINE_READER_BUFFER_SIZE=1024 -I/build/reproducible-path/cpu-features-0.9.0/include -I/build/reproducible-path/cpu-features-0.9.0/include/internal -g -O2 -Werror=implicit-function-declaration -ffile-prefix-map=/build/reproducible-path/cpu-features-0.9.0=. -fstack-protector-strong -fstack-clash-protection -Wformat -Werror=format-security -D_LARGEFILE_SOURCE -D_FILE_OFFSET_BITS=64 -D_TIME_BITS=64 -Wdate-time -D_FORTIFY_SOURCE=2 -std=gnu99 -MD -MT CMakeFiles/utils.dir/src/filesystem.c.o -MF CMakeFiles/utils.dir/src/filesystem.c.o.d -o CMakeFiles/utils.dir/src/filesystem.c.o -c /build/reproducible-path/cpu-features-0.9.0/src/filesystem.c
 cd /build/reproducible-path/cpu-features-0.9.0/obj-arm-linux-gnueabihf/test && /usr/bin/c++ -DCPU_FEATURES_MOCK_FILESYSTEM -DCPU_FEATURES_TEST -I/build/reproducible-path/cpu-features-0.9.0/test/../include -g -O2 -ffile-prefix-map=/build/reproducible-path/cpu-features-0.9.0=. -fstack-protector-strong -fstack-clash-protection -Wformat -Werror=format-security -D_LARGEFILE_SOURCE -D_FILE_OFFSET_BITS=64 -D_TIME_BITS=64 -Wdate-time -D_FORTIFY_SOURCE=2 -std=c++14 -MD -MT test/CMakeFiles/filesystem_for_testing.dir/filesystem_for_testing.cc.o -MF CMakeFiles/filesystem_for_testing.dir/filesystem_for_testing.cc.o.d -o CMakeFiles/filesystem_for_testing.dir/filesystem_for_testing.cc.o -c /build/reproducible-path/cpu-features-0.9.0/test/filesystem_for_testing.cc
-cd /build/reproducible-path/cpu-features-0.9.0/obj-arm-linux-gnueabihf/test && /usr/bin/cmake -P CMakeFiles/string_view.dir/cmake_clean_target.cmake
-cd /build/reproducible-path/cpu-features-0.9.0/obj-arm-linux-gnueabihf/test && /usr/bin/cmake -E cmake_link_script CMakeFiles/string_view.dir/link.txt --verbose=1
-[ 14%] Building C object CMakeFiles/utils.dir/src/string_view.c.o
-/usr/bin/cc -DSTACK_LINE_READER_BUFFER_SIZE=1024 -I/build/reproducible-path/cpu-features-0.9.0/include -I/build/reproducible-path/cpu-features-0.9.0/include/internal -g -O2 -Werror=implicit-function-declaration -ffile-prefix-map=/build/reproducible-path/cpu-features-0.9.0=. -fstack-protector-strong -fstack-clash-protection -Wformat -Werror=format-security -D_LARGEFILE_SOURCE -D_FILE_OFFSET_BITS=64 -D_TIME_BITS=64 -Wdate-time -D_FORTIFY_SOURCE=2 -std=gnu99 -MD -MT CMakeFiles/utils.dir/src/string_view.c.o -MF CMakeFiles/utils.dir/src/string_view.c.o.d -o CMakeFiles/utils.dir/src/string_view.c.o -c /build/reproducible-path/cpu-features-0.9.0/src/string_view.c
-/usr/bin/ar qc libstring_view.a CMakeFiles/string_view.dir/__/src/string_view.c.o
-/usr/bin/ranlib libstring_view.a
 make[3]: Leaving directory '/build/reproducible-path/cpu-features-0.9.0/obj-arm-linux-gnueabihf'
-[ 14%] Built target string_view
+[  8%] Built target unix_based_hardware_detection
 make  -f googletest-build/googletest/CMakeFiles/gtest.dir/build.make googletest-build/googletest/CMakeFiles/gtest.dir/depend
 make[3]: Entering directory '/build/reproducible-path/cpu-features-0.9.0/obj-arm-linux-gnueabihf'
 cd /build/reproducible-path/cpu-features-0.9.0/obj-arm-linux-gnueabihf && /usr/bin/cmake -E cmake_depends "Unix Makefiles" /build/reproducible-path/cpu-features-0.9.0 /usr/src/googletest/googletest /build/reproducible-path/cpu-features-0.9.0/obj-arm-linux-gnueabihf /build/reproducible-path/cpu-features-0.9.0/obj-arm-linux-gnueabihf/googletest-build/googletest /build/reproducible-path/cpu-features-0.9.0/obj-arm-linux-gnueabihf/googletest-build/googletest/CMakeFiles/gtest.dir/DependInfo.cmake "--color="
 make[3]: Leaving directory '/build/reproducible-path/cpu-features-0.9.0/obj-arm-linux-gnueabihf'
 make  -f googletest-build/googletest/CMakeFiles/gtest.dir/build.make googletest-build/googletest/CMakeFiles/gtest.dir/build
 make[3]: Entering directory '/build/reproducible-path/cpu-features-0.9.0/obj-arm-linux-gnueabihf'
-make[3]: Leaving directory '/build/reproducible-path/cpu-features-0.9.0/obj-arm-linux-gnueabihf'
-[ 17%] Building CXX object googletest-build/googletest/CMakeFiles/gtest.dir/src/gtest-all.cc.o
+[ 10%] Building CXX object googletest-build/googletest/CMakeFiles/gtest.dir/src/gtest-all.cc.o
 cd /build/reproducible-path/cpu-features-0.9.0/obj-arm-linux-gnueabihf/googletest-build/googletest && /usr/bin/c++  -I/usr/src/googletest/googletest/include -I/usr/src/googletest/googletest -g -O2 -ffile-prefix-map=/build/reproducible-path/cpu-features-0.9.0=. -fstack-protector-strong -fstack-clash-protection -Wformat -Werror=format-security -D_LARGEFILE_SOURCE -D_FILE_OFFSET_BITS=64 -D_TIME_BITS=64 -Wdate-time -D_FORTIFY_SOURCE=2 -std=c++14 -Wall -Wshadow -Wundef -Wno-error=dangling-else -DGTEST_HAS_PTHREAD=1 -fexceptions -Wextra -Wno-unused-parameter -Wno-missing-field-initializers -MD -MT googletest-build/googletest/CMakeFiles/gtest.dir/src/gtest-all.cc.o -MF CMakeFiles/gtest.dir/src/gtest-all.cc.o.d -o CMakeFiles/gtest.dir/src/gtest-all.cc.o -c /usr/src/googletest/googletest/src/gtest-all.cc
-[ 17%] Built target utils
+[ 12%] Building C object CMakeFiles/utils.dir/src/stack_line_reader.c.o
+/usr/bin/cc -DSTACK_LINE_READER_BUFFER_SIZE=1024 -I/build/reproducible-path/cpu-features-0.9.0/include -I/build/reproducible-path/cpu-features-0.9.0/include/internal -g -O2 -Werror=implicit-function-declaration -ffile-prefix-map=/build/reproducible-path/cpu-features-0.9.0=. -fstack-protector-strong -fstack-clash-protection -Wformat -Werror=format-security -D_LARGEFILE_SOURCE -D_FILE_OFFSET_BITS=64 -D_TIME_BITS=64 -Wdate-time -D_FORTIFY_SOURCE=2 -std=gnu99 -MD -MT CMakeFiles/utils.dir/src/stack_line_reader.c.o -MF CMakeFiles/utils.dir/src/stack_line_reader.c.o.d -o CMakeFiles/utils.dir/src/stack_line_reader.c.o -c /build/reproducible-path/cpu-features-0.9.0/src/stack_line_reader.c
+[ 14%] Linking C static library libstring_view.a
+cd /build/reproducible-path/cpu-features-0.9.0/obj-arm-linux-gnueabihf/test && /usr/bin/cmake -P CMakeFiles/string_view.dir/cmake_clean_target.cmake
+[ 16%] Building C object CMakeFiles/utils.dir/src/string_view.c.o
+/usr/bin/cc -DSTACK_LINE_READER_BUFFER_SIZE=1024 -I/build/reproducible-path/cpu-features-0.9.0/include -I/build/reproducible-path/cpu-features-0.9.0/include/internal -g -O2 -Werror=implicit-function-declaration -ffile-prefix-map=/build/reproducible-path/cpu-features-0.9.0=. -fstack-protector-strong -fstack-clash-protection -Wformat -Werror=format-security -D_LARGEFILE_SOURCE -D_FILE_OFFSET_BITS=64 -D_TIME_BITS=64 -Wdate-time -D_FORTIFY_SOURCE=2 -std=gnu99 -MD -MT CMakeFiles/utils.dir/src/string_view.c.o -MF CMakeFiles/utils.dir/src/string_view.c.o.d -o CMakeFiles/utils.dir/src/string_view.c.o -c /build/reproducible-path/cpu-features-0.9.0/src/string_view.c
+cd /build/reproducible-path/cpu-features-0.9.0/obj-arm-linux-gnueabihf/test && /usr/bin/cmake -E cmake_link_script CMakeFiles/string_view.dir/link.txt --verbose=1
+/usr/bin/ar qc libstring_view.a CMakeFiles/string_view.dir/__/src/string_view.c.o
+/usr/bin/ranlib libstring_view.a
+make[3]: Leaving directory '/build/reproducible-path/cpu-features-0.9.0/obj-arm-linux-gnueabihf'
+[ 16%] Built target string_view
 make  -f test/CMakeFiles/stack_line_reader.dir/build.make test/CMakeFiles/stack_line_reader.dir/depend
 make[3]: Entering directory '/build/reproducible-path/cpu-features-0.9.0/obj-arm-linux-gnueabihf'
 cd /build/reproducible-path/cpu-features-0.9.0/obj-arm-linux-gnueabihf && /usr/bin/cmake -E cmake_depends "Unix Makefiles" /build/reproducible-path/cpu-features-0.9.0 /build/reproducible-path/cpu-features-0.9.0/test /build/reproducible-path/cpu-features-0.9.0/obj-arm-linux-gnueabihf /build/reproducible-path/cpu-features-0.9.0/obj-arm-linux-gnueabihf/test /build/reproducible-path/cpu-features-0.9.0/obj-arm-linux-gnueabihf/test/CMakeFiles/stack_line_reader.dir/DependInfo.cmake "--color="
 make[3]: Leaving directory '/build/reproducible-path/cpu-features-0.9.0/obj-arm-linux-gnueabihf'
 make  -f test/CMakeFiles/stack_line_reader.dir/build.make test/CMakeFiles/stack_line_reader.dir/build
 make[3]: Entering directory '/build/reproducible-path/cpu-features-0.9.0/obj-arm-linux-gnueabihf'
-[ 19%] Building C object test/CMakeFiles/stack_line_reader.dir/__/src/stack_line_reader.c.o
+[ 18%] Building C object test/CMakeFiles/stack_line_reader.dir/__/src/stack_line_reader.c.o
 cd /build/reproducible-path/cpu-features-0.9.0/obj-arm-linux-gnueabihf/test && /usr/bin/cc -DCPU_FEATURES_TEST -DSTACK_LINE_READER_BUFFER_SIZE=1024 -I/build/reproducible-path/cpu-features-0.9.0/test/../include -g -O2 -Werror=implicit-function-declaration -ffile-prefix-map=/build/reproducible-path/cpu-features-0.9.0=. -fstack-protector-strong -fstack-clash-protection -Wformat -Werror=format-security -D_LARGEFILE_SOURCE -D_FILE_OFFSET_BITS=64 -D_TIME_BITS=64 -Wdate-time -D_FORTIFY_SOURCE=2 -std=gnu99 -MD -MT test/CMakeFiles/stack_line_reader.dir/__/src/stack_line_reader.c.o -MF CMakeFiles/stack_line_reader.dir/__/src/stack_line_reader.c.o.d -o CMakeFiles/stack_line_reader.dir/__/src/stack_line_reader.c.o -c /build/reproducible-path/cpu-features-0.9.0/src/stack_line_reader.c
-[ 21%] Linking C static library libstack_line_reader.a
+[ 20%] Linking C static library libstack_line_reader.a
 cd /build/reproducible-path/cpu-features-0.9.0/obj-arm-linux-gnueabihf/test && /usr/bin/cmake -P CMakeFiles/stack_line_reader.dir/cmake_clean_target.cmake
 cd /build/reproducible-path/cpu-features-0.9.0/obj-arm-linux-gnueabihf/test && /usr/bin/cmake -E cmake_link_script CMakeFiles/stack_line_reader.dir/link.txt --verbose=1
 /usr/bin/ar qc libstack_line_reader.a CMakeFiles/stack_line_reader.dir/__/src/stack_line_reader.c.o
 /usr/bin/ranlib libstack_line_reader.a
 make[3]: Leaving directory '/build/reproducible-path/cpu-features-0.9.0/obj-arm-linux-gnueabihf'
-[ 21%] Built target stack_line_reader
+[ 20%] Built target stack_line_reader
+make[3]: Leaving directory '/build/reproducible-path/cpu-features-0.9.0/obj-arm-linux-gnueabihf'
+[ 20%] Built target utils
 make  -f CMakeFiles/cpu_features.dir/build.make CMakeFiles/cpu_features.dir/depend
 make[3]: Entering directory '/build/reproducible-path/cpu-features-0.9.0/obj-arm-linux-gnueabihf'
 cd /build/reproducible-path/cpu-features-0.9.0/obj-arm-linux-gnueabihf && /usr/bin/cmake -E cmake_depends "Unix Makefiles" /build/reproducible-path/cpu-features-0.9.0 /build/reproducible-path/cpu-features-0.9.0 /build/reproducible-path/cpu-features-0.9.0/obj-arm-linux-gnueabihf /build/reproducible-path/cpu-features-0.9.0/obj-arm-linux-gnueabihf /build/reproducible-path/cpu-features-0.9.0/obj-arm-linux-gnueabihf/CMakeFiles/cpu_features.dir/DependInfo.cmake "--color="
 make[3]: Leaving directory '/build/reproducible-path/cpu-features-0.9.0/obj-arm-linux-gnueabihf'
 make  -f CMakeFiles/cpu_features.dir/build.make CMakeFiles/cpu_features.dir/build
 make[3]: Entering directory '/build/reproducible-path/cpu-features-0.9.0/obj-arm-linux-gnueabihf'
-[ 23%] Building C object CMakeFiles/cpu_features.dir/src/impl_aarch64_linux_or_android.c.o
+[ 22%] Building C object CMakeFiles/cpu_features.dir/src/impl_aarch64_linux_or_android.c.o
 /usr/bin/cc -DSTACK_LINE_READER_BUFFER_SIZE=1024 -I/build/reproducible-path/cpu-features-0.9.0/include -I/build/reproducible-path/cpu-features-0.9.0/include/internal -g -O2 -Werror=implicit-function-declaration -ffile-prefix-map=/build/reproducible-path/cpu-features-0.9.0=. -fstack-protector-strong -fstack-clash-protection -Wformat -Werror=format-security -D_LARGEFILE_SOURCE -D_FILE_OFFSET_BITS=64 -D_TIME_BITS=64 -Wdate-time -D_FORTIFY_SOURCE=2 -std=gnu99 -MD -MT CMakeFiles/cpu_features.dir/src/impl_aarch64_linux_or_android.c.o -MF CMakeFiles/cpu_features.dir/src/impl_aarch64_linux_or_android.c.o.d -o CMakeFiles/cpu_features.dir/src/impl_aarch64_linux_or_android.c.o -c /build/reproducible-path/cpu-features-0.9.0/src/impl_aarch64_linux_or_android.c
-[ 25%] Building C object CMakeFiles/cpu_features.dir/src/impl_aarch64_macos_or_iphone.c.o
+[ 24%] Building C object CMakeFiles/cpu_features.dir/src/impl_aarch64_macos_or_iphone.c.o
 /usr/bin/cc -DSTACK_LINE_READER_BUFFER_SIZE=1024 -I/build/reproducible-path/cpu-features-0.9.0/include -I/build/reproducible-path/cpu-features-0.9.0/include/internal -g -O2 -Werror=implicit-function-declaration -ffile-prefix-map=/build/reproducible-path/cpu-features-0.9.0=. -fstack-protector-strong -fstack-clash-protection -Wformat -Werror=format-security -D_LARGEFILE_SOURCE -D_FILE_OFFSET_BITS=64 -D_TIME_BITS=64 -Wdate-time -D_FORTIFY_SOURCE=2 -std=gnu99 -MD -MT CMakeFiles/cpu_features.dir/src/impl_aarch64_macos_or_iphone.c.o -MF CMakeFiles/cpu_features.dir/src/impl_aarch64_macos_or_iphone.c.o.d -o CMakeFiles/cpu_features.dir/src/impl_aarch64_macos_or_iphone.c.o -c /build/reproducible-path/cpu-features-0.9.0/src/impl_aarch64_macos_or_iphone.c
-[ 27%] Building C object CMakeFiles/cpu_features.dir/src/impl_aarch64_windows.c.o
+[ 26%] Building C object CMakeFiles/cpu_features.dir/src/impl_aarch64_windows.c.o
 /usr/bin/cc -DSTACK_LINE_READER_BUFFER_SIZE=1024 -I/build/reproducible-path/cpu-features-0.9.0/include -I/build/reproducible-path/cpu-features-0.9.0/include/internal -g -O2 -Werror=implicit-function-declaration -ffile-prefix-map=/build/reproducible-path/cpu-features-0.9.0=. -fstack-protector-strong -fstack-clash-protection -Wformat -Werror=format-security -D_LARGEFILE_SOURCE -D_FILE_OFFSET_BITS=64 -D_TIME_BITS=64 -Wdate-time -D_FORTIFY_SOURCE=2 -std=gnu99 -MD -MT CMakeFiles/cpu_features.dir/src/impl_aarch64_windows.c.o -MF CMakeFiles/cpu_features.dir/src/impl_aarch64_windows.c.o.d -o CMakeFiles/cpu_features.dir/src/impl_aarch64_windows.c.o -c /build/reproducible-path/cpu-features-0.9.0/src/impl_aarch64_windows.c
-[ 29%] Building C object CMakeFiles/cpu_features.dir/src/impl_arm_linux_or_android.c.o
+[ 28%] Building C object CMakeFiles/cpu_features.dir/src/impl_arm_linux_or_android.c.o
 /usr/bin/cc -DSTACK_LINE_READER_BUFFER_SIZE=1024 -I/build/reproducible-path/cpu-features-0.9.0/include -I/build/reproducible-path/cpu-features-0.9.0/include/internal -g -O2 -Werror=implicit-function-declaration -ffile-prefix-map=/build/reproducible-path/cpu-features-0.9.0=. -fstack-protector-strong -fstack-clash-protection -Wformat -Werror=format-security -D_LARGEFILE_SOURCE -D_FILE_OFFSET_BITS=64 -D_TIME_BITS=64 -Wdate-time -D_FORTIFY_SOURCE=2 -std=gnu99 -MD -MT CMakeFiles/cpu_features.dir/src/impl_arm_linux_or_android.c.o -MF CMakeFiles/cpu_features.dir/src/impl_arm_linux_or_android.c.o.d -o CMakeFiles/cpu_features.dir/src/impl_arm_linux_or_android.c.o -c /build/reproducible-path/cpu-features-0.9.0/src/impl_arm_linux_or_android.c
-[ 31%] Building C object CMakeFiles/cpu_features.dir/src/impl_loongarch_linux.c.o
+[ 30%] Building C object CMakeFiles/cpu_features.dir/src/impl_loongarch_linux.c.o
 /usr/bin/cc -DSTACK_LINE_READER_BUFFER_SIZE=1024 -I/build/reproducible-path/cpu-features-0.9.0/include -I/build/reproducible-path/cpu-features-0.9.0/include/internal -g -O2 -Werror=implicit-function-declaration -ffile-prefix-map=/build/reproducible-path/cpu-features-0.9.0=. -fstack-protector-strong -fstack-clash-protection -Wformat -Werror=format-security -D_LARGEFILE_SOURCE -D_FILE_OFFSET_BITS=64 -D_TIME_BITS=64 -Wdate-time -D_FORTIFY_SOURCE=2 -std=gnu99 -MD -MT CMakeFiles/cpu_features.dir/src/impl_loongarch_linux.c.o -MF CMakeFiles/cpu_features.dir/src/impl_loongarch_linux.c.o.d -o CMakeFiles/cpu_features.dir/src/impl_loongarch_linux.c.o -c /build/reproducible-path/cpu-features-0.9.0/src/impl_loongarch_linux.c
-[ 34%] Building C object CMakeFiles/cpu_features.dir/src/impl_mips_linux_or_android.c.o
+[ 32%] Building C object CMakeFiles/cpu_features.dir/src/impl_mips_linux_or_android.c.o
 /usr/bin/cc -DSTACK_LINE_READER_BUFFER_SIZE=1024 -I/build/reproducible-path/cpu-features-0.9.0/include -I/build/reproducible-path/cpu-features-0.9.0/include/internal -g -O2 -Werror=implicit-function-declaration -ffile-prefix-map=/build/reproducible-path/cpu-features-0.9.0=. -fstack-protector-strong -fstack-clash-protection -Wformat -Werror=format-security -D_LARGEFILE_SOURCE -D_FILE_OFFSET_BITS=64 -D_TIME_BITS=64 -Wdate-time -D_FORTIFY_SOURCE=2 -std=gnu99 -MD -MT CMakeFiles/cpu_features.dir/src/impl_mips_linux_or_android.c.o -MF CMakeFiles/cpu_features.dir/src/impl_mips_linux_or_android.c.o.d -o CMakeFiles/cpu_features.dir/src/impl_mips_linux_or_android.c.o -c /build/reproducible-path/cpu-features-0.9.0/src/impl_mips_linux_or_android.c
-[ 36%] Building C object CMakeFiles/cpu_features.dir/src/impl_ppc_linux.c.o
+[ 34%] Building C object CMakeFiles/cpu_features.dir/src/impl_ppc_linux.c.o
 /usr/bin/cc -DSTACK_LINE_READER_BUFFER_SIZE=1024 -I/build/reproducible-path/cpu-features-0.9.0/include -I/build/reproducible-path/cpu-features-0.9.0/include/internal -g -O2 -Werror=implicit-function-declaration -ffile-prefix-map=/build/reproducible-path/cpu-features-0.9.0=. -fstack-protector-strong -fstack-clash-protection -Wformat -Werror=format-security -D_LARGEFILE_SOURCE -D_FILE_OFFSET_BITS=64 -D_TIME_BITS=64 -Wdate-time -D_FORTIFY_SOURCE=2 -std=gnu99 -MD -MT CMakeFiles/cpu_features.dir/src/impl_ppc_linux.c.o -MF CMakeFiles/cpu_features.dir/src/impl_ppc_linux.c.o.d -o CMakeFiles/cpu_features.dir/src/impl_ppc_linux.c.o -c /build/reproducible-path/cpu-features-0.9.0/src/impl_ppc_linux.c
-[ 38%] Building C object CMakeFiles/cpu_features.dir/src/impl_riscv_linux.c.o
+[ 36%] Building C object CMakeFiles/cpu_features.dir/src/impl_riscv_linux.c.o
 /usr/bin/cc -DSTACK_LINE_READER_BUFFER_SIZE=1024 -I/build/reproducible-path/cpu-features-0.9.0/include -I/build/reproducible-path/cpu-features-0.9.0/include/internal -g -O2 -Werror=implicit-function-declaration -ffile-prefix-map=/build/reproducible-path/cpu-features-0.9.0=. -fstack-protector-strong -fstack-clash-protection -Wformat -Werror=format-security -D_LARGEFILE_SOURCE -D_FILE_OFFSET_BITS=64 -D_TIME_BITS=64 -Wdate-time -D_FORTIFY_SOURCE=2 -std=gnu99 -MD -MT CMakeFiles/cpu_features.dir/src/impl_riscv_linux.c.o -MF CMakeFiles/cpu_features.dir/src/impl_riscv_linux.c.o.d -o CMakeFiles/cpu_features.dir/src/impl_riscv_linux.c.o -c /build/reproducible-path/cpu-features-0.9.0/src/impl_riscv_linux.c
-[ 40%] Building C object CMakeFiles/cpu_features.dir/src/impl_s390x_linux.c.o
+[ 38%] Building C object CMakeFiles/cpu_features.dir/src/impl_s390x_linux.c.o
 /usr/bin/cc -DSTACK_LINE_READER_BUFFER_SIZE=1024 -I/build/reproducible-path/cpu-features-0.9.0/include -I/build/reproducible-path/cpu-features-0.9.0/include/internal -g -O2 -Werror=implicit-function-declaration -ffile-prefix-map=/build/reproducible-path/cpu-features-0.9.0=. -fstack-protector-strong -fstack-clash-protection -Wformat -Werror=format-security -D_LARGEFILE_SOURCE -D_FILE_OFFSET_BITS=64 -D_TIME_BITS=64 -Wdate-time -D_FORTIFY_SOURCE=2 -std=gnu99 -MD -MT CMakeFiles/cpu_features.dir/src/impl_s390x_linux.c.o -MF CMakeFiles/cpu_features.dir/src/impl_s390x_linux.c.o.d -o CMakeFiles/cpu_features.dir/src/impl_s390x_linux.c.o -c /build/reproducible-path/cpu-features-0.9.0/src/impl_s390x_linux.c
-[ 42%] Linking CXX static library libfilesystem_for_testing.a
+[ 40%] Building C object CMakeFiles/cpu_features.dir/src/impl_x86_freebsd.c.o
+[ 42%] Building C object CMakeFiles/cpu_features.dir/src/impl_x86_linux_or_android.c.o
+/usr/bin/cc -DSTACK_LINE_READER_BUFFER_SIZE=1024 -I/build/reproducible-path/cpu-features-0.9.0/include -I/build/reproducible-path/cpu-features-0.9.0/include/internal -g -O2 -Werror=implicit-function-declaration -ffile-prefix-map=/build/reproducible-path/cpu-features-0.9.0=. -fstack-protector-strong -fstack-clash-protection -Wformat -Werror=format-security -D_LARGEFILE_SOURCE -D_FILE_OFFSET_BITS=64 -D_TIME_BITS=64 -Wdate-time -D_FORTIFY_SOURCE=2 -std=gnu99 -MD -MT CMakeFiles/cpu_features.dir/src/impl_x86_linux_or_android.c.o -MF CMakeFiles/cpu_features.dir/src/impl_x86_linux_or_android.c.o.d -o CMakeFiles/cpu_features.dir/src/impl_x86_linux_or_android.c.o -c /build/reproducible-path/cpu-features-0.9.0/src/impl_x86_linux_or_android.c
+/usr/bin/cc -DSTACK_LINE_READER_BUFFER_SIZE=1024 -I/build/reproducible-path/cpu-features-0.9.0/include -I/build/reproducible-path/cpu-features-0.9.0/include/internal -g -O2 -Werror=implicit-function-declaration -ffile-prefix-map=/build/reproducible-path/cpu-features-0.9.0=. -fstack-protector-strong -fstack-clash-protection -Wformat -Werror=format-security -D_LARGEFILE_SOURCE -D_FILE_OFFSET_BITS=64 -D_TIME_BITS=64 -Wdate-time -D_FORTIFY_SOURCE=2 -std=gnu99 -MD -MT CMakeFiles/cpu_features.dir/src/impl_x86_freebsd.c.o -MF CMakeFiles/cpu_features.dir/src/impl_x86_freebsd.c.o.d -o CMakeFiles/cpu_features.dir/src/impl_x86_freebsd.c.o -c /build/reproducible-path/cpu-features-0.9.0/src/impl_x86_freebsd.c
+[ 44%] Building C object CMakeFiles/cpu_features.dir/src/impl_x86_macos.c.o
+/usr/bin/cc -DSTACK_LINE_READER_BUFFER_SIZE=1024 -I/build/reproducible-path/cpu-features-0.9.0/include -I/build/reproducible-path/cpu-features-0.9.0/include/internal -g -O2 -Werror=implicit-function-declaration -ffile-prefix-map=/build/reproducible-path/cpu-features-0.9.0=. -fstack-protector-strong -fstack-clash-protection -Wformat -Werror=format-security -D_LARGEFILE_SOURCE -D_FILE_OFFSET_BITS=64 -D_TIME_BITS=64 -Wdate-time -D_FORTIFY_SOURCE=2 -std=gnu99 -MD -MT CMakeFiles/cpu_features.dir/src/impl_x86_macos.c.o -MF CMakeFiles/cpu_features.dir/src/impl_x86_macos.c.o.d -o CMakeFiles/cpu_features.dir/src/impl_x86_macos.c.o -c /build/reproducible-path/cpu-features-0.9.0/src/impl_x86_macos.c
+[ 46%] Building C object CMakeFiles/cpu_features.dir/src/impl_x86_windows.c.o
+/usr/bin/cc -DSTACK_LINE_READER_BUFFER_SIZE=1024 -I/build/reproducible-path/cpu-features-0.9.0/include -I/build/reproducible-path/cpu-features-0.9.0/include/internal -g -O2 -Werror=implicit-function-declaration -ffile-prefix-map=/build/reproducible-path/cpu-features-0.9.0=. -fstack-protector-strong -fstack-clash-protection -Wformat -Werror=format-security -D_LARGEFILE_SOURCE -D_FILE_OFFSET_BITS=64 -D_TIME_BITS=64 -Wdate-time -D_FORTIFY_SOURCE=2 -std=gnu99 -MD -MT CMakeFiles/cpu_features.dir/src/impl_x86_windows.c.o -MF CMakeFiles/cpu_features.dir/src/impl_x86_windows.c.o.d -o CMakeFiles/cpu_features.dir/src/impl_x86_windows.c.o -c /build/reproducible-path/cpu-features-0.9.0/src/impl_x86_windows.c
+[ 48%] Linking C static library libcpu_features.a
+/usr/bin/cmake -P CMakeFiles/cpu_features.dir/cmake_clean_target.cmake
+/usr/bin/cmake -E cmake_link_script CMakeFiles/cpu_features.dir/link.txt --verbose=1
+[ 51%] Linking CXX static library libfilesystem_for_testing.a
 cd /build/reproducible-path/cpu-features-0.9.0/obj-arm-linux-gnueabihf/test && /usr/bin/cmake -P CMakeFiles/filesystem_for_testing.dir/cmake_clean_target.cmake
 cd /build/reproducible-path/cpu-features-0.9.0/obj-arm-linux-gnueabihf/test && /usr/bin/cmake -E cmake_link_script CMakeFiles/filesystem_for_testing.dir/link.txt --verbose=1
-[ 44%] Building C object CMakeFiles/cpu_features.dir/src/impl_x86_freebsd.c.o
-/usr/bin/cc -DSTACK_LINE_READER_BUFFER_SIZE=1024 -I/build/reproducible-path/cpu-features-0.9.0/include -I/build/reproducible-path/cpu-features-0.9.0/include/internal -g -O2 -Werror=implicit-function-declaration -ffile-prefix-map=/build/reproducible-path/cpu-features-0.9.0=. -fstack-protector-strong -fstack-clash-protection -Wformat -Werror=format-security -D_LARGEFILE_SOURCE -D_FILE_OFFSET_BITS=64 -D_TIME_BITS=64 -Wdate-time -D_FORTIFY_SOURCE=2 -std=gnu99 -MD -MT CMakeFiles/cpu_features.dir/src/impl_x86_freebsd.c.o -MF CMakeFiles/cpu_features.dir/src/impl_x86_freebsd.c.o.d -o CMakeFiles/cpu_features.dir/src/impl_x86_freebsd.c.o -c /build/reproducible-path/cpu-features-0.9.0/src/impl_x86_freebsd.c
+/usr/bin/ar qc libcpu_features.a CMakeFiles/cpu_features.dir/src/impl_aarch64_linux_or_android.c.o CMakeFiles/cpu_features.dir/src/impl_aarch64_macos_or_iphone.c.o CMakeFiles/cpu_features.dir/src/impl_aarch64_windows.c.o CMakeFiles/cpu_features.dir/src/impl_arm_linux_or_android.c.o CMakeFiles/cpu_features.dir/src/impl_loongarch_linux.c.o CMakeFiles/cpu_features.dir/src/impl_mips_linux_or_android.c.o CMakeFiles/cpu_features.dir/src/impl_ppc_linux.c.o CMakeFiles/cpu_features.dir/src/impl_riscv_linux.c.o CMakeFiles/cpu_features.dir/src/impl_s390x_linux.c.o CMakeFiles/cpu_features.dir/src/impl_x86_freebsd.c.o CMakeFiles/cpu_features.dir/src/impl_x86_linux_or_android.c.o CMakeFiles/cpu_features.dir/src/impl_x86_macos.c.o CMakeFiles/cpu_features.dir/src/impl_x86_windows.c.o CMakeFiles/utils.dir/src/filesystem.c.o CMakeFiles/utils.dir/src/stack_line_reader.c.o CMakeFiles/utils.dir/src/string_view.c.o CMakeFiles/unix_based_hardware_detection.dir/src/hwcaps.c.o
+/usr/bin/ranlib libcpu_features.a
+make[3]: Leaving directory '/build/reproducible-path/cpu-features-0.9.0/obj-arm-linux-gnueabihf'
+[ 51%] Built target cpu_features
 /usr/bin/ar qc libfilesystem_for_testing.a CMakeFiles/filesystem_for_testing.dir/filesystem_for_testing.cc.o
 /usr/bin/ranlib libfilesystem_for_testing.a
 make[3]: Leaving directory '/build/reproducible-path/cpu-features-0.9.0/obj-arm-linux-gnueabihf'
-[ 46%] Building C object CMakeFiles/cpu_features.dir/src/impl_x86_linux_or_android.c.o
-/usr/bin/cc -DSTACK_LINE_READER_BUFFER_SIZE=1024 -I/build/reproducible-path/cpu-features-0.9.0/include -I/build/reproducible-path/cpu-features-0.9.0/include/internal -g -O2 -Werror=implicit-function-declaration -ffile-prefix-map=/build/reproducible-path/cpu-features-0.9.0=. -fstack-protector-strong -fstack-clash-protection -Wformat -Werror=format-security -D_LARGEFILE_SOURCE -D_FILE_OFFSET_BITS=64 -D_TIME_BITS=64 -Wdate-time -D_FORTIFY_SOURCE=2 -std=gnu99 -MD -MT CMakeFiles/cpu_features.dir/src/impl_x86_linux_or_android.c.o -MF CMakeFiles/cpu_features.dir/src/impl_x86_linux_or_android.c.o.d -o CMakeFiles/cpu_features.dir/src/impl_x86_linux_or_android.c.o -c /build/reproducible-path/cpu-features-0.9.0/src/impl_x86_linux_or_android.c
-[ 46%] Built target filesystem_for_testing
+[ 51%] Built target filesystem_for_testing
 make  -f test/CMakeFiles/hwcaps_for_testing.dir/build.make test/CMakeFiles/hwcaps_for_testing.dir/depend
+make  -f test/CMakeFiles/stack_line_reader_for_test.dir/build.make test/CMakeFiles/stack_line_reader_for_test.dir/depend
 make[3]: Entering directory '/build/reproducible-path/cpu-features-0.9.0/obj-arm-linux-gnueabihf'
 cd /build/reproducible-path/cpu-features-0.9.0/obj-arm-linux-gnueabihf && /usr/bin/cmake -E cmake_depends "Unix Makefiles" /build/reproducible-path/cpu-features-0.9.0 /build/reproducible-path/cpu-features-0.9.0/test /build/reproducible-path/cpu-features-0.9.0/obj-arm-linux-gnueabihf /build/reproducible-path/cpu-features-0.9.0/obj-arm-linux-gnueabihf/test /build/reproducible-path/cpu-features-0.9.0/obj-arm-linux-gnueabihf/test/CMakeFiles/hwcaps_for_testing.dir/DependInfo.cmake "--color="
+make[3]: Entering directory '/build/reproducible-path/cpu-features-0.9.0/obj-arm-linux-gnueabihf'
+cd /build/reproducible-path/cpu-features-0.9.0/obj-arm-linux-gnueabihf && /usr/bin/cmake -E cmake_depends "Unix Makefiles" /build/reproducible-path/cpu-features-0.9.0 /build/reproducible-path/cpu-features-0.9.0/test /build/reproducible-path/cpu-features-0.9.0/obj-arm-linux-gnueabihf /build/reproducible-path/cpu-features-0.9.0/obj-arm-linux-gnueabihf/test /build/reproducible-path/cpu-features-0.9.0/obj-arm-linux-gnueabihf/test/CMakeFiles/stack_line_reader_for_test.dir/DependInfo.cmake "--color="
+make[3]: Leaving directory '/build/reproducible-path/cpu-features-0.9.0/obj-arm-linux-gnueabihf'
 make[3]: Leaving directory '/build/reproducible-path/cpu-features-0.9.0/obj-arm-linux-gnueabihf'
 make  -f test/CMakeFiles/hwcaps_for_testing.dir/build.make test/CMakeFiles/hwcaps_for_testing.dir/build
 make[3]: Entering directory '/build/reproducible-path/cpu-features-0.9.0/obj-arm-linux-gnueabihf'
-[ 48%] Building CXX object test/CMakeFiles/hwcaps_for_testing.dir/hwcaps_for_testing.cc.o
+make  -f test/CMakeFiles/stack_line_reader_for_test.dir/build.make test/CMakeFiles/stack_line_reader_for_test.dir/build
+make[3]: Entering directory '/build/reproducible-path/cpu-features-0.9.0/obj-arm-linux-gnueabihf'
+[ 53%] Building CXX object test/CMakeFiles/hwcaps_for_testing.dir/hwcaps_for_testing.cc.o
+[ 55%] Building C object test/CMakeFiles/stack_line_reader_for_test.dir/__/src/stack_line_reader.c.o
 cd /build/reproducible-path/cpu-features-0.9.0/obj-arm-linux-gnueabihf/test && /usr/bin/c++ -DCPU_FEATURES_MOCK_FILESYSTEM -DCPU_FEATURES_TEST -I/build/reproducible-path/cpu-features-0.9.0/test/../include -g -O2 -ffile-prefix-map=/build/reproducible-path/cpu-features-0.9.0=. -fstack-protector-strong -fstack-clash-protection -Wformat -Werror=format-security -D_LARGEFILE_SOURCE -D_FILE_OFFSET_BITS=64 -D_TIME_BITS=64 -Wdate-time -D_FORTIFY_SOURCE=2 -std=c++14 -MD -MT test/CMakeFiles/hwcaps_for_testing.dir/hwcaps_for_testing.cc.o -MF CMakeFiles/hwcaps_for_testing.dir/hwcaps_for_testing.cc.o.d -o CMakeFiles/hwcaps_for_testing.dir/hwcaps_for_testing.cc.o -c /build/reproducible-path/cpu-features-0.9.0/test/hwcaps_for_testing.cc
-[ 51%] Building C object CMakeFiles/cpu_features.dir/src/impl_x86_macos.c.o
-/usr/bin/cc -DSTACK_LINE_READER_BUFFER_SIZE=1024 -I/build/reproducible-path/cpu-features-0.9.0/include -I/build/reproducible-path/cpu-features-0.9.0/include/internal -g -O2 -Werror=implicit-function-declaration -ffile-prefix-map=/build/reproducible-path/cpu-features-0.9.0=. -fstack-protector-strong -fstack-clash-protection -Wformat -Werror=format-security -D_LARGEFILE_SOURCE -D_FILE_OFFSET_BITS=64 -D_TIME_BITS=64 -Wdate-time -D_FORTIFY_SOURCE=2 -std=gnu99 -MD -MT CMakeFiles/cpu_features.dir/src/impl_x86_macos.c.o -MF CMakeFiles/cpu_features.dir/src/impl_x86_macos.c.o.d -o CMakeFiles/cpu_features.dir/src/impl_x86_macos.c.o -c /build/reproducible-path/cpu-features-0.9.0/src/impl_x86_macos.c
-[ 53%] Building C object CMakeFiles/cpu_features.dir/src/impl_x86_windows.c.o
-/usr/bin/cc -DSTACK_LINE_READER_BUFFER_SIZE=1024 -I/build/reproducible-path/cpu-features-0.9.0/include -I/build/reproducible-path/cpu-features-0.9.0/include/internal -g -O2 -Werror=implicit-function-declaration -ffile-prefix-map=/build/reproducible-path/cpu-features-0.9.0=. -fstack-protector-strong -fstack-clash-protection -Wformat -Werror=format-security -D_LARGEFILE_SOURCE -D_FILE_OFFSET_BITS=64 -D_TIME_BITS=64 -Wdate-time -D_FORTIFY_SOURCE=2 -std=gnu99 -MD -MT CMakeFiles/cpu_features.dir/src/impl_x86_windows.c.o -MF CMakeFiles/cpu_features.dir/src/impl_x86_windows.c.o.d -o CMakeFiles/cpu_features.dir/src/impl_x86_windows.c.o -c /build/reproducible-path/cpu-features-0.9.0/src/impl_x86_windows.c
-[ 55%] Linking CXX static library libhwcaps_for_testing.a
+cd /build/reproducible-path/cpu-features-0.9.0/obj-arm-linux-gnueabihf/test && /usr/bin/cc -DCPU_FEATURES_MOCK_FILESYSTEM -DCPU_FEATURES_TEST -DSTACK_LINE_READER_BUFFER_SIZE=16 -I/build/reproducible-path/cpu-features-0.9.0/test/../include -g -O2 -Werror=implicit-function-declaration -ffile-prefix-map=/build/reproducible-path/cpu-features-0.9.0=. -fstack-protector-strong -fstack-clash-protection -Wformat -Werror=format-security -D_LARGEFILE_SOURCE -D_FILE_OFFSET_BITS=64 -D_TIME_BITS=64 -Wdate-time -D_FORTIFY_SOURCE=2 -std=gnu99 -MD -MT test/CMakeFiles/stack_line_reader_for_test.dir/__/src/stack_line_reader.c.o -MF CMakeFiles/stack_line_reader_for_test.dir/__/src/stack_line_reader.c.o.d -o CMakeFiles/stack_line_reader_for_test.dir/__/src/stack_line_reader.c.o -c /build/reproducible-path/cpu-features-0.9.0/src/stack_line_reader.c
+[ 57%] Linking CXX static library libhwcaps_for_testing.a
 cd /build/reproducible-path/cpu-features-0.9.0/obj-arm-linux-gnueabihf/test && /usr/bin/cmake -P CMakeFiles/hwcaps_for_testing.dir/cmake_clean_target.cmake
+[ 59%] Linking CXX static library libstack_line_reader_for_test.a
+cd /build/reproducible-path/cpu-features-0.9.0/obj-arm-linux-gnueabihf/test && /usr/bin/cmake -P CMakeFiles/stack_line_reader_for_test.dir/cmake_clean_target.cmake
 cd /build/reproducible-path/cpu-features-0.9.0/obj-arm-linux-gnueabihf/test && /usr/bin/cmake -E cmake_link_script CMakeFiles/hwcaps_for_testing.dir/link.txt --verbose=1
-[ 57%] Linking C static library libcpu_features.a
-/usr/bin/cmake -P CMakeFiles/cpu_features.dir/cmake_clean_target.cmake
-/usr/bin/cmake -E cmake_link_script CMakeFiles/cpu_features.dir/link.txt --verbose=1
+cd /build/reproducible-path/cpu-features-0.9.0/obj-arm-linux-gnueabihf/test && /usr/bin/cmake -E cmake_link_script CMakeFiles/stack_line_reader_for_test.dir/link.txt --verbose=1
 /usr/bin/ar qc libhwcaps_for_testing.a CMakeFiles/hwcaps_for_testing.dir/hwcaps_for_testing.cc.o
 /usr/bin/ranlib libhwcaps_for_testing.a
 make[3]: Leaving directory '/build/reproducible-path/cpu-features-0.9.0/obj-arm-linux-gnueabihf'
-[ 57%] Built target hwcaps_for_testing
-/usr/bin/ar qc libcpu_features.a CMakeFiles/cpu_features.dir/src/impl_aarch64_linux_or_android.c.o CMakeFiles/cpu_features.dir/src/impl_aarch64_macos_or_iphone.c.o CMakeFiles/cpu_features.dir/src/impl_aarch64_windows.c.o CMakeFiles/cpu_features.dir/src/impl_arm_linux_or_android.c.o CMakeFiles/cpu_features.dir/src/impl_loongarch_linux.c.o CMakeFiles/cpu_features.dir/src/impl_mips_linux_or_android.c.o CMakeFiles/cpu_features.dir/src/impl_ppc_linux.c.o CMakeFiles/cpu_features.dir/src/impl_riscv_linux.c.o CMakeFiles/cpu_features.dir/src/impl_s390x_linux.c.o CMakeFiles/cpu_features.dir/src/impl_x86_freebsd.c.o CMakeFiles/cpu_features.dir/src/impl_x86_linux_or_android.c.o CMakeFiles/cpu_features.dir/src/impl_x86_macos.c.o CMakeFiles/cpu_features.dir/src/impl_x86_windows.c.o CMakeFiles/utils.dir/src/filesystem.c.o CMakeFiles/utils.dir/src/stack_line_reader.c.o CMakeFiles/utils.dir/src/string_view.c.o CMakeFiles/unix_based_hardware_detection.dir/src/hwcaps.c.o
-/usr/bin/ranlib libcpu_features.a
-make[3]: Leaving directory '/build/reproducible-path/cpu-features-0.9.0/obj-arm-linux-gnueabihf'
-make  -f test/CMakeFiles/stack_line_reader_for_test.dir/build.make test/CMakeFiles/stack_line_reader_for_test.dir/depend
-make[3]: Entering directory '/build/reproducible-path/cpu-features-0.9.0/obj-arm-linux-gnueabihf'
-cd /build/reproducible-path/cpu-features-0.9.0/obj-arm-linux-gnueabihf && /usr/bin/cmake -E cmake_depends "Unix Makefiles" /build/reproducible-path/cpu-features-0.9.0 /build/reproducible-path/cpu-features-0.9.0/test /build/reproducible-path/cpu-features-0.9.0/obj-arm-linux-gnueabihf /build/reproducible-path/cpu-features-0.9.0/obj-arm-linux-gnueabihf/test /build/reproducible-path/cpu-features-0.9.0/obj-arm-linux-gnueabihf/test/CMakeFiles/stack_line_reader_for_test.dir/DependInfo.cmake "--color="
+/usr/bin/ar qc libstack_line_reader_for_test.a CMakeFiles/stack_line_reader_for_test.dir/__/src/stack_line_reader.c.o
+/usr/bin/ranlib libstack_line_reader_for_test.a
 make[3]: Leaving directory '/build/reproducible-path/cpu-features-0.9.0/obj-arm-linux-gnueabihf'
-make  -f test/CMakeFiles/stack_line_reader_for_test.dir/build.make test/CMakeFiles/stack_line_reader_for_test.dir/build
-make[3]: Entering directory '/build/reproducible-path/cpu-features-0.9.0/obj-arm-linux-gnueabihf'
-[ 59%] Building C object test/CMakeFiles/stack_line_reader_for_test.dir/__/src/stack_line_reader.c.o
-cd /build/reproducible-path/cpu-features-0.9.0/obj-arm-linux-gnueabihf/test && /usr/bin/cc -DCPU_FEATURES_MOCK_FILESYSTEM -DCPU_FEATURES_TEST -DSTACK_LINE_READER_BUFFER_SIZE=16 -I/build/reproducible-path/cpu-features-0.9.0/test/../include -g -O2 -Werror=implicit-function-declaration -ffile-prefix-map=/build/reproducible-path/cpu-features-0.9.0=. -fstack-protector-strong -fstack-clash-protection -Wformat -Werror=format-security -D_LARGEFILE_SOURCE -D_FILE_OFFSET_BITS=64 -D_TIME_BITS=64 -Wdate-time -D_FORTIFY_SOURCE=2 -std=gnu99 -MD -MT test/CMakeFiles/stack_line_reader_for_test.dir/__/src/stack_line_reader.c.o -MF CMakeFiles/stack_line_reader_for_test.dir/__/src/stack_line_reader.c.o.d -o CMakeFiles/stack_line_reader_for_test.dir/__/src/stack_line_reader.c.o -c /build/reproducible-path/cpu-features-0.9.0/src/stack_line_reader.c
-[ 59%] Built target cpu_features
+[ 59%] Built target hwcaps_for_testing
 make  -f test/CMakeFiles/all_libraries.dir/build.make test/CMakeFiles/all_libraries.dir/depend
 make[3]: Entering directory '/build/reproducible-path/cpu-features-0.9.0/obj-arm-linux-gnueabihf'
 cd /build/reproducible-path/cpu-features-0.9.0/obj-arm-linux-gnueabihf && /usr/bin/cmake -E cmake_depends "Unix Makefiles" /build/reproducible-path/cpu-features-0.9.0 /build/reproducible-path/cpu-features-0.9.0/test /build/reproducible-path/cpu-features-0.9.0/obj-arm-linux-gnueabihf /build/reproducible-path/cpu-features-0.9.0/obj-arm-linux-gnueabihf/test /build/reproducible-path/cpu-features-0.9.0/obj-arm-linux-gnueabihf/test/CMakeFiles/all_libraries.dir/DependInfo.cmake "--color="
+[ 59%] Built target stack_line_reader_for_test
 make[3]: Leaving directory '/build/reproducible-path/cpu-features-0.9.0/obj-arm-linux-gnueabihf'
 make  -f test/CMakeFiles/all_libraries.dir/build.make test/CMakeFiles/all_libraries.dir/build
 make[3]: Entering directory '/build/reproducible-path/cpu-features-0.9.0/obj-arm-linux-gnueabihf'
-[ 61%] Building C object test/CMakeFiles/all_libraries.dir/__/src/hwcaps.c.o
-cd /build/reproducible-path/cpu-features-0.9.0/obj-arm-linux-gnueabihf/test && /usr/bin/cc -DCPU_FEATURES_MOCK_FILESYSTEM -DCPU_FEATURES_TEST -DSTACK_LINE_READER_BUFFER_SIZE=1024 -I/build/reproducible-path/cpu-features-0.9.0/test/../include -g -O2 -Werror=implicit-function-declaration -ffile-prefix-map=/build/reproducible-path/cpu-features-0.9.0=. -fstack-protector-strong -fstack-clash-protection -Wformat -Werror=format-security -D_LARGEFILE_SOURCE -D_FILE_OFFSET_BITS=64 -D_TIME_BITS=64 -Wdate-time -D_FORTIFY_SOURCE=2 -std=gnu99 -MD -MT test/CMakeFiles/all_libraries.dir/__/src/hwcaps.c.o -MF CMakeFiles/all_libraries.dir/__/src/hwcaps.c.o.d -o CMakeFiles/all_libraries.dir/__/src/hwcaps.c.o -c /build/reproducible-path/cpu-features-0.9.0/src/hwcaps.c
-[ 63%] Linking CXX static library libstack_line_reader_for_test.a
-cd /build/reproducible-path/cpu-features-0.9.0/obj-arm-linux-gnueabihf/test && /usr/bin/cmake -P CMakeFiles/stack_line_reader_for_test.dir/cmake_clean_target.cmake
-cd /build/reproducible-path/cpu-features-0.9.0/obj-arm-linux-gnueabihf/test && /usr/bin/cmake -E cmake_link_script CMakeFiles/stack_line_reader_for_test.dir/link.txt --verbose=1
-[ 65%] Building C object test/CMakeFiles/all_libraries.dir/__/src/stack_line_reader.c.o
+[ 63%] Building C object test/CMakeFiles/all_libraries.dir/__/src/stack_line_reader.c.o
+[ 63%] Building C object test/CMakeFiles/all_libraries.dir/__/src/hwcaps.c.o
 cd /build/reproducible-path/cpu-features-0.9.0/obj-arm-linux-gnueabihf/test && /usr/bin/cc -DCPU_FEATURES_MOCK_FILESYSTEM -DCPU_FEATURES_TEST -DSTACK_LINE_READER_BUFFER_SIZE=1024 -I/build/reproducible-path/cpu-features-0.9.0/test/../include -g -O2 -Werror=implicit-function-declaration -ffile-prefix-map=/build/reproducible-path/cpu-features-0.9.0=. -fstack-protector-strong -fstack-clash-protection -Wformat -Werror=format-security -D_LARGEFILE_SOURCE -D_FILE_OFFSET_BITS=64 -D_TIME_BITS=64 -Wdate-time -D_FORTIFY_SOURCE=2 -std=gnu99 -MD -MT test/CMakeFiles/all_libraries.dir/__/src/stack_line_reader.c.o -MF CMakeFiles/all_libraries.dir/__/src/stack_line_reader.c.o.d -o CMakeFiles/all_libraries.dir/__/src/stack_line_reader.c.o -c /build/reproducible-path/cpu-features-0.9.0/src/stack_line_reader.c
-/usr/bin/ar qc libstack_line_reader_for_test.a CMakeFiles/stack_line_reader_for_test.dir/__/src/stack_line_reader.c.o
-/usr/bin/ranlib libstack_line_reader_for_test.a
-make[3]: Leaving directory '/build/reproducible-path/cpu-features-0.9.0/obj-arm-linux-gnueabihf'
-[ 65%] Built target stack_line_reader_for_test
-[ 68%] Linking CXX static library liball_libraries.a
+cd /build/reproducible-path/cpu-features-0.9.0/obj-arm-linux-gnueabihf/test && /usr/bin/cc -DCPU_FEATURES_MOCK_FILESYSTEM -DCPU_FEATURES_TEST -DSTACK_LINE_READER_BUFFER_SIZE=1024 -I/build/reproducible-path/cpu-features-0.9.0/test/../include -g -O2 -Werror=implicit-function-declaration -ffile-prefix-map=/build/reproducible-path/cpu-features-0.9.0=. -fstack-protector-strong -fstack-clash-protection -Wformat -Werror=format-security -D_LARGEFILE_SOURCE -D_FILE_OFFSET_BITS=64 -D_TIME_BITS=64 -Wdate-time -D_FORTIFY_SOURCE=2 -std=gnu99 -MD -MT test/CMakeFiles/all_libraries.dir/__/src/hwcaps.c.o -MF CMakeFiles/all_libraries.dir/__/src/hwcaps.c.o.d -o CMakeFiles/all_libraries.dir/__/src/hwcaps.c.o -c /build/reproducible-path/cpu-features-0.9.0/src/hwcaps.c
+[ 65%] Linking CXX static library liball_libraries.a
 cd /build/reproducible-path/cpu-features-0.9.0/obj-arm-linux-gnueabihf/test && /usr/bin/cmake -P CMakeFiles/all_libraries.dir/cmake_clean_target.cmake
 cd /build/reproducible-path/cpu-features-0.9.0/obj-arm-linux-gnueabihf/test && /usr/bin/cmake -E cmake_link_script CMakeFiles/all_libraries.dir/link.txt --verbose=1
 /usr/bin/ar qc liball_libraries.a CMakeFiles/all_libraries.dir/__/src/hwcaps.c.o CMakeFiles/all_libraries.dir/__/src/stack_line_reader.c.o
 /usr/bin/ranlib liball_libraries.a
 make[3]: Leaving directory '/build/reproducible-path/cpu-features-0.9.0/obj-arm-linux-gnueabihf'
-[ 68%] Built target all_libraries
-[ 70%] Linking CXX static library ../../lib/libgtest.a
+[ 65%] Built target all_libraries
+[ 67%] Linking CXX static library ../../lib/libgtest.a
 cd /build/reproducible-path/cpu-features-0.9.0/obj-arm-linux-gnueabihf/googletest-build/googletest && /usr/bin/cmake -P CMakeFiles/gtest.dir/cmake_clean_target.cmake
 cd /build/reproducible-path/cpu-features-0.9.0/obj-arm-linux-gnueabihf/googletest-build/googletest && /usr/bin/cmake -E cmake_link_script CMakeFiles/gtest.dir/link.txt --verbose=1
 /usr/bin/ar qc ../../lib/libgtest.a "CMakeFiles/gtest.dir/src/gtest-all.cc.o"
 /usr/bin/ranlib ../../lib/libgtest.a
 make[3]: Leaving directory '/build/reproducible-path/cpu-features-0.9.0/obj-arm-linux-gnueabihf'
-[ 70%] Built target gtest
+[ 67%] Built target gtest
 make  -f googletest-build/googlemock/CMakeFiles/gmock.dir/build.make googletest-build/googlemock/CMakeFiles/gmock.dir/depend
 make[3]: Entering directory '/build/reproducible-path/cpu-features-0.9.0/obj-arm-linux-gnueabihf'
 cd /build/reproducible-path/cpu-features-0.9.0/obj-arm-linux-gnueabihf && /usr/bin/cmake -E cmake_depends "Unix Makefiles" /build/reproducible-path/cpu-features-0.9.0 /usr/src/googletest/googlemock /build/reproducible-path/cpu-features-0.9.0/obj-arm-linux-gnueabihf /build/reproducible-path/cpu-features-0.9.0/obj-arm-linux-gnueabihf/googletest-build/googlemock /build/reproducible-path/cpu-features-0.9.0/obj-arm-linux-gnueabihf/googletest-build/googlemock/CMakeFiles/gmock.dir/DependInfo.cmake "--color="
 make[3]: Leaving directory '/build/reproducible-path/cpu-features-0.9.0/obj-arm-linux-gnueabihf'
 make  -f googletest-build/googlemock/CMakeFiles/gmock.dir/build.make googletest-build/googlemock/CMakeFiles/gmock.dir/build
 make[3]: Entering directory '/build/reproducible-path/cpu-features-0.9.0/obj-arm-linux-gnueabihf'
-[ 72%] Building CXX object googletest-build/googlemock/CMakeFiles/gmock.dir/src/gmock-all.cc.o
+[ 69%] Building CXX object googletest-build/googlemock/CMakeFiles/gmock.dir/src/gmock-all.cc.o
 cd /build/reproducible-path/cpu-features-0.9.0/obj-arm-linux-gnueabihf/googletest-build/googlemock && /usr/bin/c++  -I/usr/src/googletest/googlemock/include -I/usr/src/googletest/googlemock -isystem /usr/src/googletest/googletest/include -isystem /usr/src/googletest/googletest -g -O2 -ffile-prefix-map=/build/reproducible-path/cpu-features-0.9.0=. -fstack-protector-strong -fstack-clash-protection -Wformat -Werror=format-security -D_LARGEFILE_SOURCE -D_FILE_OFFSET_BITS=64 -D_TIME_BITS=64 -Wdate-time -D_FORTIFY_SOURCE=2 -std=c++14 -Wall -Wshadow -Wundef -Wno-error=dangling-else -DGTEST_HAS_PTHREAD=1 -fexceptions -Wextra -Wno-unused-parameter -Wno-missing-field-initializers -DGTEST_HAS_PTHREAD=1 -MD -MT googletest-build/googlemock/CMakeFiles/gmock.dir/src/gmock-all.cc.o -MF CMakeFiles/gmock.dir/src/gmock-all.cc.o.d -o CMakeFiles/gmock.dir/src/gmock-all.cc.o -c /usr/src/googletest/googlemock/src/gmock-all.cc
-[ 74%] Linking CXX static library ../../lib/libgmock.a
+[ 71%] Linking CXX static library ../../lib/libgmock.a
 cd /build/reproducible-path/cpu-features-0.9.0/obj-arm-linux-gnueabihf/googletest-build/googlemock && /usr/bin/cmake -P CMakeFiles/gmock.dir/cmake_clean_target.cmake
 cd /build/reproducible-path/cpu-features-0.9.0/obj-arm-linux-gnueabihf/googletest-build/googlemock && /usr/bin/cmake -E cmake_link_script CMakeFiles/gmock.dir/link.txt --verbose=1
 /usr/bin/ar qc ../../lib/libgmock.a "CMakeFiles/gmock.dir/src/gmock-all.cc.o"
 /usr/bin/ranlib ../../lib/libgmock.a
 make[3]: Leaving directory '/build/reproducible-path/cpu-features-0.9.0/obj-arm-linux-gnueabihf'
-[ 74%] Built target gmock
+[ 71%] Built target gmock
 make  -f googletest-build/googlemock/CMakeFiles/gmock_main.dir/build.make googletest-build/googlemock/CMakeFiles/gmock_main.dir/depend
 make[3]: Entering directory '/build/reproducible-path/cpu-features-0.9.0/obj-arm-linux-gnueabihf'
 cd /build/reproducible-path/cpu-features-0.9.0/obj-arm-linux-gnueabihf && /usr/bin/cmake -E cmake_depends "Unix Makefiles" /build/reproducible-path/cpu-features-0.9.0 /usr/src/googletest/googlemock /build/reproducible-path/cpu-features-0.9.0/obj-arm-linux-gnueabihf /build/reproducible-path/cpu-features-0.9.0/obj-arm-linux-gnueabihf/googletest-build/googlemock /build/reproducible-path/cpu-features-0.9.0/obj-arm-linux-gnueabihf/googletest-build/googlemock/CMakeFiles/gmock_main.dir/DependInfo.cmake "--color="
 make[3]: Leaving directory '/build/reproducible-path/cpu-features-0.9.0/obj-arm-linux-gnueabihf'
 make  -f googletest-build/googlemock/CMakeFiles/gmock_main.dir/build.make googletest-build/googlemock/CMakeFiles/gmock_main.dir/build
 make[3]: Entering directory '/build/reproducible-path/cpu-features-0.9.0/obj-arm-linux-gnueabihf'
-[ 76%] Building CXX object googletest-build/googlemock/CMakeFiles/gmock_main.dir/src/gmock_main.cc.o
+[ 73%] Building CXX object googletest-build/googlemock/CMakeFiles/gmock_main.dir/src/gmock_main.cc.o
 cd /build/reproducible-path/cpu-features-0.9.0/obj-arm-linux-gnueabihf/googletest-build/googlemock && /usr/bin/c++  -isystem /usr/src/googletest/googlemock/include -isystem /usr/src/googletest/googlemock -isystem /usr/src/googletest/googletest/include -isystem /usr/src/googletest/googletest -g -O2 -ffile-prefix-map=/build/reproducible-path/cpu-features-0.9.0=. -fstack-protector-strong -fstack-clash-protection -Wformat -Werror=format-security -D_LARGEFILE_SOURCE -D_FILE_OFFSET_BITS=64 -D_TIME_BITS=64 -Wdate-time -D_FORTIFY_SOURCE=2 -std=c++14 -Wall -Wshadow -Wundef -Wno-error=dangling-else -DGTEST_HAS_PTHREAD=1 -fexceptions -Wextra -Wno-unused-parameter -Wno-missing-field-initializers -DGTEST_HAS_PTHREAD=1 -MD -MT googletest-build/googlemock/CMakeFiles/gmock_main.dir/src/gmock_main.cc.o -MF CMakeFiles/gmock_main.dir/src/gmock_main.cc.o.d -o CMakeFiles/gmock_main.dir/src/gmock_main.cc.o -c /usr/src/googletest/googlemock/src/gmock_main.cc
-[ 78%] Linking CXX static library ../../lib/libgmock_main.a
+[ 75%] Linking CXX static library ../../lib/libgmock_main.a
 cd /build/reproducible-path/cpu-features-0.9.0/obj-arm-linux-gnueabihf/googletest-build/googlemock && /usr/bin/cmake -P CMakeFiles/gmock_main.dir/cmake_clean_target.cmake
 cd /build/reproducible-path/cpu-features-0.9.0/obj-arm-linux-gnueabihf/googletest-build/googlemock && /usr/bin/cmake -E cmake_link_script CMakeFiles/gmock_main.dir/link.txt --verbose=1
 /usr/bin/ar qc ../../lib/libgmock_main.a CMakeFiles/gmock_main.dir/src/gmock_main.cc.o
 /usr/bin/ranlib ../../lib/libgmock_main.a
 make[3]: Leaving directory '/build/reproducible-path/cpu-features-0.9.0/obj-arm-linux-gnueabihf'
-[ 78%] Built target gmock_main
+[ 75%] Built target gmock_main
 make  -f test/CMakeFiles/bit_utils_test.dir/build.make test/CMakeFiles/bit_utils_test.dir/depend
 make  -f test/CMakeFiles/string_view_test.dir/build.make test/CMakeFiles/string_view_test.dir/depend
+make  -f test/CMakeFiles/stack_line_reader_test.dir/build.make test/CMakeFiles/stack_line_reader_test.dir/depend
 make[3]: Entering directory '/build/reproducible-path/cpu-features-0.9.0/obj-arm-linux-gnueabihf'
 cd /build/reproducible-path/cpu-features-0.9.0/obj-arm-linux-gnueabihf && /usr/bin/cmake -E cmake_depends "Unix Makefiles" /build/reproducible-path/cpu-features-0.9.0 /build/reproducible-path/cpu-features-0.9.0/test /build/reproducible-path/cpu-features-0.9.0/obj-arm-linux-gnueabihf /build/reproducible-path/cpu-features-0.9.0/obj-arm-linux-gnueabihf/test /build/reproducible-path/cpu-features-0.9.0/obj-arm-linux-gnueabihf/test/CMakeFiles/bit_utils_test.dir/DependInfo.cmake "--color="
 make[3]: Entering directory '/build/reproducible-path/cpu-features-0.9.0/obj-arm-linux-gnueabihf'
-make  -f test/CMakeFiles/stack_line_reader_test.dir/build.make test/CMakeFiles/stack_line_reader_test.dir/depend
 cd /build/reproducible-path/cpu-features-0.9.0/obj-arm-linux-gnueabihf && /usr/bin/cmake -E cmake_depends "Unix Makefiles" /build/reproducible-path/cpu-features-0.9.0 /build/reproducible-path/cpu-features-0.9.0/test /build/reproducible-path/cpu-features-0.9.0/obj-arm-linux-gnueabihf /build/reproducible-path/cpu-features-0.9.0/obj-arm-linux-gnueabihf/test /build/reproducible-path/cpu-features-0.9.0/obj-arm-linux-gnueabihf/test/CMakeFiles/string_view_test.dir/DependInfo.cmake "--color="
 make[3]: Entering directory '/build/reproducible-path/cpu-features-0.9.0/obj-arm-linux-gnueabihf'
+make  -f test/CMakeFiles/cpuinfo_aarch64_test.dir/build.make test/CMakeFiles/cpuinfo_aarch64_test.dir/depend
 cd /build/reproducible-path/cpu-features-0.9.0/obj-arm-linux-gnueabihf && /usr/bin/cmake -E cmake_depends "Unix Makefiles" /build/reproducible-path/cpu-features-0.9.0 /build/reproducible-path/cpu-features-0.9.0/test /build/reproducible-path/cpu-features-0.9.0/obj-arm-linux-gnueabihf /build/reproducible-path/cpu-features-0.9.0/obj-arm-linux-gnueabihf/test /build/reproducible-path/cpu-features-0.9.0/obj-arm-linux-gnueabihf/test/CMakeFiles/stack_line_reader_test.dir/DependInfo.cmake "--color="
+make[3]: Entering directory '/build/reproducible-path/cpu-features-0.9.0/obj-arm-linux-gnueabihf'
+cd /build/reproducible-path/cpu-features-0.9.0/obj-arm-linux-gnueabihf && /usr/bin/cmake -E cmake_depends "Unix Makefiles" /build/reproducible-path/cpu-features-0.9.0 /build/reproducible-path/cpu-features-0.9.0/test /build/reproducible-path/cpu-features-0.9.0/obj-arm-linux-gnueabihf /build/reproducible-path/cpu-features-0.9.0/obj-arm-linux-gnueabihf/test /build/reproducible-path/cpu-features-0.9.0/obj-arm-linux-gnueabihf/test/CMakeFiles/cpuinfo_aarch64_test.dir/DependInfo.cmake "--color="
+make[3]: Leaving directory '/build/reproducible-path/cpu-features-0.9.0/obj-arm-linux-gnueabihf'
 make[3]: Leaving directory '/build/reproducible-path/cpu-features-0.9.0/obj-arm-linux-gnueabihf'
 make  -f test/CMakeFiles/bit_utils_test.dir/build.make test/CMakeFiles/bit_utils_test.dir/build
 make[3]: Entering directory '/build/reproducible-path/cpu-features-0.9.0/obj-arm-linux-gnueabihf'
+make  -f test/CMakeFiles/string_view_test.dir/build.make test/CMakeFiles/string_view_test.dir/build
+make[3]: Entering directory '/build/reproducible-path/cpu-features-0.9.0/obj-arm-linux-gnueabihf'
 make[3]: Leaving directory '/build/reproducible-path/cpu-features-0.9.0/obj-arm-linux-gnueabihf'
 make  -f test/CMakeFiles/stack_line_reader_test.dir/build.make test/CMakeFiles/stack_line_reader_test.dir/build
-make[3]: Leaving directory '/build/reproducible-path/cpu-features-0.9.0/obj-arm-linux-gnueabihf'
-make  -f test/CMakeFiles/string_view_test.dir/build.make test/CMakeFiles/string_view_test.dir/build
 make[3]: Entering directory '/build/reproducible-path/cpu-features-0.9.0/obj-arm-linux-gnueabihf'
+make[3]: Leaving directory '/build/reproducible-path/cpu-features-0.9.0/obj-arm-linux-gnueabihf'
+make  -f test/CMakeFiles/cpuinfo_aarch64_test.dir/build.make test/CMakeFiles/cpuinfo_aarch64_test.dir/build
 make[3]: Entering directory '/build/reproducible-path/cpu-features-0.9.0/obj-arm-linux-gnueabihf'
-[ 80%] Building CXX object test/CMakeFiles/bit_utils_test.dir/bit_utils_test.cc.o
+[ 77%] Building CXX object test/CMakeFiles/bit_utils_test.dir/bit_utils_test.cc.o
 cd /build/reproducible-path/cpu-features-0.9.0/obj-arm-linux-gnueabihf/test && /usr/bin/c++ -DCPU_FEATURES_TEST -I/build/reproducible-path/cpu-features-0.9.0/test/../include -isystem /usr/src/googletest/googletest/include -isystem /usr/src/googletest/googletest -isystem /usr/src/googletest/googlemock/include -isystem /usr/src/googletest/googlemock -g -O2 -ffile-prefix-map=/build/reproducible-path/cpu-features-0.9.0=. -fstack-protector-strong -fstack-clash-protection -Wformat -Werror=format-security -D_LARGEFILE_SOURCE -D_FILE_OFFSET_BITS=64 -D_TIME_BITS=64 -Wdate-time -D_FORTIFY_SOURCE=2 -std=c++14 -DGTEST_HAS_PTHREAD=1 -MD -MT test/CMakeFiles/bit_utils_test.dir/bit_utils_test.cc.o -MF CMakeFiles/bit_utils_test.dir/bit_utils_test.cc.o.d -o CMakeFiles/bit_utils_test.dir/bit_utils_test.cc.o -c /build/reproducible-path/cpu-features-0.9.0/test/bit_utils_test.cc
-[ 82%] Building CXX object test/CMakeFiles/stack_line_reader_test.dir/stack_line_reader_test.cc.o
+[ 79%] Building CXX object test/CMakeFiles/stack_line_reader_test.dir/stack_line_reader_test.cc.o
 cd /build/reproducible-path/cpu-features-0.9.0/obj-arm-linux-gnueabihf/test && /usr/bin/c++ -DCPU_FEATURES_MOCK_FILESYSTEM -DCPU_FEATURES_TEST -DSTACK_LINE_READER_BUFFER_SIZE=16 -I/build/reproducible-path/cpu-features-0.9.0/test/../include -isystem /usr/src/googletest/googletest/include -isystem /usr/src/googletest/googletest -isystem /usr/src/googletest/googlemock/include -isystem /usr/src/googletest/googlemock -g -O2 -ffile-prefix-map=/build/reproducible-path/cpu-features-0.9.0=. -fstack-protector-strong -fstack-clash-protection -Wformat -Werror=format-security -D_LARGEFILE_SOURCE -D_FILE_OFFSET_BITS=64 -D_TIME_BITS=64 -Wdate-time -D_FORTIFY_SOURCE=2 -std=c++14 -DGTEST_HAS_PTHREAD=1 -MD -MT test/CMakeFiles/stack_line_reader_test.dir/stack_line_reader_test.cc.o -MF CMakeFiles/stack_line_reader_test.dir/stack_line_reader_test.cc.o.d -o CMakeFiles/stack_line_reader_test.dir/stack_line_reader_test.cc.o -c /build/reproducible-path/cpu-features-0.9.0/test/stack_line_reader_test.cc
-[ 85%] Building CXX object test/CMakeFiles/string_view_test.dir/string_view_test.cc.o
+[ 83%] Building CXX object test/CMakeFiles/cpuinfo_aarch64_test.dir/cpuinfo_aarch64_test.cc.o
+[ 83%] Building CXX object test/CMakeFiles/string_view_test.dir/string_view_test.cc.o
+cd /build/reproducible-path/cpu-features-0.9.0/obj-arm-linux-gnueabihf/test && /usr/bin/c++ -DCPU_FEATURES_MOCK_CPUID_AARCH64 -DCPU_FEATURES_MOCK_FILESYSTEM -DCPU_FEATURES_TEST -DSTACK_LINE_READER_BUFFER_SIZE=1024 -I/build/reproducible-path/cpu-features-0.9.0/test/../include -isystem /usr/src/googletest/googletest/include -isystem /usr/src/googletest/googletest -isystem /usr/src/googletest/googlemock/include -isystem /usr/src/googletest/googlemock -g -O2 -ffile-prefix-map=/build/reproducible-path/cpu-features-0.9.0=. -fstack-protector-strong -fstack-clash-protection -Wformat -Werror=format-security -D_LARGEFILE_SOURCE -D_FILE_OFFSET_BITS=64 -D_TIME_BITS=64 -Wdate-time -D_FORTIFY_SOURCE=2 -std=c++14 -DGTEST_HAS_PTHREAD=1 -MD -MT test/CMakeFiles/cpuinfo_aarch64_test.dir/cpuinfo_aarch64_test.cc.o -MF CMakeFiles/cpuinfo_aarch64_test.dir/cpuinfo_aarch64_test.cc.o.d -o CMakeFiles/cpuinfo_aarch64_test.dir/cpuinfo_aarch64_test.cc.o -c /build/reproducible-path/cpu-features-0.9.0/test/cpuinfo_aarch64_test.cc
 cd /build/reproducible-path/cpu-features-0.9.0/obj-arm-linux-gnueabihf/test && /usr/bin/c++ -DCPU_FEATURES_TEST -I/build/reproducible-path/cpu-features-0.9.0/test/../include -isystem /usr/src/googletest/googletest/include -isystem /usr/src/googletest/googletest -isystem /usr/src/googletest/googlemock/include -isystem /usr/src/googletest/googlemock -g -O2 -ffile-prefix-map=/build/reproducible-path/cpu-features-0.9.0=. -fstack-protector-strong -fstack-clash-protection -Wformat -Werror=format-security -D_LARGEFILE_SOURCE -D_FILE_OFFSET_BITS=64 -D_TIME_BITS=64 -Wdate-time -D_FORTIFY_SOURCE=2 -std=c++14 -DGTEST_HAS_PTHREAD=1 -MD -MT test/CMakeFiles/string_view_test.dir/string_view_test.cc.o -MF CMakeFiles/string_view_test.dir/string_view_test.cc.o.d -o CMakeFiles/string_view_test.dir/string_view_test.cc.o -c /build/reproducible-path/cpu-features-0.9.0/test/string_view_test.cc
+In file included from /build/reproducible-path/cpu-features-0.9.0/test/cpuinfo_aarch64_test.cc:15:
+/build/reproducible-path/cpu-features-0.9.0/test/../include/cpuinfo_aarch64.h:298:2: error: #error "Including cpuinfo_aarch64.h from a non-aarch64 target."
+  298 | #error "Including cpuinfo_aarch64.h from a non-aarch64 target."
+      |  ^~~~~
+make[3]: *** [test/CMakeFiles/cpuinfo_aarch64_test.dir/build.make:82: test/CMakeFiles/cpuinfo_aarch64_test.dir/cpuinfo_aarch64_test.cc.o] Error 1
+make[3]: Leaving directory '/build/reproducible-path/cpu-features-0.9.0/obj-arm-linux-gnueabihf'
+make[2]: *** [CMakeFiles/Makefile2:1671: test/CMakeFiles/cpuinfo_aarch64_test.dir/all] Error 2
+make[2]: *** Waiting for unfinished jobs....
+[ 85%] Building C object test/CMakeFiles/string_view_test.dir/__/src/string_view.c.o
+cd /build/reproducible-path/cpu-features-0.9.0/obj-arm-linux-gnueabihf/test && /usr/bin/cc -DCPU_FEATURES_TEST -I/build/reproducible-path/cpu-features-0.9.0/test/../include -isystem /usr/src/googletest/googletest/include -isystem /usr/src/googletest/googletest -isystem /usr/src/googletest/googlemock/include -isystem /usr/src/googletest/googlemock -g -O2 -Werror=implicit-function-declaration -ffile-prefix-map=/build/reproducible-path/cpu-features-0.9.0=. -fstack-protector-strong -fstack-clash-protection -Wformat -Werror=format-security -D_LARGEFILE_SOURCE -D_FILE_OFFSET_BITS=64 -D_TIME_BITS=64 -Wdate-time -D_FORTIFY_SOURCE=2 -std=gnu99 -DGTEST_HAS_PTHREAD=1 -MD -MT test/CMakeFiles/string_view_test.dir/__/src/string_view.c.o -MF CMakeFiles/string_view_test.dir/__/src/string_view.c.o.d -o CMakeFiles/string_view_test.dir/__/src/string_view.c.o -c /build/reproducible-path/cpu-features-0.9.0/src/string_view.c
 [ 87%] Linking CXX executable bit_utils_test
 cd /build/reproducible-path/cpu-features-0.9.0/obj-arm-linux-gnueabihf/test && /usr/bin/cmake -E cmake_link_script CMakeFiles/bit_utils_test.dir/link.txt --verbose=1
 /usr/bin/c++ -g -O2 -ffile-prefix-map=/build/reproducible-path/cpu-features-0.9.0=. -fstack-protector-strong -fstack-clash-protection -Wformat -Werror=format-security -D_LARGEFILE_SOURCE -D_FILE_OFFSET_BITS=64 -D_TIME_BITS=64 -Wdate-time -D_FORTIFY_SOURCE=2 -Wl,-z,relro -Wl,--dependency-file=CMakeFiles/bit_utils_test.dir/link.d CMakeFiles/bit_utils_test.dir/bit_utils_test.cc.o -o bit_utils_test  ../lib/libgtest.a ../lib/libgmock_main.a ../lib/libgmock.a ../lib/libgtest.a
 make[3]: Leaving directory '/build/reproducible-path/cpu-features-0.9.0/obj-arm-linux-gnueabihf'
+[ 87%] Built target bit_utils_test
 [ 89%] Linking CXX executable stack_line_reader_test
 cd /build/reproducible-path/cpu-features-0.9.0/obj-arm-linux-gnueabihf/test && /usr/bin/cmake -E cmake_link_script CMakeFiles/stack_line_reader_test.dir/link.txt --verbose=1
-[ 89%] Built target bit_utils_test
-make  -f test/CMakeFiles/cpuinfo_arm_test.dir/build.make test/CMakeFiles/cpuinfo_arm_test.dir/depend
-make[3]: Entering directory '/build/reproducible-path/cpu-features-0.9.0/obj-arm-linux-gnueabihf'
-cd /build/reproducible-path/cpu-features-0.9.0/obj-arm-linux-gnueabihf && /usr/bin/cmake -E cmake_depends "Unix Makefiles" /build/reproducible-path/cpu-features-0.9.0 /build/reproducible-path/cpu-features-0.9.0/test /build/reproducible-path/cpu-features-0.9.0/obj-arm-linux-gnueabihf /build/reproducible-path/cpu-features-0.9.0/obj-arm-linux-gnueabihf/test /build/reproducible-path/cpu-features-0.9.0/obj-arm-linux-gnueabihf/test/CMakeFiles/cpuinfo_arm_test.dir/DependInfo.cmake "--color="
-make[3]: Leaving directory '/build/reproducible-path/cpu-features-0.9.0/obj-arm-linux-gnueabihf'
-make  -f test/CMakeFiles/cpuinfo_arm_test.dir/build.make test/CMakeFiles/cpuinfo_arm_test.dir/build
-make[3]: Entering directory '/build/reproducible-path/cpu-features-0.9.0/obj-arm-linux-gnueabihf'
-[ 91%] Building CXX object test/CMakeFiles/cpuinfo_arm_test.dir/cpuinfo_arm_test.cc.o
-cd /build/reproducible-path/cpu-features-0.9.0/obj-arm-linux-gnueabihf/test && /usr/bin/c++ -DCPU_FEATURES_MOCK_FILESYSTEM -DCPU_FEATURES_TEST -DSTACK_LINE_READER_BUFFER_SIZE=1024 -I/build/reproducible-path/cpu-features-0.9.0/test/../include -isystem /usr/src/googletest/googletest/include -isystem /usr/src/googletest/googletest -isystem /usr/src/googletest/googlemock/include -isystem /usr/src/googletest/googlemock -g -O2 -ffile-prefix-map=/build/reproducible-path/cpu-features-0.9.0=. -fstack-protector-strong -fstack-clash-protection -Wformat -Werror=format-security -D_LARGEFILE_SOURCE -D_FILE_OFFSET_BITS=64 -D_TIME_BITS=64 -Wdate-time -D_FORTIFY_SOURCE=2 -std=c++14 -DGTEST_HAS_PTHREAD=1 -MD -MT test/CMakeFiles/cpuinfo_arm_test.dir/cpuinfo_arm_test.cc.o -MF CMakeFiles/cpuinfo_arm_test.dir/cpuinfo_arm_test.cc.o.d -o CMakeFiles/cpuinfo_arm_test.dir/cpuinfo_arm_test.cc.o -c /build/reproducible-path/cpu-features-0.9.0/test/cpuinfo_arm_test.cc
 /usr/bin/c++ -g -O2 -ffile-prefix-map=/build/reproducible-path/cpu-features-0.9.0=. -fstack-protector-strong -fstack-clash-protection -Wformat -Werror=format-security -D_LARGEFILE_SOURCE -D_FILE_OFFSET_BITS=64 -D_TIME_BITS=64 -Wdate-time -D_FORTIFY_SOURCE=2 -Wl,-z,relro -Wl,--dependency-file=CMakeFiles/stack_line_reader_test.dir/link.d CMakeFiles/stack_line_reader_test.dir/stack_line_reader_test.cc.o -o stack_line_reader_test  ../lib/libgtest.a ../lib/libgmock_main.a libstack_line_reader_for_test.a ../lib/libgmock.a ../lib/libgtest.a libstring_view.a libfilesystem_for_testing.a
 make[3]: Leaving directory '/build/reproducible-path/cpu-features-0.9.0/obj-arm-linux-gnueabihf'
-[ 91%] Built target stack_line_reader_test
-[ 93%] Building C object test/CMakeFiles/string_view_test.dir/__/src/string_view.c.o
-cd /build/reproducible-path/cpu-features-0.9.0/obj-arm-linux-gnueabihf/test && /usr/bin/cc -DCPU_FEATURES_TEST -I/build/reproducible-path/cpu-features-0.9.0/test/../include -isystem /usr/src/googletest/googletest/include -isystem /usr/src/googletest/googletest -isystem /usr/src/googletest/googlemock/include -isystem /usr/src/googletest/googlemock -g -O2 -Werror=implicit-function-declaration -ffile-prefix-map=/build/reproducible-path/cpu-features-0.9.0=. -fstack-protector-strong -fstack-clash-protection -Wformat -Werror=format-security -D_LARGEFILE_SOURCE -D_FILE_OFFSET_BITS=64 -D_TIME_BITS=64 -Wdate-time -D_FORTIFY_SOURCE=2 -std=gnu99 -DGTEST_HAS_PTHREAD=1 -MD -MT test/CMakeFiles/string_view_test.dir/__/src/string_view.c.o -MF CMakeFiles/string_view_test.dir/__/src/string_view.c.o.d -o CMakeFiles/string_view_test.dir/__/src/string_view.c.o -c /build/reproducible-path/cpu-features-0.9.0/src/string_view.c
-[ 95%] Building C object test/CMakeFiles/cpuinfo_arm_test.dir/__/src/impl_arm_linux_or_android.c.o
-cd /build/reproducible-path/cpu-features-0.9.0/obj-arm-linux-gnueabihf/test && /usr/bin/cc -DCPU_FEATURES_MOCK_FILESYSTEM -DCPU_FEATURES_TEST -DSTACK_LINE_READER_BUFFER_SIZE=1024 -I/build/reproducible-path/cpu-features-0.9.0/test/../include -isystem /usr/src/googletest/googletest/include -isystem /usr/src/googletest/googletest -isystem /usr/src/googletest/googlemock/include -isystem /usr/src/googletest/googlemock -g -O2 -Werror=implicit-function-declaration -ffile-prefix-map=/build/reproducible-path/cpu-features-0.9.0=. -fstack-protector-strong -fstack-clash-protection -Wformat -Werror=format-security -D_LARGEFILE_SOURCE -D_FILE_OFFSET_BITS=64 -D_TIME_BITS=64 -Wdate-time -D_FORTIFY_SOURCE=2 -std=gnu99 -DGTEST_HAS_PTHREAD=1 -MD -MT test/CMakeFiles/cpuinfo_arm_test.dir/__/src/impl_arm_linux_or_android.c.o -MF CMakeFiles/cpuinfo_arm_test.dir/__/src/impl_arm_linux_or_android.c.o.d -o CMakeFiles/cpuinfo_arm_test.dir/__/src/impl_arm_linux_or_android.c.o -c /build/reproducible-path/cpu-features-0.9.0/src/impl_arm_linux_or_android.c
-[ 97%] Linking CXX executable string_view_test
+[ 89%] Built target stack_line_reader_test
+[ 91%] Linking CXX executable string_view_test
 cd /build/reproducible-path/cpu-features-0.9.0/obj-arm-linux-gnueabihf/test && /usr/bin/cmake -E cmake_link_script CMakeFiles/string_view_test.dir/link.txt --verbose=1
 /usr/bin/c++ -g -O2 -ffile-prefix-map=/build/reproducible-path/cpu-features-0.9.0=. -fstack-protector-strong -fstack-clash-protection -Wformat -Werror=format-security -D_LARGEFILE_SOURCE -D_FILE_OFFSET_BITS=64 -D_TIME_BITS=64 -Wdate-time -D_FORTIFY_SOURCE=2 -Wl,-z,relro -Wl,--dependency-file=CMakeFiles/string_view_test.dir/link.d CMakeFiles/string_view_test.dir/string_view_test.cc.o CMakeFiles/string_view_test.dir/__/src/string_view.c.o -o string_view_test  ../lib/libgtest.a ../lib/libgmock_main.a libstring_view.a ../lib/libgmock.a ../lib/libgtest.a
 make[3]: Leaving directory '/build/reproducible-path/cpu-features-0.9.0/obj-arm-linux-gnueabihf'
-[ 97%] Built target string_view_test
-[100%] Linking CXX executable cpuinfo_arm_test
-cd /build/reproducible-path/cpu-features-0.9.0/obj-arm-linux-gnueabihf/test && /usr/bin/cmake -E cmake_link_script CMakeFiles/cpuinfo_arm_test.dir/link.txt --verbose=1
-/usr/bin/c++ -g -O2 -ffile-prefix-map=/build/reproducible-path/cpu-features-0.9.0=. -fstack-protector-strong -fstack-clash-protection -Wformat -Werror=format-security -D_LARGEFILE_SOURCE -D_FILE_OFFSET_BITS=64 -D_TIME_BITS=64 -Wdate-time -D_FORTIFY_SOURCE=2 -Wl,-z,relro -Wl,--dependency-file=CMakeFiles/cpuinfo_arm_test.dir/link.d CMakeFiles/cpuinfo_arm_test.dir/cpuinfo_arm_test.cc.o CMakeFiles/cpuinfo_arm_test.dir/__/src/impl_arm_linux_or_android.c.o -o cpuinfo_arm_test  ../lib/libgtest.a ../lib/libgmock_main.a liball_libraries.a ../lib/libgmock.a ../lib/libgtest.a libhwcaps_for_testing.a libfilesystem_for_testing.a libstack_line_reader.a libstring_view.a
-make[3]: Leaving directory '/build/reproducible-path/cpu-features-0.9.0/obj-arm-linux-gnueabihf'
-[100%] Built target cpuinfo_arm_test
+[ 91%] Built target string_view_test
 make[2]: Leaving directory '/build/reproducible-path/cpu-features-0.9.0/obj-arm-linux-gnueabihf'
-/usr/bin/cmake -E cmake_progress_start /build/reproducible-path/cpu-features-0.9.0/obj-arm-linux-gnueabihf/CMakeFiles 0
+make[1]: *** [Makefile:149: all] Error 2
 make[1]: Leaving directory '/build/reproducible-path/cpu-features-0.9.0/obj-arm-linux-gnueabihf'
-   dh_auto_test
-	cd obj-arm-linux-gnueabihf && make -j3 test ARGS\+=--verbose ARGS\+=-j3
-make[1]: Entering directory '/build/reproducible-path/cpu-features-0.9.0/obj-arm-linux-gnueabihf'
-Running tests...
-/usr/bin/ctest --force-new-ctest-process --verbose -j3
-UpdateCTestConfiguration  from :/build/reproducible-path/cpu-features-0.9.0/obj-arm-linux-gnueabihf/DartConfiguration.tcl
-Parse Config file:/build/reproducible-path/cpu-features-0.9.0/obj-arm-linux-gnueabihf/DartConfiguration.tcl
-UpdateCTestConfiguration  from :/build/reproducible-path/cpu-features-0.9.0/obj-arm-linux-gnueabihf/DartConfiguration.tcl
-Parse Config file:/build/reproducible-path/cpu-features-0.9.0/obj-arm-linux-gnueabihf/DartConfiguration.tcl
-Test project /build/reproducible-path/cpu-features-0.9.0/obj-arm-linux-gnueabihf
-Constructing a list of tests
-Done constructing a list of tests
-Updating test list for fixtures
-Added 0 tests to meet fixture requirements
-Checking test dependency graph...
-Checking test dependency graph end
-Connected to MAKE jobserver
-test 1
-    Start 1: bit_utils_test
-
-1: Test command: /build/reproducible-path/cpu-features-0.9.0/obj-arm-linux-gnueabihf/test/bit_utils_test
-1: Working Directory: /build/reproducible-path/cpu-features-0.9.0/obj-arm-linux-gnueabihf/test
-1: Test timeout computed to be: 1500
-test 2
-    Start 2: string_view_test
-
-2: Test command: /build/reproducible-path/cpu-features-0.9.0/obj-arm-linux-gnueabihf/test/string_view_test
-2: Working Directory: /build/reproducible-path/cpu-features-0.9.0/obj-arm-linux-gnueabihf/test
-2: Test timeout computed to be: 1500
-test 3
-    Start 3: stack_line_reader_test
-
-3: Test command: /build/reproducible-path/cpu-features-0.9.0/obj-arm-linux-gnueabihf/test/stack_line_reader_test
-3: Working Directory: /build/reproducible-path/cpu-features-0.9.0/obj-arm-linux-gnueabihf/test
-3: Test timeout computed to be: 1500
-1: Running main() from gmock_main.cc
-1: [==========] Running 2 tests from 1 test suite.
-1: [----------] Global test environment set-up.
-1: [----------] 2 tests from UtilsTest
-1: [ RUN      ] UtilsTest.IsBitSet
-1: [       OK ] UtilsTest.IsBitSet (0 ms)
-1: [ RUN      ] UtilsTest.ExtractBitRange
-1: [       OK ] UtilsTest.ExtractBitRange (0 ms)
-1: [----------] 2 tests from UtilsTest (0 ms total)
-1: 
-1: [----------] Global test environment tear-down
-1: [==========] 2 tests from 1 test suite ran. (0 ms total)
-1: [  PASSED  ] 2 tests.
-2: Running main() from gmock_main.cc
-2: [==========] Running 17 tests from 1 test suite.
-2: [----------] Global test environment set-up.
-2: [----------] 17 tests from StringViewTest
-2: [ RUN      ] StringViewTest.Empty
-2: [       OK ] StringViewTest.Empty (0 ms)
-2: [ RUN      ] StringViewTest.Build
-2: [       OK ] StringViewTest.Build (0 ms)
-2: [ RUN      ] StringViewTest.CpuFeatures_StringView_IndexOfChar
-2: [       OK ] StringViewTest.CpuFeatures_StringView_IndexOfChar (0 ms)
-2: [ RUN      ] StringViewTest.CpuFeatures_StringView_IndexOf
-2: [       OK ] StringViewTest.CpuFeatures_StringView_IndexOf (0 ms)
-2: [ RUN      ] StringViewTest.CpuFeatures_StringView_StartsWith
-2: [       OK ] StringViewTest.CpuFeatures_StringView_StartsWith (0 ms)
-2: [ RUN      ] StringViewTest.CpuFeatures_StringView_IsEquals
-2: [       OK ] StringViewTest.CpuFeatures_StringView_IsEquals (0 ms)
-2: [ RUN      ] StringViewTest.CpuFeatures_StringView_PopFront
-2: [       OK ] StringViewTest.CpuFeatures_StringView_PopFront (0 ms)
-2: [ RUN      ] StringViewTest.CpuFeatures_StringView_PopBack
-2: [       OK ] StringViewTest.CpuFeatures_StringView_PopBack (0 ms)
-2: [ RUN      ] StringViewTest.CpuFeatures_StringView_KeepFront
-2: [       OK ] StringViewTest.CpuFeatures_StringView_KeepFront (0 ms)
-2: [ RUN      ] StringViewTest.CpuFeatures_StringView_Front
-2: [       OK ] StringViewTest.CpuFeatures_StringView_Front (0 ms)
-2: [ RUN      ] StringViewTest.CpuFeatures_StringView_Back
-2: [       OK ] StringViewTest.CpuFeatures_StringView_Back (0 ms)
-2: [ RUN      ] StringViewTest.CpuFeatures_StringView_TrimWhitespace
-2: [       OK ] StringViewTest.CpuFeatures_StringView_TrimWhitespace (0 ms)
-2: [ RUN      ] StringViewTest.CpuFeatures_StringView_ParsePositiveNumber
-2: [       OK ] StringViewTest.CpuFeatures_StringView_ParsePositiveNumber (0 ms)
-2: [ RUN      ] StringViewTest.CpuFeatures_StringView_CopyString
-2: [       OK ] StringViewTest.CpuFeatures_StringView_CopyString (0 ms)
-2: [ RUN      ] StringViewTest.CpuFeatures_StringView_HasWord
-2: [       OK ] StringViewTest.CpuFeatures_StringView_HasWord (0 ms)
-2: [ RUN      ] StringViewTest.CpuFeatures_StringView_GetAttributeKeyValue
-2: [       OK ] StringViewTest.CpuFeatures_StringView_GetAttributeKeyValue (0 ms)
-2: [ RUN      ] StringViewTest.FailingGetAttributeKeyValue
-2: [       OK ] StringViewTest.FailingGetAttributeKeyValue (0 ms)
-2: [----------] 17 tests from StringViewTest (0 ms total)
-2: 
-2: [----------] Global test environment tear-down
-2: [==========] 17 tests from 1 test suite ran. (0 ms total)
-2: [  PASSED  ] 17 tests.
-1/4 Test #1: bit_utils_test ...................   Passed    0.04 sec
-2/4 Test #2: string_view_test .................   Passed    0.03 sec
-3: Running main() from gmock_main.cc
-3: [==========] Running 4 tests from 1 test suite.
-3: [----------] Global test environment set-up.
-3: [----------] 4 tests from StackLineReaderTest
-3: [ RUN      ] StackLineReaderTest.Empty
-3: [       OK ] StackLineReaderTest.Empty (0 ms)
-3: [ RUN      ] StackLineReaderTest.ManySmallLines
-3: [       OK ] StackLineReaderTest.ManySmallLines (0 ms)
-3: [ RUN      ] StackLineReaderTest.TruncatedLine
-3: [       OK ] StackLineReaderTest.TruncatedLine (0 ms)
-3: [ RUN      ] StackLineReaderTest.TruncatedLines
-3: [       OK ] StackLineReaderTest.TruncatedLines (0 ms)
-3: [----------] 4 tests from StackLineReaderTest (0 ms total)
-3: 
-3: [----------] Global test environment tear-down
-3: [==========] 4 tests from 1 test suite ran. (0 ms total)
-3: [  PASSED  ] 4 tests.
-3/4 Test #3: stack_line_reader_test ...........   Passed    0.03 sec
-test 4
-    Start 4: cpuinfo_arm_test
-
-4: Test command: /build/reproducible-path/cpu-features-0.9.0/obj-arm-linux-gnueabihf/test/cpuinfo_arm_test
-4: Working Directory: /build/reproducible-path/cpu-features-0.9.0/obj-arm-linux-gnueabihf/test
-4: Test timeout computed to be: 1500
-4: Running main() from gmock_main.cc
-4: [==========] Running 11 tests from 1 test suite.
-4: [----------] Global test environment set-up.
-4: [----------] 11 tests from CpuinfoArmTest
-4: [ RUN      ] CpuinfoArmTest.ArmFeaturesEnum
-4: [       OK ] CpuinfoArmTest.ArmFeaturesEnum (0 ms)
-4: [ RUN      ] CpuinfoArmTest.FromHardwareCap
-4: [       OK ] CpuinfoArmTest.FromHardwareCap (0 ms)
-4: [ RUN      ] CpuinfoArmTest.ODroidFromCpuInfo
-4: [       OK ] CpuinfoArmTest.ODroidFromCpuInfo (0 ms)
-4: [ RUN      ] CpuinfoArmTest.RaspberryPiZeroFromCpuInfo
-4: [       OK ] CpuinfoArmTest.RaspberryPiZeroFromCpuInfo (0 ms)
-4: [ RUN      ] CpuinfoArmTest.MarvellArmadaFromCpuInfo
-4: [       OK ] CpuinfoArmTest.MarvellArmadaFromCpuInfo (0 ms)
-4: [ RUN      ] CpuinfoArmTest.InvalidArmv7
-4: [       OK ] CpuinfoArmTest.InvalidArmv7 (0 ms)
-4: [ RUN      ] CpuinfoArmTest.InvalidNeon
-4: [       OK ] CpuinfoArmTest.InvalidNeon (0 ms)
-4: [ RUN      ] CpuinfoArmTest.Nexus4_0x510006f2
-4: [       OK ] CpuinfoArmTest.Nexus4_0x510006f2 (0 ms)
-4: [ RUN      ] CpuinfoArmTest.Nexus4_0x510006f3
-4: [       OK ] CpuinfoArmTest.Nexus4_0x510006f3 (0 ms)
-4: [ RUN      ] CpuinfoArmTest.Nexus7_2013_0x511006f0
-4: [       OK ] CpuinfoArmTest.Nexus7_2013_0x511006f0 (0 ms)
-4: [ RUN      ] CpuinfoArmTest.EmulatorSpecificIdiv
-4: [       OK ] CpuinfoArmTest.EmulatorSpecificIdiv (0 ms)
-4: [----------] 11 tests from CpuinfoArmTest (0 ms total)
-4: 
-4: [----------] Global test environment tear-down
-4: [==========] 11 tests from 1 test suite ran. (0 ms total)
-4: [  PASSED  ] 11 tests.
-4/4 Test #4: cpuinfo_arm_test .................   Passed    0.05 sec
-
-100% tests passed, 0 tests failed out of 4
-
-Total Test time (real) =   0.11 sec
-make[1]: Leaving directory '/build/reproducible-path/cpu-features-0.9.0/obj-arm-linux-gnueabihf'
-   create-stamp debian/debhelper-build-stamp
-   dh_prep
-   dh_auto_install --destdir=debian/libcpu-features-dev/
-	cd obj-arm-linux-gnueabihf && make -j3 install DESTDIR=/build/reproducible-path/cpu-features-0.9.0/debian/libcpu-features-dev AM_UPDATE_INFO_DIR=no "INSTALL=install --strip-program=true"
-make[1]: Entering directory '/build/reproducible-path/cpu-features-0.9.0/obj-arm-linux-gnueabihf'
-/usr/bin/cmake -P /build/reproducible-path/cpu-features-0.9.0/obj-arm-linux-gnueabihf/CMakeFiles/VerifyGlobs.cmake
-/usr/bin/cmake -S/build/reproducible-path/cpu-features-0.9.0 -B/build/reproducible-path/cpu-features-0.9.0/obj-arm-linux-gnueabihf --check-build-system CMakeFiles/Makefile.cmake 0
-make  -f CMakeFiles/Makefile2 preinstall
-make[2]: Entering directory '/build/reproducible-path/cpu-features-0.9.0/obj-arm-linux-gnueabihf'
-make[2]: Nothing to be done for 'preinstall'.
-make[2]: Leaving directory '/build/reproducible-path/cpu-features-0.9.0/obj-arm-linux-gnueabihf'
-Install the project...
-/usr/bin/cmake -P cmake_install.cmake
--- Install configuration: "None"
--- Installing: /build/reproducible-path/cpu-features-0.9.0/debian/libcpu-features-dev/usr/lib/arm-linux-gnueabihf/libcpu_features.a
--- Installing: /build/reproducible-path/cpu-features-0.9.0/debian/libcpu-features-dev/usr/include/cpu_features/cpu_features_macros.h
--- Installing: /build/reproducible-path/cpu-features-0.9.0/debian/libcpu-features-dev/usr/include/cpu_features/cpu_features_cache_info.h
--- Installing: /build/reproducible-path/cpu-features-0.9.0/debian/libcpu-features-dev/usr/include/cpu_features/cpuinfo_arm.h
--- Installing: /build/reproducible-path/cpu-features-0.9.0/debian/libcpu-features-dev/usr/lib/arm-linux-gnueabihf/cmake/CpuFeatures/CpuFeaturesTargets.cmake
--- Installing: /build/reproducible-path/cpu-features-0.9.0/debian/libcpu-features-dev/usr/lib/arm-linux-gnueabihf/cmake/CpuFeatures/CpuFeaturesTargets-none.cmake
--- Installing: /build/reproducible-path/cpu-features-0.9.0/debian/libcpu-features-dev/usr/lib/arm-linux-gnueabihf/cmake/CpuFeatures/CpuFeaturesConfig.cmake
--- Installing: /build/reproducible-path/cpu-features-0.9.0/debian/libcpu-features-dev/usr/lib/arm-linux-gnueabihf/cmake/CpuFeatures/CpuFeaturesConfigVersion.cmake
-make[1]: Leaving directory '/build/reproducible-path/cpu-features-0.9.0/obj-arm-linux-gnueabihf'
-   dh_installdocs
-   dh_installchangelogs
-   dh_perl
-   dh_link
-   dh_strip_nondeterminism
-   dh_compress
-   dh_fixperms
-   dh_missing
-   dh_dwz -a
-   dh_strip -a
-   dh_makeshlibs -a
-   dh_shlibdeps -a
-   dh_installdeb
-   dh_gencontrol
-dpkg-gencontrol: warning: Depends field of package libcpu-features-dev: substitution variable ${shlibs:Depends} used, but is not defined
-   dh_md5sums
-   dh_builddeb
-dpkg-deb: building package 'libcpu-features-dev' in '../libcpu-features-dev_0.9.0-1_armhf.deb'.
- dpkg-genbuildinfo --build=binary -O../cpu-features_0.9.0-1_armhf.buildinfo
- dpkg-genchanges --build=binary -O../cpu-features_0.9.0-1_armhf.changes
-dpkg-genchanges: info: binary-only upload (no source code included)
- dpkg-source --after-build .
-dpkg-buildpackage: info: binary-only upload (no source included)
-dpkg-genchanges: info: including full source code in upload
+dh_auto_build: error: cd obj-arm-linux-gnueabihf && make -j4 "INSTALL=install --strip-program=true" VERBOSE=1 returned exit code 2
+make: *** [debian/rules:4: binary] Error 25
+dpkg-buildpackage: error: debian/rules binary subprocess returned exit status 2
 I: copying local configuration
+E: Failed autobuilding of package
+I: user script /srv/workspace/pbuilder/31041/tmp/hooks/C01_cleanup starting
+debug output: disk usage on i-capture-the-hostname at Thu Jan 23 09:14:08 UTC 2025
+Filesystem      Size  Used Avail Use% Mounted on
+tmpfs           6.2G     0  6.2G   0% /dev/shm
+
+I: user script /srv/workspace/pbuilder/31041/tmp/hooks/C01_cleanup finished
 I: unmounting dev/ptmx filesystem
 I: unmounting dev/pts filesystem
 I: unmounting dev/shm filesystem
 I: unmounting proc filesystem
 I: unmounting sys filesystem
 I: cleaning the build env 
-I: removing directory /srv/workspace/pbuilder/20304 and its subdirectories
-I: Current time: Wed Jan 22 21:11:31 -12 2025
-I: pbuilder-time-stamp: 1737623491
+I: removing directory /srv/workspace/pbuilder/31041 and its subdirectories