Diff of the two buildlogs:

--
--- b1/build.log	2025-03-27 03:39:39.144602016 +0000
+++ b2/build.log	2025-03-27 03:21:36.653748719 +0000
@@ -1,6 +1,6 @@
 I: pbuilder: network access will be disabled during build
-I: Current time: Wed Mar 26 15:21:40 -12 2025
-I: pbuilder-time-stamp: 1743045700
+I: Current time: Wed Apr 29 23:36:11 +14 2026
+I: pbuilder-time-stamp: 1777455371
 I: Building the build Environment
 I: extracting base tarball [/var/cache/pbuilder/trixie-reproducible-base.tgz]
 I: copying local configuration
@@ -24,52 +24,84 @@
 dpkg-source: info: applying debian-changes
 I: Not using root during the build.
 I: Installing the build-deps
-I: user script /srv/workspace/pbuilder/3177922/tmp/hooks/D02_print_environment starting
+I: user script /srv/workspace/pbuilder/3833837/tmp/hooks/D01_modify_environment starting
+debug: Running on ionos15-amd64.
+I: Changing host+domainname to test build reproducibility
+I: Adding a custom variable just for the fun of it...
+I: Changing /bin/sh to bash
+'/bin/sh' -> '/bin/bash'
+lrwxrwxrwx 1 root root 9 Apr 29 09:36 /bin/sh -> /bin/bash
+I: Setting pbuilder2's login shell to /bin/bash
+I: Setting pbuilder2's GECOS to second user,second room,second work-phone,second home-phone,second other
+I: user script /srv/workspace/pbuilder/3833837/tmp/hooks/D01_modify_environment finished
+I: user script /srv/workspace/pbuilder/3833837/tmp/hooks/D02_print_environment starting
 I: set
-  BUILDDIR='/build/reproducible-path'
-  BUILDUSERGECOS='first user,first room,first work-phone,first home-phone,first other'
-  BUILDUSERNAME='pbuilder1'
-  BUILD_ARCH='amd64'
-  DEBIAN_FRONTEND='noninteractive'
-  DEB_BUILD_OPTIONS='buildinfo=+all reproducible=+all parallel=20 '
-  DISTRIBUTION='trixie'
-  HOME='/root'
-  HOST_ARCH='amd64'
+  BASH=/bin/sh
+  BASHOPTS=checkwinsize:cmdhist:complete_fullquote:extquote:force_fignore:globasciiranges:globskipdots:hostcomplete:interactive_comments:patsub_replacement:progcomp:promptvars:sourcepath
+  BASH_ALIASES=()
+  BASH_ARGC=()
+  BASH_ARGV=()
+  BASH_CMDS=()
+  BASH_LINENO=([0]="12" [1]="0")
+  BASH_LOADABLES_PATH=/usr/local/lib/bash:/usr/lib/bash:/opt/local/lib/bash:/usr/pkg/lib/bash:/opt/pkg/lib/bash:.
+  BASH_SOURCE=([0]="/tmp/hooks/D02_print_environment" [1]="/tmp/hooks/D02_print_environment")
+  BASH_VERSINFO=([0]="5" [1]="2" [2]="37" [3]="1" [4]="release" [5]="x86_64-pc-linux-gnu")
+  BASH_VERSION='5.2.37(1)-release'
+  BUILDDIR=/build/reproducible-path
+  BUILDUSERGECOS='second user,second room,second work-phone,second home-phone,second other'
+  BUILDUSERNAME=pbuilder2
+  BUILD_ARCH=amd64
+  DEBIAN_FRONTEND=noninteractive
+  DEB_BUILD_OPTIONS='buildinfo=+all reproducible=+all parallel=42 '
+  DIRSTACK=()
+  DISTRIBUTION=trixie
+  EUID=0
+  FUNCNAME=([0]="Echo" [1]="main")
+  GROUPS=()
+  HOME=/root
+  HOSTNAME=i-capture-the-hostname
+  HOSTTYPE=x86_64
+  HOST_ARCH=amd64
   IFS=' 	
   '
-  INVOCATION_ID='8ebc5e0c84d14c3a9d0df36fe486accd'
-  LANG='C'
-  LANGUAGE='en_US:en'
-  LC_ALL='C'
-  MAIL='/var/mail/root'
-  OPTIND='1'
-  PATH='/usr/sbin:/usr/bin:/sbin:/bin:/usr/games'
-  PBCURRENTCOMMANDLINEOPERATION='build'
-  PBUILDER_OPERATION='build'
-  PBUILDER_PKGDATADIR='/usr/share/pbuilder'
-  PBUILDER_PKGLIBDIR='/usr/lib/pbuilder'
-  PBUILDER_SYSCONFDIR='/etc'
-  PPID='3177922'
-  PS1='# '
-  PS2='> '
+  INVOCATION_ID=6c44e4bd5d884a3bb254352a017e8940
+  LANG=C
+  LANGUAGE=et_EE:et
+  LC_ALL=C
+  MACHTYPE=x86_64-pc-linux-gnu
+  MAIL=/var/mail/root
+  OPTERR=1
+  OPTIND=1
+  OSTYPE=linux-gnu
+  PATH=/usr/sbin:/usr/bin:/sbin:/bin:/usr/games:/i/capture/the/path
+  PBCURRENTCOMMANDLINEOPERATION=build
+  PBUILDER_OPERATION=build
+  PBUILDER_PKGDATADIR=/usr/share/pbuilder
+  PBUILDER_PKGLIBDIR=/usr/lib/pbuilder
+  PBUILDER_SYSCONFDIR=/etc
+  PIPESTATUS=([0]="0")
+  POSIXLY_CORRECT=y
+  PPID=3833837
   PS4='+ '
-  PWD='/'
-  SHELL='/bin/bash'
-  SHLVL='2'
-  SUDO_COMMAND='/usr/bin/timeout -k 18.1h 18h /usr/bin/ionice -c 3 /usr/bin/nice /usr/sbin/pbuilder --build --configfile /srv/reproducible-results/rbuild-debian/r-b-build.K1wx3uHD/pbuilderrc_ceC5 --distribution trixie --hookdir /etc/pbuilder/first-build-hooks --debbuildopts -b --basetgz /var/cache/pbuilder/trixie-reproducible-base.tgz --buildresult /srv/reproducible-results/rbuild-debian/r-b-build.K1wx3uHD/b1 --logfile b1/build.log mksh_59c-40.dsc'
-  SUDO_GID='111'
-  SUDO_UID='106'
-  SUDO_USER='jenkins'
-  TERM='unknown'
-  TZ='/usr/share/zoneinfo/Etc/GMT+12'
-  USER='root'
-  _='/usr/bin/systemd-run'
-  http_proxy='http://46.16.76.132:3128'
+  PWD=/
+  SHELL=/bin/bash
+  SHELLOPTS=braceexpand:errexit:hashall:interactive-comments:posix
+  SHLVL=3
+  SUDO_COMMAND='/usr/bin/timeout -k 24.1h 24h /usr/bin/ionice -c 3 /usr/bin/nice -n 11 /usr/bin/unshare --uts -- /usr/sbin/pbuilder --build --configfile /srv/reproducible-results/rbuild-debian/r-b-build.K1wx3uHD/pbuilderrc_wRb0 --distribution trixie --hookdir /etc/pbuilder/rebuild-hooks --debbuildopts -b --basetgz /var/cache/pbuilder/trixie-reproducible-base.tgz --buildresult /srv/reproducible-results/rbuild-debian/r-b-build.K1wx3uHD/b2 --logfile b2/build.log mksh_59c-40.dsc'
+  SUDO_GID=111
+  SUDO_UID=106
+  SUDO_USER=jenkins
+  TERM=unknown
+  TZ=/usr/share/zoneinfo/Etc/GMT-14
+  UID=0
+  USER=root
+  _='I: set'
+  http_proxy=http://213.165.73.152:3128
 I: uname -a
-  Linux ionos11-amd64 6.1.0-32-amd64 #1 SMP PREEMPT_DYNAMIC Debian 6.1.129-1 (2025-03-06) x86_64 GNU/Linux
+  Linux i-capture-the-hostname 6.12.12+bpo-amd64 #1 SMP PREEMPT_DYNAMIC Debian 6.12.12-1~bpo12+1 (2025-02-23) x86_64 GNU/Linux
 I: ls -l /bin
-  lrwxrwxrwx 1 root root 7 Mar  4 11:20 /bin -> usr/bin
-I: user script /srv/workspace/pbuilder/3177922/tmp/hooks/D02_print_environment finished
+  lrwxrwxrwx 1 root root 7 Mar  4  2025 /bin -> usr/bin
+I: user script /srv/workspace/pbuilder/3833837/tmp/hooks/D02_print_environment finished
  -> Attempting to satisfy build-dependencies
  -> Creating pbuilder-satisfydepends-dummy package
 Package: pbuilder-satisfydepends-dummy
@@ -154,7 +186,7 @@
 Get: 35 http://deb.debian.org/debian trixie/main amd64 musl amd64 1.2.5-2 [427 kB]
 Get: 36 http://deb.debian.org/debian trixie/main amd64 musl-dev amd64 1.2.5-2 [615 kB]
 Get: 37 http://deb.debian.org/debian trixie/main amd64 musl-tools amd64 1.2.5-2 [41.7 kB]
-Fetched 22.7 MB in 4s (5413 kB/s)
+Fetched 22.7 MB in 0s (83.9 MB/s)
 Preconfiguring packages ...
 Selecting previously unselected package sensible-utils.
 (Reading database ... 
(Reading database ... 5%
(Reading database ... 10%
(Reading database ... 15%
(Reading database ... 20%
(Reading database ... 25%
(Reading database ... 30%
(Reading database ... 35%
(Reading database ... 40%
(Reading database ... 45%
(Reading database ... 50%
(Reading database ... 55%
(Reading database ... 60%
(Reading database ... 65%
(Reading database ... 70%
(Reading database ... 75%
(Reading database ... 80%
(Reading database ... 85%
(Reading database ... 90%
(Reading database ... 95%
(Reading database ... 100%
(Reading database ... 19807 files and directories currently installed.)
@@ -319,7 +351,11 @@
 Building tag database...
  -> Finished parsing the build-deps
 I: Building the package
-I: Running cd /build/reproducible-path/mksh-59c/ && env PATH="/usr/sbin:/usr/bin:/sbin:/bin:/usr/games" HOME="/nonexistent/first-build" dpkg-buildpackage -us -uc -b && env PATH="/usr/sbin:/usr/bin:/sbin:/bin:/usr/games" HOME="/nonexistent/first-build" dpkg-genchanges -S  > ../mksh_59c-40_source.changes
+I: user script /srv/workspace/pbuilder/3833837/tmp/hooks/A99_set_merged_usr starting
+Not re-configuring usrmerge for trixie
+I: user script /srv/workspace/pbuilder/3833837/tmp/hooks/A99_set_merged_usr finished
+hostname: Name or service not known
+I: Running cd /build/reproducible-path/mksh-59c/ && env PATH="/usr/sbin:/usr/bin:/sbin:/bin:/usr/games:/i/capture/the/path" HOME="/nonexistent/second-build" dpkg-buildpackage -us -uc -b && env PATH="/usr/sbin:/usr/bin:/sbin:/bin:/usr/games:/i/capture/the/path" HOME="/nonexistent/second-build" dpkg-genchanges -S  > ../mksh_59c-40_source.changes
 dpkg-buildpackage: info: source package mksh
 dpkg-buildpackage: info: source version 59c-40
 dpkg-buildpackage: info: source distribution unstable
@@ -392,12 +428,12 @@
 I: Values (not used) from environment: CFLAGS='-g -O2 -Werror=implicit-function-declaration -ffile-prefix-map=/build/reproducible-path/mksh-59c=. -fstack-protector-strong -fstack-clash-protection -Wformat -Werror=format-security -fcf-protection' CPPFLAGS='-Wdate-time -D_FORTIFY_SOURCE=2' LDFLAGS='-Wl,-z,relro'
 I: Using compiler: 'gcc'
 I: Values from dpkg-buildflags: CFLAGS='-g -O2 -Werror=implicit-function-declaration -ffile-prefix-map=/build/reproducible-path/mksh-59c=. -fstack-protector-strong -fstack-clash-protection -Wformat -Werror=format-security -fcf-protection' CPPFLAGS='-Wdate-time -D_FORTIFY_SOURCE=2' LDFLAGS='-Wl,-z,relro -Wl,-z,now'
-I: building with klibc '2.0.14-1', testing on Linux '6.1.0-32-amd64'
+I: building with klibc '2.0.14-1', testing on Linux '6.12.12+bpo-amd64'
 I: using static-pie in musl builds
-N: main = 0x7F38D0F90449
-N: main = 0x7EFEE0AA8449
-N: main = 0x7EFC364D0449
-N: main = 0x7F855B280449
+N: main = 0x7FE2507A9449
+N: main = 0x7F184C1B9449
+N: main = 0x7F88FEE20449
+N: main = 0x7F2E0EF03449
 N: 1
 N: t.exe: ELF 64-bit LSB pie executable, x86-64, version 1 (SYSV), static-pie linked, with debug_info, not stripped
 N: 1
@@ -408,10 +444,10 @@
 N: CPPFLAGS='-Wdate-time -D_FORTIFY_SOURCE=2 -DMKSH_EARLY_LOCALE_TRACKING -DKSH_VERSIONNAME_VENDOR_EXT=\"\ +Debian\" -DMKSH_BUILDMEAT'
 N: LDFLAGS='-Wl,-z,relro -Wl,-z,now -Wl,--as-needed'
 N: LDSTATIC='' LIBS=''
-+ env CC=gcc CFLAGS=-g -O2 -Werror=implicit-function-declaration -ffile-prefix-map=/build/reproducible-path/mksh-59c=. -fstack-protector-strong -fstack-clash-protection -Wformat -Werror=format-security -fcf-protection -Wall -Wextra CPPFLAGS=-Wdate-time -D_FORTIFY_SOURCE=2 -DMKSH_EARLY_LOCALE_TRACKING -DKSH_VERSIONNAME_VENDOR_EXT=\"\ +Debian\" -DMKSH_BUILDMEAT LDFLAGS=-Wl,-z,relro -Wl,-z,now -Wl,--as-needed LDSTATIC= LIBS= sh ../../Build.sh -r
++ env CC=gcc 'CFLAGS=-g -O2 -Werror=implicit-function-declaration -ffile-prefix-map=/build/reproducible-path/mksh-59c=. -fstack-protector-strong -fstack-clash-protection -Wformat -Werror=format-security -fcf-protection -Wall -Wextra' 'CPPFLAGS=-Wdate-time -D_FORTIFY_SOURCE=2 -DMKSH_EARLY_LOCALE_TRACKING -DKSH_VERSIONNAME_VENDOR_EXT=\"\ +Debian\" -DMKSH_BUILDMEAT' 'LDFLAGS=-Wl,-z,relro -Wl,-z,now -Wl,--as-needed' LDSTATIC= LIBS= sh ../../Build.sh -r
 For the build logs, demonstrate that /dev/null and /dev/tty exist:
-crw-rw-rw- 1 root root 1, 3 Mar 25 11:25 /dev/null
-crw-rw-rw- 1 root root 5, 0 Mar 25 11:25 /dev/tty
+crw-rw-rw- 1 root root 1, 3 Apr 26 17:46 /dev/null
+crw-rw-rw- 1 root root 5, 0 Apr 26 17:46 /dev/tty
 Flags on entry (plus HAVE_* which are not shown here):
 - CC        <gcc>
 - CFLAGS    <-g -O2 -Werror=implicit-function-declaration -ffile-prefix-map=/build/reproducible-path/mksh-59c=. -fstack-protector-strong -fstack-clash-protection -Wformat -Werror=format-security -fcf-protection -Wall -Wextra>
@@ -423,11 +459,11 @@
 
 Hi from $MirOS: src/bin/mksh/Build.sh,v 1.858 2024/08/17 23:33:47 tg Exp $ on:
 $ uname -a >&2
-| Linux ionos11-amd64 6.1.0-32-amd64 #1 SMP PREEMPT_DYNAMIC Debian 6.1.129-1 (2025-03-06) x86_64 GNU/Linux
-Build.sh: Building The MirBSD Korn Shell (mksh) R59 2024/07/26 on Linux 6.1.0-32-amd64...
+| Linux i-capture-the-hostname 6.12.12+bpo-amd64 #1 SMP PREEMPT_DYNAMIC Debian 6.12.12-1~bpo12+1 (2025-02-23) x86_64 GNU/Linux
+Build.sh: Building The MirBSD Korn Shell (mksh) R59 2024/07/26 on Linux 6.12.12+bpo-amd64...
 Build.sh: Scanning for functions... please ignore any errors.
 ... which compiler type seems to be used
-$ gcc -E -g -O2 -Werror=implicit-function-declaration -ffile-prefix-map=/build/reproducible-path/mksh-59c=. -fstack-protector-strong -fstack-clash-protection -Wformat -Werror=format-security -fcf-protection -Wall -Wextra -I. -I'../..' -Wdate-time -D_FORTIFY_SOURCE=2 -DMKSH_EARLY_LOCALE_TRACKING -DKSH_VERSIONNAME_VENDOR_EXT=\"\ +Debian\" -DMKSH_BUILDMEAT -DMKSH_BUILDSH=1 -D_GNU_SOURCE -DSETUID_CAN_FAIL_WITH_EAGAIN=1   conftest.c |     sed -n '/^ *[ce]t *= */s/^ *\([ce]t\) *= */=/p' | tr -d \015 >x
+$ gcc -E -g -O2 -Werror=implicit-function-declaration -ffile-prefix-map=/build/reproducible-path/mksh-59c=. -fstack-protector-strong -fstack-clash-protection -Wformat -Werror=format-security -fcf-protection -Wall -Wextra -I. -I'../..' -Wdate-time -D_FORTIFY_SOURCE=2 -DMKSH_EARLY_LOCALE_TRACKING -DKSH_VERSIONNAME_VENDOR_EXT=\"\ +Debian\" -DMKSH_BUILDMEAT -DMKSH_BUILDSH=1 -D_GNU_SOURCE -DSETUID_CAN_FAIL_WITH_EAGAIN=1   conftest.c |     sed -n '/^ *[ce]t *= */s/^ *\([ce]t\) *= */\1=/p' | tr -d \\015 >x
 [ ct="gcc"
 [ et="unknown"
 $ gcc -g -O2 -Werror=implicit-function-declaration -ffile-prefix-map=/build/reproducible-path/mksh-59c=. -fstack-protector-strong -fstack-clash-protection -Wformat -Werror=format-security -fcf-protection -Wall -Wextra  -I. -I'../..' -Wdate-time -D_FORTIFY_SOURCE=2 -DMKSH_EARLY_LOCALE_TRACKING -DKSH_VERSIONNAME_VENDOR_EXT=\"\ +Debian\" -DMKSH_BUILDMEAT -DMKSH_BUILDSH=1 -D_GNU_SOURCE -DSETUID_CAN_FAIL_WITH_EAGAIN=1 -Wl,-z,relro -Wl,-z,now -Wl,--as-needed  -v conftest.c 
@@ -442,7 +478,7 @@
 | Supported LTO compression algorithms: zlib zstd
 | gcc version 14.2.0 (Debian 14.2.0-19) 
 | COLLECT_GCC_OPTIONS='-g' '-O2' '-Werror=implicit-function-declaration' '-ffile-prefix-map=/build/reproducible-path/mksh-59c=.' '-fstack-protector-strong' '-fstack-clash-protection' '-Wformat=1' '-Werror=format-security' '-fcf-protection=full' '-Wall' '-Wextra' '-I' '.' '-I' '../..' '-Wdate-time' '-D' '_FORTIFY_SOURCE=2' '-D' 'MKSH_EARLY_LOCALE_TRACKING' '-D' 'KSH_VERSIONNAME_VENDOR_EXT=" +Debian"' '-D' 'MKSH_BUILDMEAT' '-D' 'MKSH_BUILDSH=1' '-D' '_GNU_SOURCE' '-D' 'SETUID_CAN_FAIL_WITH_EAGAIN=1' '-v' '-mtune=generic' '-march=x86-64' '-dumpdir' 'a-'
-|  /usr/libexec/gcc/x86_64-linux-gnu/14/cc1 -quiet -v -I . -I ../.. -imultiarch x86_64-linux-gnu -D _FORTIFY_SOURCE=2 -D MKSH_EARLY_LOCALE_TRACKING -D KSH_VERSIONNAME_VENDOR_EXT=" +Debian" -D MKSH_BUILDMEAT -D MKSH_BUILDSH=1 -D _GNU_SOURCE -D SETUID_CAN_FAIL_WITH_EAGAIN=1 conftest.c -quiet -dumpdir a- -dumpbase conftest.c -dumpbase-ext .c -mtune=generic -march=x86-64 -g -O2 -Werror=implicit-function-declaration -Wformat=1 -Werror=format-security -Wall -Wextra -Wdate-time -version -ffile-prefix-map=/build/reproducible-path/mksh-59c=. -fstack-protector-strong -fstack-clash-protection -fcf-protection=full -fasynchronous-unwind-tables -o /tmp/ccFSm7UH.s
+|  /usr/libexec/gcc/x86_64-linux-gnu/14/cc1 -quiet -v -I . -I ../.. -imultiarch x86_64-linux-gnu -D _FORTIFY_SOURCE=2 -D MKSH_EARLY_LOCALE_TRACKING -D KSH_VERSIONNAME_VENDOR_EXT=" +Debian" -D MKSH_BUILDMEAT -D MKSH_BUILDSH=1 -D _GNU_SOURCE -D SETUID_CAN_FAIL_WITH_EAGAIN=1 conftest.c -quiet -dumpdir a- -dumpbase conftest.c -dumpbase-ext .c -mtune=generic -march=x86-64 -g -O2 -Werror=implicit-function-declaration -Wformat=1 -Werror=format-security -Wall -Wextra -Wdate-time -version -ffile-prefix-map=/build/reproducible-path/mksh-59c=. -fstack-protector-strong -fstack-clash-protection -fcf-protection=full -fasynchronous-unwind-tables -o /tmp/ccOfeO0P.s
 | GNU C17 (Debian 14.2.0-19) version 14.2.0 (x86_64-linux-gnu)
 | 	compiled by GNU C version 14.2.0, GMP version 6.3.0, MPFR version 4.2.1, MPC version 1.3.1, isl version isl-0.27-GMP
 | 
@@ -462,12 +498,12 @@
 | End of search list.
 | Compiler executable checksum: 0051dfc1fa4e89ba97760da93f2546f3
 | COLLECT_GCC_OPTIONS='-g' '-O2' '-Werror=implicit-function-declaration' '-ffile-prefix-map=/build/reproducible-path/mksh-59c=.' '-fstack-protector-strong' '-fstack-clash-protection' '-Wformat=1' '-Werror=format-security' '-fcf-protection=full' '-Wall' '-Wextra' '-I' '.' '-I' '../..' '-Wdate-time' '-D' '_FORTIFY_SOURCE=2' '-D' 'MKSH_EARLY_LOCALE_TRACKING' '-D' 'KSH_VERSIONNAME_VENDOR_EXT=" +Debian"' '-D' 'MKSH_BUILDMEAT' '-D' 'MKSH_BUILDSH=1' '-D' '_GNU_SOURCE' '-D' 'SETUID_CAN_FAIL_WITH_EAGAIN=1' '-v' '-mtune=generic' '-march=x86-64' '-dumpdir' 'a-'
-|  as -v -I . -I ../.. --gdwarf-5 --64 -o /tmp/ccW5eKjS.o /tmp/ccFSm7UH.s
+|  as -v -I . -I ../.. --gdwarf-5 --64 -o /tmp/ccuInoyJ.o /tmp/ccOfeO0P.s
 | GNU assembler version 2.44 (x86_64-linux-gnu) using BFD version (GNU Binutils for Debian) 2.44
 | COMPILER_PATH=/usr/libexec/gcc/x86_64-linux-gnu/14/:/usr/libexec/gcc/x86_64-linux-gnu/14/:/usr/libexec/gcc/x86_64-linux-gnu/:/usr/lib/gcc/x86_64-linux-gnu/14/:/usr/lib/gcc/x86_64-linux-gnu/
 | LIBRARY_PATH=/usr/lib/gcc/x86_64-linux-gnu/14/:/usr/lib/gcc/x86_64-linux-gnu/14/../../../x86_64-linux-gnu/:/usr/lib/gcc/x86_64-linux-gnu/14/../../../../lib/:/lib/x86_64-linux-gnu/:/lib/../lib/:/usr/lib/x86_64-linux-gnu/:/usr/lib/../lib/:/usr/lib/gcc/x86_64-linux-gnu/14/../../../:/lib/:/usr/lib/
 | COLLECT_GCC_OPTIONS='-g' '-O2' '-Werror=implicit-function-declaration' '-ffile-prefix-map=/build/reproducible-path/mksh-59c=.' '-fstack-protector-strong' '-fstack-clash-protection' '-Wformat=1' '-Werror=format-security' '-fcf-protection=full' '-Wall' '-Wextra' '-I' '.' '-I' '../..' '-Wdate-time' '-D' '_FORTIFY_SOURCE=2' '-D' 'MKSH_EARLY_LOCALE_TRACKING' '-D' 'KSH_VERSIONNAME_VENDOR_EXT=" +Debian"' '-D' 'MKSH_BUILDMEAT' '-D' 'MKSH_BUILDSH=1' '-D' '_GNU_SOURCE' '-D' 'SETUID_CAN_FAIL_WITH_EAGAIN=1' '-v' '-mtune=generic' '-march=x86-64' '-dumpdir' 'a.'
-|  /usr/libexec/gcc/x86_64-linux-gnu/14/collect2 -plugin /usr/libexec/gcc/x86_64-linux-gnu/14/liblto_plugin.so -plugin-opt=/usr/libexec/gcc/x86_64-linux-gnu/14/lto-wrapper -plugin-opt=-fresolution=/tmp/cc2LE2Rp.res -plugin-opt=-pass-through=-lgcc -plugin-opt=-pass-through=-lgcc_s -plugin-opt=-pass-through=-lc -plugin-opt=-pass-through=-lgcc -plugin-opt=-pass-through=-lgcc_s --build-id --eh-frame-hdr -m elf_x86_64 --hash-style=gnu --as-needed -dynamic-linker /lib64/ld-linux-x86-64.so.2 -pie /usr/lib/gcc/x86_64-linux-gnu/14/../../../x86_64-linux-gnu/Scrt1.o /usr/lib/gcc/x86_64-linux-gnu/14/../../../x86_64-linux-gnu/crti.o /usr/lib/gcc/x86_64-linux-gnu/14/crtbeginS.o -L/usr/lib/gcc/x86_64-linux-gnu/14 -L/usr/lib/gcc/x86_64-linux-gnu/14/../../../x86_64-linux-gnu -L/usr/lib/gcc/x86_64-linux-gnu/14/../../../../lib -L/lib/x86_64-linux-gnu -L/lib/../lib -L/usr/lib/x86_64-linux-gnu -L/usr/lib/../lib -L/usr/lib/gcc/x86_64-linux-gnu/14/../../.. -z relro -z now --as-needed /tmp/ccW5eKjS.o -lgcc --push-state --as-needed -lgcc_s --pop-state -lc -lgcc --push-state --as-needed -lgcc_s --pop-state /usr/lib/gcc/x86_64-linux-gnu/14/crtendS.o /usr/lib/gcc/x86_64-linux-gnu/14/../../../x86_64-linux-gnu/crtn.o
+|  /usr/libexec/gcc/x86_64-linux-gnu/14/collect2 -plugin /usr/libexec/gcc/x86_64-linux-gnu/14/liblto_plugin.so -plugin-opt=/usr/libexec/gcc/x86_64-linux-gnu/14/lto-wrapper -plugin-opt=-fresolution=/tmp/ccvDsNuE.res -plugin-opt=-pass-through=-lgcc -plugin-opt=-pass-through=-lgcc_s -plugin-opt=-pass-through=-lc -plugin-opt=-pass-through=-lgcc -plugin-opt=-pass-through=-lgcc_s --build-id --eh-frame-hdr -m elf_x86_64 --hash-style=gnu --as-needed -dynamic-linker /lib64/ld-linux-x86-64.so.2 -pie /usr/lib/gcc/x86_64-linux-gnu/14/../../../x86_64-linux-gnu/Scrt1.o /usr/lib/gcc/x86_64-linux-gnu/14/../../../x86_64-linux-gnu/crti.o /usr/lib/gcc/x86_64-linux-gnu/14/crtbeginS.o -L/usr/lib/gcc/x86_64-linux-gnu/14 -L/usr/lib/gcc/x86_64-linux-gnu/14/../../../x86_64-linux-gnu -L/usr/lib/gcc/x86_64-linux-gnu/14/../../../../lib -L/lib/x86_64-linux-gnu -L/lib/../lib -L/usr/lib/x86_64-linux-gnu -L/usr/lib/../lib -L/usr/lib/gcc/x86_64-linux-gnu/14/../../.. -z relro -z now --as-needed /tmp/ccuInoyJ.o -lgcc --push-state --as-needed -lgcc_s --pop-state -lc -lgcc --push-state --as-needed -lgcc_s --pop-state /usr/lib/gcc/x86_64-linux-gnu/14/crtendS.o /usr/lib/gcc/x86_64-linux-gnu/14/../../../x86_64-linux-gnu/crtn.o
 | COLLECT_GCC_OPTIONS='-g' '-O2' '-Werror=implicit-function-declaration' '-ffile-prefix-map=/build/reproducible-path/mksh-59c=.' '-fstack-protector-strong' '-fstack-clash-protection' '-Wformat=1' '-Werror=format-security' '-fcf-protection=full' '-Wall' '-Wextra' '-I' '.' '-I' '../..' '-Wdate-time' '-D' '_FORTIFY_SOURCE=2' '-D' 'MKSH_EARLY_LOCALE_TRACKING' '-D' 'KSH_VERSIONNAME_VENDOR_EXT=" +Debian"' '-D' 'MKSH_BUILDMEAT' '-D' 'MKSH_BUILDSH=1' '-D' '_GNU_SOURCE' '-D' 'SETUID_CAN_FAIL_WITH_EAGAIN=1' '-v' '-mtune=generic' '-march=x86-64' '-dumpdir' 'a.'
 $ eval echo "\`$CC $CFLAGS $Cg $CPPFLAGS $LDFLAGS $NOWARN $LIBS -dumpmachine\`" \
 		 "gcc\`$CC $CFLAGS $Cg $CPPFLAGS $LDFLAGS $NOWARN $LIBS -dumpversion\`"
@@ -478,7 +514,7 @@
 ==> if the compiler works... yes
 ... if the compiler does not fail correctly
 $ gcc -g -O2 -Werror=implicit-function-declaration -ffile-prefix-map=/build/reproducible-path/mksh-59c=. -fstack-protector-strong -fstack-clash-protection -Wformat -Werror=format-security -fcf-protection -Wall -Wextra  -I. -I'../..' -Wdate-time -D_FORTIFY_SOURCE=2 -DMKSH_EARLY_LOCALE_TRACKING -DKSH_VERSIONNAME_VENDOR_EXT=\"\ +Debian\" -DMKSH_BUILDMEAT -DMKSH_BUILDSH=1 -D_GNU_SOURCE -DSETUID_CAN_FAIL_WITH_EAGAIN=1 -Wl,-z,relro -Wl,-z,now -Wl,--as-needed  conftest.c  || for _f in ${tcfn}*; do case $_f in lksh.1|mksh.1|mksh.faq|mksh.ico) ;; *) rm -f "$_f" ;; esac; done
-] /usr/bin/ld: /tmp/ccwXnpRM.o: in function `main':
+] /usr/bin/ld: /tmp/ccFIW4IS.o: in function `main':
 ] ./builddir/full/./builddir/full/conftest.c:15:(.text.startup+0xf): undefined reference to `thiswillneverbedefinedIhope'
 ] collect2: error: ld returned 1 exit status
 ==> if the compiler does not fail correctly... no
@@ -534,38 +570,38 @@
 ==> for __attribute__((__used__))... yes
 ... if a reduced-feature mksh is requested
 $ gcc -g -O2 -Werror=implicit-function-declaration -ffile-prefix-map=/build/reproducible-path/mksh-59c=. -fstack-protector-strong -fstack-clash-protection -Wformat -Werror=format-security -fcf-protection -Wall -Wextra -fno-lto -Wno-deprecated-declarations -fno-asynchronous-unwind-tables -fno-strict-aliasing -fstack-protector-strong -malign-data=abi -fwrapv  -I. -I'../..' -Wdate-time -D_FORTIFY_SOURCE=2 -DMKSH_EARLY_LOCALE_TRACKING -DKSH_VERSIONNAME_VENDOR_EXT=\"\ +Debian\" -DMKSH_BUILDMEAT -DMKSH_BUILDSH=1 -D_GNU_SOURCE -DSETUID_CAN_FAIL_WITH_EAGAIN=1 -DHAVE_STRING_POOLING=2 -DHAVE_ATTRIBUTE_BOUNDED=0 -DHAVE_ATTRIBUTE_FORMAT=1 -DHAVE_ATTRIBUTE_NORETURN=1 -DHAVE_ATTRIBUTE_UNUSED=1 -DHAVE_ATTRIBUTE_USED=1 -Wl,-z,relro -Wl,-z,now -Wl,--as-needed -fno-lto -Wno-error conftest.c  || for _f in ${tcfn}*; do case $_f in lksh.1|mksh.1|mksh.faq|mksh.ico) ;; *) rm -f "$_f" ;; esac; done
-] /usr/bin/ld: /tmp/ccd7Mo0R.o: in function `main':
+] /usr/bin/ld: /tmp/ccf11Ejs.o: in function `main':
 ] ./builddir/full/./builddir/full/conftest.c:15:(.text.startup+0xf): undefined reference to `thiswillneverbedefinedIhope'
 ] collect2: error: ld returned 1 exit status
 ==> if a reduced-feature mksh is requested... no
 ... if invoking as sh should be handled specially
 $ gcc -g -O2 -Werror=implicit-function-declaration -ffile-prefix-map=/build/reproducible-path/mksh-59c=. -fstack-protector-strong -fstack-clash-protection -Wformat -Werror=format-security -fcf-protection -Wall -Wextra -fno-lto -Wno-deprecated-declarations -fno-asynchronous-unwind-tables -fno-strict-aliasing -fstack-protector-strong -malign-data=abi -fwrapv  -I. -I'../..' -Wdate-time -D_FORTIFY_SOURCE=2 -DMKSH_EARLY_LOCALE_TRACKING -DKSH_VERSIONNAME_VENDOR_EXT=\"\ +Debian\" -DMKSH_BUILDMEAT -DMKSH_BUILDSH=1 -D_GNU_SOURCE -DSETUID_CAN_FAIL_WITH_EAGAIN=1 -DHAVE_STRING_POOLING=2 -DHAVE_ATTRIBUTE_BOUNDED=0 -DHAVE_ATTRIBUTE_FORMAT=1 -DHAVE_ATTRIBUTE_NORETURN=1 -DHAVE_ATTRIBUTE_UNUSED=1 -DHAVE_ATTRIBUTE_USED=1 -Wl,-z,relro -Wl,-z,now -Wl,--as-needed -fno-lto -Wno-error conftest.c  || for _f in ${tcfn}*; do case $_f in lksh.1|mksh.1|mksh.faq|mksh.ico) ;; *) rm -f "$_f" ;; esac; done
-] /usr/bin/ld: /tmp/ccOSLTFq.o: in function `main':
+] /usr/bin/ld: /tmp/ccWSzXvK.o: in function `main':
 ] ./builddir/full/./builddir/full/conftest.c:15:(.text.startup+0xf): undefined reference to `thiswillneverbedefinedIhope'
 ] collect2: error: ld returned 1 exit status
 ==> if invoking as sh should be handled specially... no
 ... if mksh will be built without job control
 $ gcc -g -O2 -Werror=implicit-function-declaration -ffile-prefix-map=/build/reproducible-path/mksh-59c=. -fstack-protector-strong -fstack-clash-protection -Wformat -Werror=format-security -fcf-protection -Wall -Wextra -fno-lto -Wno-deprecated-declarations -fno-asynchronous-unwind-tables -fno-strict-aliasing -fstack-protector-strong -malign-data=abi -fwrapv  -I. -I'../..' -Wdate-time -D_FORTIFY_SOURCE=2 -DMKSH_EARLY_LOCALE_TRACKING -DKSH_VERSIONNAME_VENDOR_EXT=\"\ +Debian\" -DMKSH_BUILDMEAT -DMKSH_BUILDSH=1 -D_GNU_SOURCE -DSETUID_CAN_FAIL_WITH_EAGAIN=1 -DHAVE_STRING_POOLING=2 -DHAVE_ATTRIBUTE_BOUNDED=0 -DHAVE_ATTRIBUTE_FORMAT=1 -DHAVE_ATTRIBUTE_NORETURN=1 -DHAVE_ATTRIBUTE_UNUSED=1 -DHAVE_ATTRIBUTE_USED=1 -Wl,-z,relro -Wl,-z,now -Wl,--as-needed -fno-lto -Wno-error conftest.c  || for _f in ${tcfn}*; do case $_f in lksh.1|mksh.1|mksh.faq|mksh.ico) ;; *) rm -f "$_f" ;; esac; done
-] /usr/bin/ld: /tmp/ccTj3KVI.o: in function `main':
+] /usr/bin/ld: /tmp/cczHXjTg.o: in function `main':
 ] ./builddir/full/./builddir/full/conftest.c:15:(.text.startup+0xf): undefined reference to `thiswillneverbedefinedIhope'
 ] collect2: error: ld returned 1 exit status
 ==> if mksh will be built without job control... no
 ... if mksh will be built without job signals
 $ gcc -g -O2 -Werror=implicit-function-declaration -ffile-prefix-map=/build/reproducible-path/mksh-59c=. -fstack-protector-strong -fstack-clash-protection -Wformat -Werror=format-security -fcf-protection -Wall -Wextra -fno-lto -Wno-deprecated-declarations -fno-asynchronous-unwind-tables -fno-strict-aliasing -fstack-protector-strong -malign-data=abi -fwrapv  -I. -I'../..' -Wdate-time -D_FORTIFY_SOURCE=2 -DMKSH_EARLY_LOCALE_TRACKING -DKSH_VERSIONNAME_VENDOR_EXT=\"\ +Debian\" -DMKSH_BUILDMEAT -DMKSH_BUILDSH=1 -D_GNU_SOURCE -DSETUID_CAN_FAIL_WITH_EAGAIN=1 -DHAVE_STRING_POOLING=2 -DHAVE_ATTRIBUTE_BOUNDED=0 -DHAVE_ATTRIBUTE_FORMAT=1 -DHAVE_ATTRIBUTE_NORETURN=1 -DHAVE_ATTRIBUTE_UNUSED=1 -DHAVE_ATTRIBUTE_USED=1 -Wl,-z,relro -Wl,-z,now -Wl,--as-needed -fno-lto -Wno-error conftest.c  || for _f in ${tcfn}*; do case $_f in lksh.1|mksh.1|mksh.faq|mksh.ico) ;; *) rm -f "$_f" ;; esac; done
-] /usr/bin/ld: /tmp/cc23H1iy.o: in function `main':
+] /usr/bin/ld: /tmp/cchX5t5f.o: in function `main':
 ] ./builddir/full/./builddir/full/conftest.c:15:(.text.startup+0xf): undefined reference to `thiswillneverbedefinedIhope'
 ] collect2: error: ld returned 1 exit status
 ==> if mksh will be built without job signals... no
 ... if the default UTF-8 mode is specified
 $ gcc -g -O2 -Werror=implicit-function-declaration -ffile-prefix-map=/build/reproducible-path/mksh-59c=. -fstack-protector-strong -fstack-clash-protection -Wformat -Werror=format-security -fcf-protection -Wall -Wextra -fno-lto -Wno-deprecated-declarations -fno-asynchronous-unwind-tables -fno-strict-aliasing -fstack-protector-strong -malign-data=abi -fwrapv  -I. -I'../..' -Wdate-time -D_FORTIFY_SOURCE=2 -DMKSH_EARLY_LOCALE_TRACKING -DKSH_VERSIONNAME_VENDOR_EXT=\"\ +Debian\" -DMKSH_BUILDMEAT -DMKSH_BUILDSH=1 -D_GNU_SOURCE -DSETUID_CAN_FAIL_WITH_EAGAIN=1 -DHAVE_STRING_POOLING=2 -DHAVE_ATTRIBUTE_BOUNDED=0 -DHAVE_ATTRIBUTE_FORMAT=1 -DHAVE_ATTRIBUTE_NORETURN=1 -DHAVE_ATTRIBUTE_UNUSED=1 -DHAVE_ATTRIBUTE_USED=1 -Wl,-z,relro -Wl,-z,now -Wl,--as-needed -fno-lto -Wno-error conftest.c  || for _f in ${tcfn}*; do case $_f in lksh.1|mksh.1|mksh.faq|mksh.ico) ;; *) rm -f "$_f" ;; esac; done
-] /usr/bin/ld: /tmp/cckVvLso.o: in function `main':
+] /usr/bin/ld: /tmp/ccTB71uu.o: in function `main':
 ] ./builddir/full/./builddir/full/conftest.c:15:(.text.startup+0xf): undefined reference to `thiswillneverbedefinedIhope'
 ] collect2: error: ld returned 1 exit status
 ==> if the default UTF-8 mode is specified... no
 ==> if the default UTF-8 mode is disabled... no (implied)
 ... if the MidnightBSD 0.1 ash compatibility mode is requested
 $ gcc -g -O2 -Werror=implicit-function-declaration -ffile-prefix-map=/build/reproducible-path/mksh-59c=. -fstack-protector-strong -fstack-clash-protection -Wformat -Werror=format-security -fcf-protection -Wall -Wextra -fno-lto -Wno-deprecated-declarations -fno-asynchronous-unwind-tables -fno-strict-aliasing -fstack-protector-strong -malign-data=abi -fwrapv  -I. -I'../..' -Wdate-time -D_FORTIFY_SOURCE=2 -DMKSH_EARLY_LOCALE_TRACKING -DKSH_VERSIONNAME_VENDOR_EXT=\"\ +Debian\" -DMKSH_BUILDMEAT -DMKSH_BUILDSH=1 -D_GNU_SOURCE -DSETUID_CAN_FAIL_WITH_EAGAIN=1 -DHAVE_STRING_POOLING=2 -DHAVE_ATTRIBUTE_BOUNDED=0 -DHAVE_ATTRIBUTE_FORMAT=1 -DHAVE_ATTRIBUTE_NORETURN=1 -DHAVE_ATTRIBUTE_UNUSED=1 -DHAVE_ATTRIBUTE_USED=1 -Wl,-z,relro -Wl,-z,now -Wl,--as-needed -fno-lto -Wno-error conftest.c  || for _f in ${tcfn}*; do case $_f in lksh.1|mksh.1|mksh.faq|mksh.ico) ;; *) rm -f "$_f" ;; esac; done
-] /usr/bin/ld: /tmp/cclg7uMt.o: in function `main':
+] /usr/bin/ld: /tmp/ccPjqnKc.o: in function `main':
 ] ./builddir/full/./builddir/full/conftest.c:15:(.text.startup+0xf): undefined reference to `thiswillneverbedefinedIhope'
 ] collect2: error: ld returned 1 exit status
 ==> if the MidnightBSD 0.1 ash compatibility mode is requested... no
@@ -1487,10 +1523,10 @@
 N: CPPFLAGS='-Wdate-time -D_FORTIFY_SOURCE=2 -DMKSH_EARLY_LOCALE_TRACKING -DKSH_VERSIONNAME_VENDOR_EXT=\"\ +Debian\" -DMKSH_BUILDMEAT -DMKSH_BINSHPOSIX -DMKSH_BINSHREDUCED -DMKSH_SMALL -DMKSH_SMALL_BUT_FAST'
 N: LDFLAGS='-Wl,-z,relro -Wl,-z,now -Wl,--as-needed'
 N: LDSTATIC='-static -static-pie -Wl,-z,text' LIBS=''
-+ env CC=musl-gcc CFLAGS=-Os -g -Werror=implicit-function-declaration -ffile-prefix-map=/build/reproducible-path/mksh-59c=. -fstack-clash-protection -Wformat -Werror=format-security -fcf-protection -Wall -Wextra -fPIE CPPFLAGS=-Wdate-time -D_FORTIFY_SOURCE=2 -DMKSH_EARLY_LOCALE_TRACKING -DKSH_VERSIONNAME_VENDOR_EXT=\"\ +Debian\" -DMKSH_BUILDMEAT -DMKSH_BINSHPOSIX -DMKSH_BINSHREDUCED -DMKSH_SMALL -DMKSH_SMALL_BUT_FAST LDFLAGS=-Wl,-z,relro -Wl,-z,now -Wl,--as-needed LDSTATIC=-static -static-pie -Wl,-z,text LIBS= sh ../../Build.sh -r -c trace
++ env CC=musl-gcc 'CFLAGS=-Os -g -Werror=implicit-function-declaration -ffile-prefix-map=/build/reproducible-path/mksh-59c=. -fstack-clash-protection -Wformat -Werror=format-security -fcf-protection -Wall -Wextra -fPIE' 'CPPFLAGS=-Wdate-time -D_FORTIFY_SOURCE=2 -DMKSH_EARLY_LOCALE_TRACKING -DKSH_VERSIONNAME_VENDOR_EXT=\"\ +Debian\" -DMKSH_BUILDMEAT -DMKSH_BINSHPOSIX -DMKSH_BINSHREDUCED -DMKSH_SMALL -DMKSH_SMALL_BUT_FAST' 'LDFLAGS=-Wl,-z,relro -Wl,-z,now -Wl,--as-needed' 'LDSTATIC=-static -static-pie -Wl,-z,text' LIBS= sh ../../Build.sh -r -c trace
 For the build logs, demonstrate that /dev/null and /dev/tty exist:
-crw-rw-rw- 1 root root 1, 3 Mar 25 11:25 /dev/null
-crw-rw-rw- 1 root root 5, 0 Mar 25 11:25 /dev/tty
+crw-rw-rw- 1 root root 1, 3 Apr 26 17:46 /dev/null
+crw-rw-rw- 1 root root 5, 0 Apr 29 09:37 /dev/tty
 Flags on entry (plus HAVE_* which are not shown here):
 - CC        <musl-gcc>
 - CFLAGS    <-Os -g -Werror=implicit-function-declaration -ffile-prefix-map=/build/reproducible-path/mksh-59c=. -fstack-clash-protection -Wformat -Werror=format-security -fcf-protection -Wall -Wextra -fPIE>
@@ -1502,11 +1538,11 @@
 
 Hi from $MirOS: src/bin/mksh/Build.sh,v 1.858 2024/08/17 23:33:47 tg Exp $ on:
 $ uname -a >&2
-| Linux ionos11-amd64 6.1.0-32-amd64 #1 SMP PREEMPT_DYNAMIC Debian 6.1.129-1 (2025-03-06) x86_64 GNU/Linux
-Build.sh: Building The MirBSD Korn Shell (mksh) R59 2024/07/26 on Linux 6.1.0-32-amd64...
+| Linux i-capture-the-hostname 6.12.12+bpo-amd64 #1 SMP PREEMPT_DYNAMIC Debian 6.12.12-1~bpo12+1 (2025-02-23) x86_64 GNU/Linux
+Build.sh: Building The MirBSD Korn Shell (mksh) R59 2024/07/26 on Linux 6.12.12+bpo-amd64...
 Build.sh: Scanning for functions... please ignore any errors.
 ... which compiler type seems to be used
-$ musl-gcc -E -Os -g -Werror=implicit-function-declaration -ffile-prefix-map=/build/reproducible-path/mksh-59c=. -fstack-clash-protection -Wformat -Werror=format-security -fcf-protection -Wall -Wextra -fPIE -I. -I'../..' -Wdate-time -D_FORTIFY_SOURCE=2 -DMKSH_EARLY_LOCALE_TRACKING -DKSH_VERSIONNAME_VENDOR_EXT=\"\ +Debian\" -DMKSH_BUILDMEAT -DMKSH_BINSHPOSIX -DMKSH_BINSHREDUCED -DMKSH_SMALL -DMKSH_SMALL_BUT_FAST -DMKSH_BUILDSH=1 -D_GNU_SOURCE -DSETUID_CAN_FAIL_WITH_EAGAIN=1   conftest.c |     sed -n '/^ *[ce]t *= */s/^ *\([ce]t\) *= */=/p' | tr -d \015 >x
+$ musl-gcc -E -Os -g -Werror=implicit-function-declaration -ffile-prefix-map=/build/reproducible-path/mksh-59c=. -fstack-clash-protection -Wformat -Werror=format-security -fcf-protection -Wall -Wextra -fPIE -I. -I'../..' -Wdate-time -D_FORTIFY_SOURCE=2 -DMKSH_EARLY_LOCALE_TRACKING -DKSH_VERSIONNAME_VENDOR_EXT=\"\ +Debian\" -DMKSH_BUILDMEAT -DMKSH_BINSHPOSIX -DMKSH_BINSHREDUCED -DMKSH_SMALL -DMKSH_SMALL_BUT_FAST -DMKSH_BUILDSH=1 -D_GNU_SOURCE -DSETUID_CAN_FAIL_WITH_EAGAIN=1   conftest.c |     sed -n '/^ *[ce]t *= */s/^ *\([ce]t\) *= */\1=/p' | tr -d \\015 >x
 [ ct="gcc"
 [ et="unknown"
 $ musl-gcc -Os -g -Werror=implicit-function-declaration -ffile-prefix-map=/build/reproducible-path/mksh-59c=. -fstack-clash-protection -Wformat -Werror=format-security -fcf-protection -Wall -Wextra -fPIE  -I. -I'../..' -Wdate-time -D_FORTIFY_SOURCE=2 -DMKSH_EARLY_LOCALE_TRACKING -DKSH_VERSIONNAME_VENDOR_EXT=\"\ +Debian\" -DMKSH_BUILDMEAT -DMKSH_BINSHPOSIX -DMKSH_BINSHREDUCED -DMKSH_SMALL -DMKSH_SMALL_BUT_FAST -DMKSH_BUILDSH=1 -D_GNU_SOURCE -DSETUID_CAN_FAIL_WITH_EAGAIN=1 -Wl,-z,relro -Wl,-z,now -Wl,--as-needed -static -static-pie -Wl,-z,text  -v conftest.c 
@@ -1523,7 +1559,7 @@
 | Supported LTO compression algorithms: zlib zstd
 | gcc version 14.2.0 (Debian 14.2.0-19) 
 | COLLECT_GCC_OPTIONS='-Os' '-g' '-Werror=implicit-function-declaration' '-ffile-prefix-map=/build/reproducible-path/mksh-59c=.' '-fstack-clash-protection' '-Wformat=1' '-Werror=format-security' '-fcf-protection=full' '-Wall' '-Wextra' '-fPIE' '-I' '.' '-I' '../..' '-Wdate-time' '-D' '_FORTIFY_SOURCE=2' '-D' 'MKSH_EARLY_LOCALE_TRACKING' '-D' 'KSH_VERSIONNAME_VENDOR_EXT=" +Debian"' '-D' 'MKSH_BUILDMEAT' '-D' 'MKSH_BINSHPOSIX' '-D' 'MKSH_BINSHREDUCED' '-D' 'MKSH_SMALL' '-D' 'MKSH_SMALL_BUT_FAST' '-D' 'MKSH_BUILDSH=1' '-D' '_GNU_SOURCE' '-D' 'SETUID_CAN_FAIL_WITH_EAGAIN=1' '-static' '-static-pie' '-v' '-specs=/usr/lib/x86_64-linux-musl/musl-gcc.specs' '-mtune=generic' '-march=x86-64' '-dumpdir' 'a-'
-|  /usr/libexec/gcc/x86_64-linux-gnu/14/cc1 -quiet -v -I . -I ../.. -imultiarch x86_64-linux-gnu -D _FORTIFY_SOURCE=2 -D MKSH_EARLY_LOCALE_TRACKING -D KSH_VERSIONNAME_VENDOR_EXT=" +Debian" -D MKSH_BUILDMEAT -D MKSH_BINSHPOSIX -D MKSH_BINSHREDUCED -D MKSH_SMALL -D MKSH_SMALL_BUT_FAST -D MKSH_BUILDSH=1 -D _GNU_SOURCE -D SETUID_CAN_FAIL_WITH_EAGAIN=1 conftest.c -nostdinc -isystem /usr/include/x86_64-linux-musl -isystem /usr/lib/gcc/x86_64-linux-gnu/14/include -quiet -dumpdir a- -dumpbase conftest.c -dumpbase-ext .c -mtune=generic -march=x86-64 -g -Os -Werror=implicit-function-declaration -Wformat=1 -Werror=format-security -Wall -Wextra -Wdate-time -version -ffile-prefix-map=/build/reproducible-path/mksh-59c=. -fstack-clash-protection -fcf-protection=full -fPIE -fasynchronous-unwind-tables -o /tmp/cc11ukUg.s
+|  /usr/libexec/gcc/x86_64-linux-gnu/14/cc1 -quiet -v -I . -I ../.. -imultiarch x86_64-linux-gnu -D _FORTIFY_SOURCE=2 -D MKSH_EARLY_LOCALE_TRACKING -D KSH_VERSIONNAME_VENDOR_EXT=" +Debian" -D MKSH_BUILDMEAT -D MKSH_BINSHPOSIX -D MKSH_BINSHREDUCED -D MKSH_SMALL -D MKSH_SMALL_BUT_FAST -D MKSH_BUILDSH=1 -D _GNU_SOURCE -D SETUID_CAN_FAIL_WITH_EAGAIN=1 conftest.c -nostdinc -isystem /usr/include/x86_64-linux-musl -isystem /usr/lib/gcc/x86_64-linux-gnu/14/include -quiet -dumpdir a- -dumpbase conftest.c -dumpbase-ext .c -mtune=generic -march=x86-64 -g -Os -Werror=implicit-function-declaration -Wformat=1 -Werror=format-security -Wall -Wextra -Wdate-time -version -ffile-prefix-map=/build/reproducible-path/mksh-59c=. -fstack-clash-protection -fcf-protection=full -fPIE -fasynchronous-unwind-tables -o /tmp/ccj8lTtS.s
 | GNU C17 (Debian 14.2.0-19) version 14.2.0 (x86_64-linux-gnu)
 | 	compiled by GNU C version 14.2.0, GMP version 6.3.0, MPFR version 4.2.1, MPC version 1.3.1, isl version isl-0.27-GMP
 | 
@@ -1537,12 +1573,12 @@
 | End of search list.
 | Compiler executable checksum: 0051dfc1fa4e89ba97760da93f2546f3
 | COLLECT_GCC_OPTIONS='-Os' '-g' '-Werror=implicit-function-declaration' '-ffile-prefix-map=/build/reproducible-path/mksh-59c=.' '-fstack-clash-protection' '-Wformat=1' '-Werror=format-security' '-fcf-protection=full' '-Wall' '-Wextra' '-fPIE' '-I' '.' '-I' '../..' '-Wdate-time' '-D' '_FORTIFY_SOURCE=2' '-D' 'MKSH_EARLY_LOCALE_TRACKING' '-D' 'KSH_VERSIONNAME_VENDOR_EXT=" +Debian"' '-D' 'MKSH_BUILDMEAT' '-D' 'MKSH_BINSHPOSIX' '-D' 'MKSH_BINSHREDUCED' '-D' 'MKSH_SMALL' '-D' 'MKSH_SMALL_BUT_FAST' '-D' 'MKSH_BUILDSH=1' '-D' '_GNU_SOURCE' '-D' 'SETUID_CAN_FAIL_WITH_EAGAIN=1' '-static' '-static-pie' '-v' '-specs=/usr/lib/x86_64-linux-musl/musl-gcc.specs' '-mtune=generic' '-march=x86-64' '-dumpdir' 'a-'
-|  as -v -I . -I ../.. --gdwarf-5 --64 -o /tmp/ccailL0x.o /tmp/cc11ukUg.s
+|  as -v -I . -I ../.. --gdwarf-5 --64 -o /tmp/cckRXRGb.o /tmp/ccj8lTtS.s
 | GNU assembler version 2.44 (x86_64-linux-gnu) using BFD version (GNU Binutils for Debian) 2.44
 | COMPILER_PATH=/usr/libexec/gcc/x86_64-linux-gnu/14/:/usr/libexec/gcc/x86_64-linux-gnu/14/:/usr/libexec/gcc/x86_64-linux-gnu/:/usr/lib/gcc/x86_64-linux-gnu/14/:/usr/lib/gcc/x86_64-linux-gnu/
 | LIBRARY_PATH=/usr/lib/gcc/x86_64-linux-gnu/14/:/usr/lib/gcc/x86_64-linux-gnu/14/../../../x86_64-linux-gnu/:/usr/lib/gcc/x86_64-linux-gnu/14/../../../../lib/:/lib/x86_64-linux-gnu/:/lib/../lib/:/usr/lib/x86_64-linux-gnu/:/usr/lib/../lib/:/usr/lib/gcc/x86_64-linux-gnu/14/../../../:/lib/:/usr/lib/
 | COLLECT_GCC_OPTIONS='-Os' '-g' '-Werror=implicit-function-declaration' '-ffile-prefix-map=/build/reproducible-path/mksh-59c=.' '-fstack-clash-protection' '-Wformat=1' '-Werror=format-security' '-fcf-protection=full' '-Wall' '-Wextra' '-fPIE' '-I' '.' '-I' '../..' '-Wdate-time' '-D' '_FORTIFY_SOURCE=2' '-D' 'MKSH_EARLY_LOCALE_TRACKING' '-D' 'KSH_VERSIONNAME_VENDOR_EXT=" +Debian"' '-D' 'MKSH_BUILDMEAT' '-D' 'MKSH_BINSHPOSIX' '-D' 'MKSH_BINSHREDUCED' '-D' 'MKSH_SMALL' '-D' 'MKSH_SMALL_BUT_FAST' '-D' 'MKSH_BUILDSH=1' '-D' '_GNU_SOURCE' '-D' 'SETUID_CAN_FAIL_WITH_EAGAIN=1' '-static' '-static-pie' '-v' '-specs=/usr/lib/x86_64-linux-musl/musl-gcc.specs' '-mtune=generic' '-march=x86-64' '-dumpdir' 'a.'
-|  /usr/libexec/gcc/x86_64-linux-gnu/14/collect2 -plugin /usr/libexec/gcc/x86_64-linux-gnu/14/liblto_plugin.so -plugin-opt=/usr/libexec/gcc/x86_64-linux-gnu/14/lto-wrapper -plugin-opt=-fresolution=/tmp/ccCk8sdt.res -plugin-opt=-pass-through=/usr/lib/gcc/x86_64-linux-gnu/14/libgcc.a -plugin-opt=-pass-through=/usr/lib/gcc/x86_64-linux-gnu/14/libgcc_eh.a -plugin-opt=-pass-through=-lc -dynamic-linker /lib/ld-musl-x86_64.so.1 -nostdlib -static -static -pie --no-dynamic-linker /usr/lib/x86_64-linux-musl/rcrt1.o /usr/lib/x86_64-linux-musl/crti.o /usr/lib/gcc/x86_64-linux-gnu/14/crtbeginS.o -L/usr/lib/x86_64-linux-musl -L /usr/lib/gcc/x86_64-linux-gnu/14/. -z relro -z now --as-needed -z text /tmp/ccailL0x.o --start-group /usr/lib/gcc/x86_64-linux-gnu/14/libgcc.a /usr/lib/gcc/x86_64-linux-gnu/14/libgcc_eh.a -lc --end-group /usr/lib/gcc/x86_64-linux-gnu/14/crtendS.o /usr/lib/x86_64-linux-musl/crtn.o
+|  /usr/libexec/gcc/x86_64-linux-gnu/14/collect2 -plugin /usr/libexec/gcc/x86_64-linux-gnu/14/liblto_plugin.so -plugin-opt=/usr/libexec/gcc/x86_64-linux-gnu/14/lto-wrapper -plugin-opt=-fresolution=/tmp/cc6Lmqi1.res -plugin-opt=-pass-through=/usr/lib/gcc/x86_64-linux-gnu/14/libgcc.a -plugin-opt=-pass-through=/usr/lib/gcc/x86_64-linux-gnu/14/libgcc_eh.a -plugin-opt=-pass-through=-lc -dynamic-linker /lib/ld-musl-x86_64.so.1 -nostdlib -static -static -pie --no-dynamic-linker /usr/lib/x86_64-linux-musl/rcrt1.o /usr/lib/x86_64-linux-musl/crti.o /usr/lib/gcc/x86_64-linux-gnu/14/crtbeginS.o -L/usr/lib/x86_64-linux-musl -L /usr/lib/gcc/x86_64-linux-gnu/14/. -z relro -z now --as-needed -z text /tmp/cckRXRGb.o --start-group /usr/lib/gcc/x86_64-linux-gnu/14/libgcc.a /usr/lib/gcc/x86_64-linux-gnu/14/libgcc_eh.a -lc --end-group /usr/lib/gcc/x86_64-linux-gnu/14/crtendS.o /usr/lib/x86_64-linux-musl/crtn.o
 | COLLECT_GCC_OPTIONS='-Os' '-g' '-Werror=implicit-function-declaration' '-ffile-prefix-map=/build/reproducible-path/mksh-59c=.' '-fstack-clash-protection' '-Wformat=1' '-Werror=format-security' '-fcf-protection=full' '-Wall' '-Wextra' '-fPIE' '-I' '.' '-I' '../..' '-Wdate-time' '-D' '_FORTIFY_SOURCE=2' '-D' 'MKSH_EARLY_LOCALE_TRACKING' '-D' 'KSH_VERSIONNAME_VENDOR_EXT=" +Debian"' '-D' 'MKSH_BUILDMEAT' '-D' 'MKSH_BINSHPOSIX' '-D' 'MKSH_BINSHREDUCED' '-D' 'MKSH_SMALL' '-D' 'MKSH_SMALL_BUT_FAST' '-D' 'MKSH_BUILDSH=1' '-D' '_GNU_SOURCE' '-D' 'SETUID_CAN_FAIL_WITH_EAGAIN=1' '-static' '-static-pie' '-v' '-specs=/usr/lib/x86_64-linux-musl/musl-gcc.specs' '-mtune=generic' '-march=x86-64' '-dumpdir' 'a.'
 $ eval echo "\`$CC $CFLAGS $Cg $CPPFLAGS $LDFLAGS $NOWARN $LIBS -dumpmachine\`" \
 		 "gcc\`$CC $CFLAGS $Cg $CPPFLAGS $LDFLAGS $NOWARN $LIBS -dumpversion\`"
@@ -1553,7 +1589,7 @@
 ==> if the compiler works... yes
 ... if the compiler does not fail correctly
 $ musl-gcc -Os -g -Werror=implicit-function-declaration -ffile-prefix-map=/build/reproducible-path/mksh-59c=. -fstack-clash-protection -Wformat -Werror=format-security -fcf-protection -Wall -Wextra -fPIE  -I. -I'../..' -Wdate-time -D_FORTIFY_SOURCE=2 -DMKSH_EARLY_LOCALE_TRACKING -DKSH_VERSIONNAME_VENDOR_EXT=\"\ +Debian\" -DMKSH_BUILDMEAT -DMKSH_BINSHPOSIX -DMKSH_BINSHREDUCED -DMKSH_SMALL -DMKSH_SMALL_BUT_FAST -DMKSH_BUILDSH=1 -D_GNU_SOURCE -DSETUID_CAN_FAIL_WITH_EAGAIN=1 -Wl,-z,relro -Wl,-z,now -Wl,--as-needed -static -static-pie -Wl,-z,text  conftest.c  || for _f in ${tcfn}*; do case $_f in lksh.1|mksh.1|mksh.faq|mksh.ico) ;; *) rm -f "$_f" ;; esac; done
-] /usr/bin/ld: /tmp/ccNrzMET.o: in function `main':
+] /usr/bin/ld: /tmp/cc3J2n9V.o: in function `main':
 ] ./builddir/static-musl/./builddir/static-musl/conftest.c:15:(.text.startup+0xf): undefined reference to `thiswillneverbedefinedIhope'
 ] collect2: error: ld returned 1 exit status
 ==> if the compiler does not fail correctly... no
@@ -1615,26 +1651,26 @@
 ==> if invoking as sh should be handled specially... yes
 ... if mksh will be built without job control
 $ musl-gcc -Os -g -Werror=implicit-function-declaration -ffile-prefix-map=/build/reproducible-path/mksh-59c=. -fstack-clash-protection -Wformat -Werror=format-security -fcf-protection -Wall -Wextra -fPIE -fno-lto -Wno-deprecated-declarations -fno-asynchronous-unwind-tables -fno-strict-aliasing -fstack-protector-strong -malign-data=abi -fwrapv  -I. -I'../..' -Wdate-time -D_FORTIFY_SOURCE=2 -DMKSH_EARLY_LOCALE_TRACKING -DKSH_VERSIONNAME_VENDOR_EXT=\"\ +Debian\" -DMKSH_BUILDMEAT -DMKSH_BINSHPOSIX -DMKSH_BINSHREDUCED -DMKSH_SMALL -DMKSH_SMALL_BUT_FAST -DMKSH_BUILDSH=1 -D_GNU_SOURCE -DSETUID_CAN_FAIL_WITH_EAGAIN=1 -DHAVE_STRING_POOLING=2 -DHAVE_ATTRIBUTE_BOUNDED=0 -DHAVE_ATTRIBUTE_FORMAT=1 -DHAVE_ATTRIBUTE_NORETURN=1 -DHAVE_ATTRIBUTE_UNUSED=1 -DHAVE_ATTRIBUTE_USED=1 -Wl,-z,relro -Wl,-z,now -Wl,--as-needed -static -static-pie -Wl,-z,text -fno-lto -Wno-error conftest.c  || for _f in ${tcfn}*; do case $_f in lksh.1|mksh.1|mksh.faq|mksh.ico) ;; *) rm -f "$_f" ;; esac; done
-] /usr/bin/ld: /tmp/ccfGQOz3.o: in function `main':
+] /usr/bin/ld: /tmp/ccmVzJxj.o: in function `main':
 ] ./builddir/static-musl/./builddir/static-musl/conftest.c:15:(.text.startup+0xf): undefined reference to `thiswillneverbedefinedIhope'
 ] collect2: error: ld returned 1 exit status
 ==> if mksh will be built without job control... no
 ... if mksh will be built without job signals
 $ musl-gcc -Os -g -Werror=implicit-function-declaration -ffile-prefix-map=/build/reproducible-path/mksh-59c=. -fstack-clash-protection -Wformat -Werror=format-security -fcf-protection -Wall -Wextra -fPIE -fno-lto -Wno-deprecated-declarations -fno-asynchronous-unwind-tables -fno-strict-aliasing -fstack-protector-strong -malign-data=abi -fwrapv  -I. -I'../..' -Wdate-time -D_FORTIFY_SOURCE=2 -DMKSH_EARLY_LOCALE_TRACKING -DKSH_VERSIONNAME_VENDOR_EXT=\"\ +Debian\" -DMKSH_BUILDMEAT -DMKSH_BINSHPOSIX -DMKSH_BINSHREDUCED -DMKSH_SMALL -DMKSH_SMALL_BUT_FAST -DMKSH_BUILDSH=1 -D_GNU_SOURCE -DSETUID_CAN_FAIL_WITH_EAGAIN=1 -DHAVE_STRING_POOLING=2 -DHAVE_ATTRIBUTE_BOUNDED=0 -DHAVE_ATTRIBUTE_FORMAT=1 -DHAVE_ATTRIBUTE_NORETURN=1 -DHAVE_ATTRIBUTE_UNUSED=1 -DHAVE_ATTRIBUTE_USED=1 -Wl,-z,relro -Wl,-z,now -Wl,--as-needed -static -static-pie -Wl,-z,text -fno-lto -Wno-error conftest.c  || for _f in ${tcfn}*; do case $_f in lksh.1|mksh.1|mksh.faq|mksh.ico) ;; *) rm -f "$_f" ;; esac; done
-] /usr/bin/ld: /tmp/ccolQefS.o: in function `main':
+] /usr/bin/ld: /tmp/ccAc45QT.o: in function `main':
 ] ./builddir/static-musl/./builddir/static-musl/conftest.c:15:(.text.startup+0xf): undefined reference to `thiswillneverbedefinedIhope'
 ] collect2: error: ld returned 1 exit status
 ==> if mksh will be built without job signals... no
 ... if the default UTF-8 mode is specified
 $ musl-gcc -Os -g -Werror=implicit-function-declaration -ffile-prefix-map=/build/reproducible-path/mksh-59c=. -fstack-clash-protection -Wformat -Werror=format-security -fcf-protection -Wall -Wextra -fPIE -fno-lto -Wno-deprecated-declarations -fno-asynchronous-unwind-tables -fno-strict-aliasing -fstack-protector-strong -malign-data=abi -fwrapv  -I. -I'../..' -Wdate-time -D_FORTIFY_SOURCE=2 -DMKSH_EARLY_LOCALE_TRACKING -DKSH_VERSIONNAME_VENDOR_EXT=\"\ +Debian\" -DMKSH_BUILDMEAT -DMKSH_BINSHPOSIX -DMKSH_BINSHREDUCED -DMKSH_SMALL -DMKSH_SMALL_BUT_FAST -DMKSH_BUILDSH=1 -D_GNU_SOURCE -DSETUID_CAN_FAIL_WITH_EAGAIN=1 -DHAVE_STRING_POOLING=2 -DHAVE_ATTRIBUTE_BOUNDED=0 -DHAVE_ATTRIBUTE_FORMAT=1 -DHAVE_ATTRIBUTE_NORETURN=1 -DHAVE_ATTRIBUTE_UNUSED=1 -DHAVE_ATTRIBUTE_USED=1 -Wl,-z,relro -Wl,-z,now -Wl,--as-needed -static -static-pie -Wl,-z,text -fno-lto -Wno-error conftest.c  || for _f in ${tcfn}*; do case $_f in lksh.1|mksh.1|mksh.faq|mksh.ico) ;; *) rm -f "$_f" ;; esac; done
-] /usr/bin/ld: /tmp/ccoYGlMG.o: in function `main':
+] /usr/bin/ld: /tmp/cc7Cr4hk.o: in function `main':
 ] ./builddir/static-musl/./builddir/static-musl/conftest.c:15:(.text.startup+0xf): undefined reference to `thiswillneverbedefinedIhope'
 ] collect2: error: ld returned 1 exit status
 ==> if the default UTF-8 mode is specified... no
 ==> if the default UTF-8 mode is disabled... no (implied)
 ... if the MidnightBSD 0.1 ash compatibility mode is requested
 $ musl-gcc -Os -g -Werror=implicit-function-declaration -ffile-prefix-map=/build/reproducible-path/mksh-59c=. -fstack-clash-protection -Wformat -Werror=format-security -fcf-protection -Wall -Wextra -fPIE -fno-lto -Wno-deprecated-declarations -fno-asynchronous-unwind-tables -fno-strict-aliasing -fstack-protector-strong -malign-data=abi -fwrapv  -I. -I'../..' -Wdate-time -D_FORTIFY_SOURCE=2 -DMKSH_EARLY_LOCALE_TRACKING -DKSH_VERSIONNAME_VENDOR_EXT=\"\ +Debian\" -DMKSH_BUILDMEAT -DMKSH_BINSHPOSIX -DMKSH_BINSHREDUCED -DMKSH_SMALL -DMKSH_SMALL_BUT_FAST -DMKSH_BUILDSH=1 -D_GNU_SOURCE -DSETUID_CAN_FAIL_WITH_EAGAIN=1 -DHAVE_STRING_POOLING=2 -DHAVE_ATTRIBUTE_BOUNDED=0 -DHAVE_ATTRIBUTE_FORMAT=1 -DHAVE_ATTRIBUTE_NORETURN=1 -DHAVE_ATTRIBUTE_UNUSED=1 -DHAVE_ATTRIBUTE_USED=1 -Wl,-z,relro -Wl,-z,now -Wl,--as-needed -static -static-pie -Wl,-z,text -fno-lto -Wno-error conftest.c  || for _f in ${tcfn}*; do case $_f in lksh.1|mksh.1|mksh.faq|mksh.ico) ;; *) rm -f "$_f" ;; esac; done
-] /usr/bin/ld: /tmp/cc8ojOuP.o: in function `main':
+] /usr/bin/ld: /tmp/ccOCvlND.o: in function `main':
 ] ./builddir/static-musl/./builddir/static-musl/conftest.c:15:(.text.startup+0xf): undefined reference to `thiswillneverbedefinedIhope'
 ] collect2: error: ld returned 1 exit status
 ==> if the MidnightBSD 0.1 ash compatibility mode is requested... no
@@ -1792,14 +1828,14 @@
 ==> if the final link command may succeed... yes
 ... GNU strerrordesc_np()
 $ musl-gcc -Os -g -Werror=implicit-function-declaration -ffile-prefix-map=/build/reproducible-path/mksh-59c=. -fstack-clash-protection -Wformat -Werror=format-security -fcf-protection -Wall -Wextra -fPIE -fno-lto -Wno-deprecated-declarations -fno-asynchronous-unwind-tables -fno-strict-aliasing -fstack-protector-strong -malign-data=abi -fwrapv  -I. -I'../..' -Wdate-time -D_FORTIFY_SOURCE=2 -DMKSH_EARLY_LOCALE_TRACKING -DKSH_VERSIONNAME_VENDOR_EXT=\"\ +Debian\" -DMKSH_BUILDMEAT -DMKSH_BINSHPOSIX -DMKSH_BINSHREDUCED -DMKSH_SMALL -DMKSH_SMALL_BUT_FAST -DMKSH_BUILDSH=1 -D_GNU_SOURCE -DSETUID_CAN_FAIL_WITH_EAGAIN=1 -DHAVE_STRING_POOLING=2 -DHAVE_ATTRIBUTE_BOUNDED=0 -DHAVE_ATTRIBUTE_FORMAT=1 -DHAVE_ATTRIBUTE_NORETURN=1 -DHAVE_ATTRIBUTE_UNUSED=1 -DHAVE_ATTRIBUTE_USED=1 -DHAVE_SYS_TIME_H=1 -DHAVE_TIME_H=1 -DHAVE_BOTH_TIME_H=1 -DHAVE_SYS_SELECT_H=1 -DHAVE_SELECT_TIME_H=1 -DHAVE_SYS_BSDTYPES_H=0 -DHAVE_SYS_FILE_H=1 -DHAVE_SYS_MKDEV_H=0 -DHAVE_SYS_MMAN_H=1 -DHAVE_SYS_PARAM_H=1 -DHAVE_SYS_PTEM_H=0 -DHAVE_SYS_RESOURCE_H=1 -DHAVE_SYS_SYSMACROS_H=1 -DHAVE_BSTRING_H=0 -DHAVE_GRP_H=1 -DHAVE_IO_H=0 -DHAVE_LIBGEN_H=1 -DHAVE_LIBUTIL_H=0 -DHAVE_PATHS_H=1 -DHAVE_STDINT_H=1 -DHAVE_STRINGS_H=1 -DHAVE_TERMIOS_H=1 -DHAVE_ULIMIT_H=1 -DHAVE_CAN_INTTYPES=1 -DHAVE_SIG_T=1 -Wl,-z,relro -Wl,-z,now -Wl,--as-needed -static -static-pie -Wl,-z,text -fno-lto -Wno-error conftest.c  || for _f in ${tcfn}*; do case $_f in lksh.1|mksh.1|mksh.faq|mksh.ico) ;; *) rm -f "$_f" ;; esac; done
-] /usr/bin/ld: /tmp/ccwf1120.o: in function `main':
+] /usr/bin/ld: /tmp/cc3RSMcV.o: in function `main':
 ] ./builddir/static-musl/./builddir/static-musl/conftest.c:9:(.text.startup+0x10): undefined reference to `strerrordesc_np'
 ] collect2: error: ld returned 1 exit status
 ==> GNU strerrordesc_np()... no
 ... the sys_errlist[] array and sys_nerr
 $ musl-gcc -Os -g -Werror=implicit-function-declaration -ffile-prefix-map=/build/reproducible-path/mksh-59c=. -fstack-clash-protection -Wformat -Werror=format-security -fcf-protection -Wall -Wextra -fPIE -fno-lto -Wno-deprecated-declarations -fno-asynchronous-unwind-tables -fno-strict-aliasing -fstack-protector-strong -malign-data=abi -fwrapv  -I. -I'../..' -Wdate-time -D_FORTIFY_SOURCE=2 -DMKSH_EARLY_LOCALE_TRACKING -DKSH_VERSIONNAME_VENDOR_EXT=\"\ +Debian\" -DMKSH_BUILDMEAT -DMKSH_BINSHPOSIX -DMKSH_BINSHREDUCED -DMKSH_SMALL -DMKSH_SMALL_BUT_FAST -DMKSH_BUILDSH=1 -D_GNU_SOURCE -DSETUID_CAN_FAIL_WITH_EAGAIN=1 -DHAVE_STRING_POOLING=2 -DHAVE_ATTRIBUTE_BOUNDED=0 -DHAVE_ATTRIBUTE_FORMAT=1 -DHAVE_ATTRIBUTE_NORETURN=1 -DHAVE_ATTRIBUTE_UNUSED=1 -DHAVE_ATTRIBUTE_USED=1 -DHAVE_SYS_TIME_H=1 -DHAVE_TIME_H=1 -DHAVE_BOTH_TIME_H=1 -DHAVE_SYS_SELECT_H=1 -DHAVE_SELECT_TIME_H=1 -DHAVE_SYS_BSDTYPES_H=0 -DHAVE_SYS_FILE_H=1 -DHAVE_SYS_MKDEV_H=0 -DHAVE_SYS_MMAN_H=1 -DHAVE_SYS_PARAM_H=1 -DHAVE_SYS_PTEM_H=0 -DHAVE_SYS_RESOURCE_H=1 -DHAVE_SYS_SYSMACROS_H=1 -DHAVE_BSTRING_H=0 -DHAVE_GRP_H=1 -DHAVE_IO_H=0 -DHAVE_LIBGEN_H=1 -DHAVE_LIBUTIL_H=0 -DHAVE_PATHS_H=1 -DHAVE_STDINT_H=1 -DHAVE_STRINGS_H=1 -DHAVE_TERMIOS_H=1 -DHAVE_ULIMIT_H=1 -DHAVE_CAN_INTTYPES=1 -DHAVE_SIG_T=1 -DHAVE_STRERRORDESC_NP=0 -Wl,-z,relro -Wl,-z,now -Wl,--as-needed -static -static-pie -Wl,-z,text -fno-lto -Wno-error conftest.c  || for _f in ${tcfn}*; do case $_f in lksh.1|mksh.1|mksh.faq|mksh.ico) ;; *) rm -f "$_f" ;; esac; done
-] /usr/bin/ld: /tmp/cciXnNHn.o: warning: relocation against `sys_nerr' in read-only section `.text.startup'
-] /usr/bin/ld: /tmp/cciXnNHn.o: in function `main':
+] /usr/bin/ld: /tmp/ccYdnJOu.o: warning: relocation against `sys_nerr' in read-only section `.text.startup'
+] /usr/bin/ld: /tmp/ccYdnJOu.o: in function `main':
 ] ./builddir/static-musl/./builddir/static-musl/conftest.c:11:(.text.startup+0x6): undefined reference to `sys_nerr'
 ] /usr/bin/ld: ./builddir/static-musl/./builddir/static-musl/conftest.c:11:(.text.startup+0xd): undefined reference to `sys_errlist'
 ] /usr/bin/ld: read-only segment has dynamic relocations
@@ -1807,8 +1843,8 @@
 ==> the sys_errlist[] array and sys_nerr... no
 ... the _sys_errlist[] array and _sys_nerr
 $ musl-gcc -Os -g -Werror=implicit-function-declaration -ffile-prefix-map=/build/reproducible-path/mksh-59c=. -fstack-clash-protection -Wformat -Werror=format-security -fcf-protection -Wall -Wextra -fPIE -fno-lto -Wno-deprecated-declarations -fno-asynchronous-unwind-tables -fno-strict-aliasing -fstack-protector-strong -malign-data=abi -fwrapv  -I. -I'../..' -Wdate-time -D_FORTIFY_SOURCE=2 -DMKSH_EARLY_LOCALE_TRACKING -DKSH_VERSIONNAME_VENDOR_EXT=\"\ +Debian\" -DMKSH_BUILDMEAT -DMKSH_BINSHPOSIX -DMKSH_BINSHREDUCED -DMKSH_SMALL -DMKSH_SMALL_BUT_FAST -DMKSH_BUILDSH=1 -D_GNU_SOURCE -DSETUID_CAN_FAIL_WITH_EAGAIN=1 -DHAVE_STRING_POOLING=2 -DHAVE_ATTRIBUTE_BOUNDED=0 -DHAVE_ATTRIBUTE_FORMAT=1 -DHAVE_ATTRIBUTE_NORETURN=1 -DHAVE_ATTRIBUTE_UNUSED=1 -DHAVE_ATTRIBUTE_USED=1 -DHAVE_SYS_TIME_H=1 -DHAVE_TIME_H=1 -DHAVE_BOTH_TIME_H=1 -DHAVE_SYS_SELECT_H=1 -DHAVE_SELECT_TIME_H=1 -DHAVE_SYS_BSDTYPES_H=0 -DHAVE_SYS_FILE_H=1 -DHAVE_SYS_MKDEV_H=0 -DHAVE_SYS_MMAN_H=1 -DHAVE_SYS_PARAM_H=1 -DHAVE_SYS_PTEM_H=0 -DHAVE_SYS_RESOURCE_H=1 -DHAVE_SYS_SYSMACROS_H=1 -DHAVE_BSTRING_H=0 -DHAVE_GRP_H=1 -DHAVE_IO_H=0 -DHAVE_LIBGEN_H=1 -DHAVE_LIBUTIL_H=0 -DHAVE_PATHS_H=1 -DHAVE_STDINT_H=1 -DHAVE_STRINGS_H=1 -DHAVE_TERMIOS_H=1 -DHAVE_ULIMIT_H=1 -DHAVE_CAN_INTTYPES=1 -DHAVE_SIG_T=1 -DHAVE_STRERRORDESC_NP=0 -Wl,-z,relro -Wl,-z,now -Wl,--as-needed -static -static-pie -Wl,-z,text -fno-lto -Wno-error conftest.c  || for _f in ${tcfn}*; do case $_f in lksh.1|mksh.1|mksh.faq|mksh.ico) ;; *) rm -f "$_f" ;; esac; done
-] /usr/bin/ld: /tmp/ccYVrGR0.o: warning: relocation against `_sys_nerr' in read-only section `.text.startup'
-] /usr/bin/ld: /tmp/ccYVrGR0.o: in function `main':
+] /usr/bin/ld: /tmp/ccJASgZE.o: warning: relocation against `_sys_nerr' in read-only section `.text.startup'
+] /usr/bin/ld: /tmp/ccJASgZE.o: in function `main':
 ] ./builddir/static-musl/./builddir/static-musl/conftest.c:11:(.text.startup+0x6): undefined reference to `_sys_nerr'
 ] /usr/bin/ld: ./builddir/static-musl/./builddir/static-musl/conftest.c:11:(.text.startup+0xd): undefined reference to `_sys_errlist'
 ] /usr/bin/ld: read-only segment has dynamic relocations
@@ -1816,44 +1852,44 @@
 ==> the _sys_errlist[] array and _sys_nerr... no
 ... GNU sigabbrev_np()
 $ musl-gcc -Os -g -Werror=implicit-function-declaration -ffile-prefix-map=/build/reproducible-path/mksh-59c=. -fstack-clash-protection -Wformat -Werror=format-security -fcf-protection -Wall -Wextra -fPIE -fno-lto -Wno-deprecated-declarations -fno-asynchronous-unwind-tables -fno-strict-aliasing -fstack-protector-strong -malign-data=abi -fwrapv  -I. -I'../..' -Wdate-time -D_FORTIFY_SOURCE=2 -DMKSH_EARLY_LOCALE_TRACKING -DKSH_VERSIONNAME_VENDOR_EXT=\"\ +Debian\" -DMKSH_BUILDMEAT -DMKSH_BINSHPOSIX -DMKSH_BINSHREDUCED -DMKSH_SMALL -DMKSH_SMALL_BUT_FAST -DMKSH_BUILDSH=1 -D_GNU_SOURCE -DSETUID_CAN_FAIL_WITH_EAGAIN=1 -DHAVE_STRING_POOLING=2 -DHAVE_ATTRIBUTE_BOUNDED=0 -DHAVE_ATTRIBUTE_FORMAT=1 -DHAVE_ATTRIBUTE_NORETURN=1 -DHAVE_ATTRIBUTE_UNUSED=1 -DHAVE_ATTRIBUTE_USED=1 -DHAVE_SYS_TIME_H=1 -DHAVE_TIME_H=1 -DHAVE_BOTH_TIME_H=1 -DHAVE_SYS_SELECT_H=1 -DHAVE_SELECT_TIME_H=1 -DHAVE_SYS_BSDTYPES_H=0 -DHAVE_SYS_FILE_H=1 -DHAVE_SYS_MKDEV_H=0 -DHAVE_SYS_MMAN_H=1 -DHAVE_SYS_PARAM_H=1 -DHAVE_SYS_PTEM_H=0 -DHAVE_SYS_RESOURCE_H=1 -DHAVE_SYS_SYSMACROS_H=1 -DHAVE_BSTRING_H=0 -DHAVE_GRP_H=1 -DHAVE_IO_H=0 -DHAVE_LIBGEN_H=1 -DHAVE_LIBUTIL_H=0 -DHAVE_PATHS_H=1 -DHAVE_STDINT_H=1 -DHAVE_STRINGS_H=1 -DHAVE_TERMIOS_H=1 -DHAVE_ULIMIT_H=1 -DHAVE_CAN_INTTYPES=1 -DHAVE_SIG_T=1 -DHAVE_STRERRORDESC_NP=0 -DHAVE_SYS_ERRLIST=0 -Wl,-z,relro -Wl,-z,now -Wl,--as-needed -static -static-pie -Wl,-z,text -fno-lto -Wno-error conftest.c  || for _f in ${tcfn}*; do case $_f in lksh.1|mksh.1|mksh.faq|mksh.ico) ;; *) rm -f "$_f" ;; esac; done
-] /usr/bin/ld: /tmp/ccmx7QPI.o: in function `main':
+] /usr/bin/ld: /tmp/cch7DjTt.o: in function `main':
 ] ./builddir/static-musl/./builddir/static-musl/conftest.c:9:(.text.startup+0x10): undefined reference to `sigabbrev_np'
 ] collect2: error: ld returned 1 exit status
 ==> GNU sigabbrev_np()... no
 ... the sys_signame[] array
 $ musl-gcc -Os -g -Werror=implicit-function-declaration -ffile-prefix-map=/build/reproducible-path/mksh-59c=. -fstack-clash-protection -Wformat -Werror=format-security -fcf-protection -Wall -Wextra -fPIE -fno-lto -Wno-deprecated-declarations -fno-asynchronous-unwind-tables -fno-strict-aliasing -fstack-protector-strong -malign-data=abi -fwrapv  -I. -I'../..' -Wdate-time -D_FORTIFY_SOURCE=2 -DMKSH_EARLY_LOCALE_TRACKING -DKSH_VERSIONNAME_VENDOR_EXT=\"\ +Debian\" -DMKSH_BUILDMEAT -DMKSH_BINSHPOSIX -DMKSH_BINSHREDUCED -DMKSH_SMALL -DMKSH_SMALL_BUT_FAST -DMKSH_BUILDSH=1 -D_GNU_SOURCE -DSETUID_CAN_FAIL_WITH_EAGAIN=1 -DHAVE_STRING_POOLING=2 -DHAVE_ATTRIBUTE_BOUNDED=0 -DHAVE_ATTRIBUTE_FORMAT=1 -DHAVE_ATTRIBUTE_NORETURN=1 -DHAVE_ATTRIBUTE_UNUSED=1 -DHAVE_ATTRIBUTE_USED=1 -DHAVE_SYS_TIME_H=1 -DHAVE_TIME_H=1 -DHAVE_BOTH_TIME_H=1 -DHAVE_SYS_SELECT_H=1 -DHAVE_SELECT_TIME_H=1 -DHAVE_SYS_BSDTYPES_H=0 -DHAVE_SYS_FILE_H=1 -DHAVE_SYS_MKDEV_H=0 -DHAVE_SYS_MMAN_H=1 -DHAVE_SYS_PARAM_H=1 -DHAVE_SYS_PTEM_H=0 -DHAVE_SYS_RESOURCE_H=1 -DHAVE_SYS_SYSMACROS_H=1 -DHAVE_BSTRING_H=0 -DHAVE_GRP_H=1 -DHAVE_IO_H=0 -DHAVE_LIBGEN_H=1 -DHAVE_LIBUTIL_H=0 -DHAVE_PATHS_H=1 -DHAVE_STDINT_H=1 -DHAVE_STRINGS_H=1 -DHAVE_TERMIOS_H=1 -DHAVE_ULIMIT_H=1 -DHAVE_CAN_INTTYPES=1 -DHAVE_SIG_T=1 -DHAVE_STRERRORDESC_NP=0 -DHAVE_SYS_ERRLIST=0 -DHAVE_SIGABBREV_NP=0 -Wl,-z,relro -Wl,-z,now -Wl,--as-needed -static -static-pie -Wl,-z,text -fno-lto -Wno-error conftest.c  || for _f in ${tcfn}*; do case $_f in lksh.1|mksh.1|mksh.faq|mksh.ico) ;; *) rm -f "$_f" ;; esac; done
-] /usr/bin/ld: /tmp/ccB4bnTg.o: warning: relocation against `sys_signame' in read-only section `.text.startup'
-] /usr/bin/ld: /tmp/ccB4bnTg.o: in function `main':
+] /usr/bin/ld: /tmp/ccvCfPEj.o: warning: relocation against `sys_signame' in read-only section `.text.startup'
+] /usr/bin/ld: /tmp/ccvCfPEj.o: in function `main':
 ] ./builddir/static-musl/./builddir/static-musl/conftest.c:10:(.text.startup+0x8): undefined reference to `sys_signame'
 ] /usr/bin/ld: read-only segment has dynamic relocations
 ] collect2: error: ld returned 1 exit status
 ==> the sys_signame[] array... no
 ... the _sys_signame[] array
 $ musl-gcc -Os -g -Werror=implicit-function-declaration -ffile-prefix-map=/build/reproducible-path/mksh-59c=. -fstack-clash-protection -Wformat -Werror=format-security -fcf-protection -Wall -Wextra -fPIE -fno-lto -Wno-deprecated-declarations -fno-asynchronous-unwind-tables -fno-strict-aliasing -fstack-protector-strong -malign-data=abi -fwrapv  -I. -I'../..' -Wdate-time -D_FORTIFY_SOURCE=2 -DMKSH_EARLY_LOCALE_TRACKING -DKSH_VERSIONNAME_VENDOR_EXT=\"\ +Debian\" -DMKSH_BUILDMEAT -DMKSH_BINSHPOSIX -DMKSH_BINSHREDUCED -DMKSH_SMALL -DMKSH_SMALL_BUT_FAST -DMKSH_BUILDSH=1 -D_GNU_SOURCE -DSETUID_CAN_FAIL_WITH_EAGAIN=1 -DHAVE_STRING_POOLING=2 -DHAVE_ATTRIBUTE_BOUNDED=0 -DHAVE_ATTRIBUTE_FORMAT=1 -DHAVE_ATTRIBUTE_NORETURN=1 -DHAVE_ATTRIBUTE_UNUSED=1 -DHAVE_ATTRIBUTE_USED=1 -DHAVE_SYS_TIME_H=1 -DHAVE_TIME_H=1 -DHAVE_BOTH_TIME_H=1 -DHAVE_SYS_SELECT_H=1 -DHAVE_SELECT_TIME_H=1 -DHAVE_SYS_BSDTYPES_H=0 -DHAVE_SYS_FILE_H=1 -DHAVE_SYS_MKDEV_H=0 -DHAVE_SYS_MMAN_H=1 -DHAVE_SYS_PARAM_H=1 -DHAVE_SYS_PTEM_H=0 -DHAVE_SYS_RESOURCE_H=1 -DHAVE_SYS_SYSMACROS_H=1 -DHAVE_BSTRING_H=0 -DHAVE_GRP_H=1 -DHAVE_IO_H=0 -DHAVE_LIBGEN_H=1 -DHAVE_LIBUTIL_H=0 -DHAVE_PATHS_H=1 -DHAVE_STDINT_H=1 -DHAVE_STRINGS_H=1 -DHAVE_TERMIOS_H=1 -DHAVE_ULIMIT_H=1 -DHAVE_CAN_INTTYPES=1 -DHAVE_SIG_T=1 -DHAVE_STRERRORDESC_NP=0 -DHAVE_SYS_ERRLIST=0 -DHAVE_SIGABBREV_NP=0 -Wl,-z,relro -Wl,-z,now -Wl,--as-needed -static -static-pie -Wl,-z,text -fno-lto -Wno-error conftest.c  || for _f in ${tcfn}*; do case $_f in lksh.1|mksh.1|mksh.faq|mksh.ico) ;; *) rm -f "$_f" ;; esac; done
-] /usr/bin/ld: /tmp/ccbepShN.o: warning: relocation against `_sys_signame' in read-only section `.text.startup'
-] /usr/bin/ld: /tmp/ccbepShN.o: in function `main':
+] /usr/bin/ld: /tmp/ccYjFX7k.o: warning: relocation against `_sys_signame' in read-only section `.text.startup'
+] /usr/bin/ld: /tmp/ccYjFX7k.o: in function `main':
 ] ./builddir/static-musl/./builddir/static-musl/conftest.c:10:(.text.startup+0x8): undefined reference to `_sys_signame'
 ] /usr/bin/ld: read-only segment has dynamic relocations
 ] collect2: error: ld returned 1 exit status
 ==> the _sys_signame[] array... no
 ... GNU sigdescr_np()
 $ musl-gcc -Os -g -Werror=implicit-function-declaration -ffile-prefix-map=/build/reproducible-path/mksh-59c=. -fstack-clash-protection -Wformat -Werror=format-security -fcf-protection -Wall -Wextra -fPIE -fno-lto -Wno-deprecated-declarations -fno-asynchronous-unwind-tables -fno-strict-aliasing -fstack-protector-strong -malign-data=abi -fwrapv  -I. -I'../..' -Wdate-time -D_FORTIFY_SOURCE=2 -DMKSH_EARLY_LOCALE_TRACKING -DKSH_VERSIONNAME_VENDOR_EXT=\"\ +Debian\" -DMKSH_BUILDMEAT -DMKSH_BINSHPOSIX -DMKSH_BINSHREDUCED -DMKSH_SMALL -DMKSH_SMALL_BUT_FAST -DMKSH_BUILDSH=1 -D_GNU_SOURCE -DSETUID_CAN_FAIL_WITH_EAGAIN=1 -DHAVE_STRING_POOLING=2 -DHAVE_ATTRIBUTE_BOUNDED=0 -DHAVE_ATTRIBUTE_FORMAT=1 -DHAVE_ATTRIBUTE_NORETURN=1 -DHAVE_ATTRIBUTE_UNUSED=1 -DHAVE_ATTRIBUTE_USED=1 -DHAVE_SYS_TIME_H=1 -DHAVE_TIME_H=1 -DHAVE_BOTH_TIME_H=1 -DHAVE_SYS_SELECT_H=1 -DHAVE_SELECT_TIME_H=1 -DHAVE_SYS_BSDTYPES_H=0 -DHAVE_SYS_FILE_H=1 -DHAVE_SYS_MKDEV_H=0 -DHAVE_SYS_MMAN_H=1 -DHAVE_SYS_PARAM_H=1 -DHAVE_SYS_PTEM_H=0 -DHAVE_SYS_RESOURCE_H=1 -DHAVE_SYS_SYSMACROS_H=1 -DHAVE_BSTRING_H=0 -DHAVE_GRP_H=1 -DHAVE_IO_H=0 -DHAVE_LIBGEN_H=1 -DHAVE_LIBUTIL_H=0 -DHAVE_PATHS_H=1 -DHAVE_STDINT_H=1 -DHAVE_STRINGS_H=1 -DHAVE_TERMIOS_H=1 -DHAVE_ULIMIT_H=1 -DHAVE_CAN_INTTYPES=1 -DHAVE_SIG_T=1 -DHAVE_STRERRORDESC_NP=0 -DHAVE_SYS_ERRLIST=0 -DHAVE_SIGABBREV_NP=0 -DHAVE_SYS_SIGNAME=0 -Wl,-z,relro -Wl,-z,now -Wl,--as-needed -static -static-pie -Wl,-z,text -fno-lto -Wno-error conftest.c  || for _f in ${tcfn}*; do case $_f in lksh.1|mksh.1|mksh.faq|mksh.ico) ;; *) rm -f "$_f" ;; esac; done
-] /usr/bin/ld: /tmp/ccC6zd5D.o: in function `main':
+] /usr/bin/ld: /tmp/ccxie2rY.o: in function `main':
 ] ./builddir/static-musl/./builddir/static-musl/conftest.c:9:(.text.startup+0x10): undefined reference to `sigdescr_np'
 ] collect2: error: ld returned 1 exit status
 ==> GNU sigdescr_np()... no
 ... the sys_siglist[] array
 $ musl-gcc -Os -g -Werror=implicit-function-declaration -ffile-prefix-map=/build/reproducible-path/mksh-59c=. -fstack-clash-protection -Wformat -Werror=format-security -fcf-protection -Wall -Wextra -fPIE -fno-lto -Wno-deprecated-declarations -fno-asynchronous-unwind-tables -fno-strict-aliasing -fstack-protector-strong -malign-data=abi -fwrapv  -I. -I'../..' -Wdate-time -D_FORTIFY_SOURCE=2 -DMKSH_EARLY_LOCALE_TRACKING -DKSH_VERSIONNAME_VENDOR_EXT=\"\ +Debian\" -DMKSH_BUILDMEAT -DMKSH_BINSHPOSIX -DMKSH_BINSHREDUCED -DMKSH_SMALL -DMKSH_SMALL_BUT_FAST -DMKSH_BUILDSH=1 -D_GNU_SOURCE -DSETUID_CAN_FAIL_WITH_EAGAIN=1 -DHAVE_STRING_POOLING=2 -DHAVE_ATTRIBUTE_BOUNDED=0 -DHAVE_ATTRIBUTE_FORMAT=1 -DHAVE_ATTRIBUTE_NORETURN=1 -DHAVE_ATTRIBUTE_UNUSED=1 -DHAVE_ATTRIBUTE_USED=1 -DHAVE_SYS_TIME_H=1 -DHAVE_TIME_H=1 -DHAVE_BOTH_TIME_H=1 -DHAVE_SYS_SELECT_H=1 -DHAVE_SELECT_TIME_H=1 -DHAVE_SYS_BSDTYPES_H=0 -DHAVE_SYS_FILE_H=1 -DHAVE_SYS_MKDEV_H=0 -DHAVE_SYS_MMAN_H=1 -DHAVE_SYS_PARAM_H=1 -DHAVE_SYS_PTEM_H=0 -DHAVE_SYS_RESOURCE_H=1 -DHAVE_SYS_SYSMACROS_H=1 -DHAVE_BSTRING_H=0 -DHAVE_GRP_H=1 -DHAVE_IO_H=0 -DHAVE_LIBGEN_H=1 -DHAVE_LIBUTIL_H=0 -DHAVE_PATHS_H=1 -DHAVE_STDINT_H=1 -DHAVE_STRINGS_H=1 -DHAVE_TERMIOS_H=1 -DHAVE_ULIMIT_H=1 -DHAVE_CAN_INTTYPES=1 -DHAVE_SIG_T=1 -DHAVE_STRERRORDESC_NP=0 -DHAVE_SYS_ERRLIST=0 -DHAVE_SIGABBREV_NP=0 -DHAVE_SYS_SIGNAME=0 -DHAVE_SIGDESCR_NP=0 -Wl,-z,relro -Wl,-z,now -Wl,--as-needed -static -static-pie -Wl,-z,text -fno-lto -Wno-error conftest.c  || for _f in ${tcfn}*; do case $_f in lksh.1|mksh.1|mksh.faq|mksh.ico) ;; *) rm -f "$_f" ;; esac; done
-] /usr/bin/ld: /tmp/ccavxGZ8.o: warning: relocation against `sys_siglist' in read-only section `.text.startup'
-] /usr/bin/ld: /tmp/ccavxGZ8.o: in function `main':
+] /usr/bin/ld: /tmp/cc8id5BW.o: warning: relocation against `sys_siglist' in read-only section `.text.startup'
+] /usr/bin/ld: /tmp/cc8id5BW.o: in function `main':
 ] ./builddir/static-musl/./builddir/static-musl/conftest.c:10:(.text.startup+0x8): undefined reference to `sys_siglist'
 ] /usr/bin/ld: read-only segment has dynamic relocations
 ] collect2: error: ld returned 1 exit status
 ==> the sys_siglist[] array... no
 ... the _sys_siglist[] array
 $ musl-gcc -Os -g -Werror=implicit-function-declaration -ffile-prefix-map=/build/reproducible-path/mksh-59c=. -fstack-clash-protection -Wformat -Werror=format-security -fcf-protection -Wall -Wextra -fPIE -fno-lto -Wno-deprecated-declarations -fno-asynchronous-unwind-tables -fno-strict-aliasing -fstack-protector-strong -malign-data=abi -fwrapv  -I. -I'../..' -Wdate-time -D_FORTIFY_SOURCE=2 -DMKSH_EARLY_LOCALE_TRACKING -DKSH_VERSIONNAME_VENDOR_EXT=\"\ +Debian\" -DMKSH_BUILDMEAT -DMKSH_BINSHPOSIX -DMKSH_BINSHREDUCED -DMKSH_SMALL -DMKSH_SMALL_BUT_FAST -DMKSH_BUILDSH=1 -D_GNU_SOURCE -DSETUID_CAN_FAIL_WITH_EAGAIN=1 -DHAVE_STRING_POOLING=2 -DHAVE_ATTRIBUTE_BOUNDED=0 -DHAVE_ATTRIBUTE_FORMAT=1 -DHAVE_ATTRIBUTE_NORETURN=1 -DHAVE_ATTRIBUTE_UNUSED=1 -DHAVE_ATTRIBUTE_USED=1 -DHAVE_SYS_TIME_H=1 -DHAVE_TIME_H=1 -DHAVE_BOTH_TIME_H=1 -DHAVE_SYS_SELECT_H=1 -DHAVE_SELECT_TIME_H=1 -DHAVE_SYS_BSDTYPES_H=0 -DHAVE_SYS_FILE_H=1 -DHAVE_SYS_MKDEV_H=0 -DHAVE_SYS_MMAN_H=1 -DHAVE_SYS_PARAM_H=1 -DHAVE_SYS_PTEM_H=0 -DHAVE_SYS_RESOURCE_H=1 -DHAVE_SYS_SYSMACROS_H=1 -DHAVE_BSTRING_H=0 -DHAVE_GRP_H=1 -DHAVE_IO_H=0 -DHAVE_LIBGEN_H=1 -DHAVE_LIBUTIL_H=0 -DHAVE_PATHS_H=1 -DHAVE_STDINT_H=1 -DHAVE_STRINGS_H=1 -DHAVE_TERMIOS_H=1 -DHAVE_ULIMIT_H=1 -DHAVE_CAN_INTTYPES=1 -DHAVE_SIG_T=1 -DHAVE_STRERRORDESC_NP=0 -DHAVE_SYS_ERRLIST=0 -DHAVE_SIGABBREV_NP=0 -DHAVE_SYS_SIGNAME=0 -DHAVE_SIGDESCR_NP=0 -Wl,-z,relro -Wl,-z,now -Wl,--as-needed -static -static-pie -Wl,-z,text -fno-lto -Wno-error conftest.c  || for _f in ${tcfn}*; do case $_f in lksh.1|mksh.1|mksh.faq|mksh.ico) ;; *) rm -f "$_f" ;; esac; done
-] /usr/bin/ld: /tmp/ccKKpZ9K.o: warning: relocation against `_sys_siglist' in read-only section `.text.startup'
-] /usr/bin/ld: /tmp/ccKKpZ9K.o: in function `main':
+] /usr/bin/ld: /tmp/ccwqvmzd.o: warning: relocation against `_sys_siglist' in read-only section `.text.startup'
+] /usr/bin/ld: /tmp/ccwqvmzd.o: in function `main':
 ] ./builddir/static-musl/./builddir/static-musl/conftest.c:10:(.text.startup+0x8): undefined reference to `_sys_siglist'
 ] /usr/bin/ld: read-only segment has dynamic relocations
 ] collect2: error: ld returned 1 exit status
@@ -2908,10 +2944,10 @@
 N: CPPFLAGS='-Wdate-time -D_FORTIFY_SOURCE=2 -DMKSH_EARLY_LOCALE_TRACKING -DKSH_VERSIONNAME_VENDOR_EXT=\"\ +Debian\" -DMKSH_BUILDMEAT -DMKSH_BINSHPOSIX -DMKSH_BINSHREDUCED -DMKSH_SMALL -DMKSH_SMALL_BUT_FAST'
 N: LDFLAGS='-Wl,-z,relro -Wl,-z,now -Wl,--as-needed'
 N: LDSTATIC='-static' LIBS=''
-+ env CC=klcc CFLAGS=-Os -fomit-frame-pointer -mno-sse -falign-functions=1 -falign-jumps=1 -falign-loops=1 -fno-asynchronous-unwind-tables -g -Werror=implicit-function-declaration -ffile-prefix-map=/build/reproducible-path/mksh-59c=. -fstack-clash-protection -Wformat -Werror=format-security -fcf-protection -Wall -Wextra CPPFLAGS=-Wdate-time -D_FORTIFY_SOURCE=2 -DMKSH_EARLY_LOCALE_TRACKING -DKSH_VERSIONNAME_VENDOR_EXT=\"\ +Debian\" -DMKSH_BUILDMEAT -DMKSH_BINSHPOSIX -DMKSH_BINSHREDUCED -DMKSH_SMALL -DMKSH_SMALL_BUT_FAST LDFLAGS=-Wl,-z,relro -Wl,-z,now -Wl,--as-needed LDSTATIC=-static LIBS= sh ../../Build.sh -r -c trace
++ env CC=klcc 'CFLAGS=-Os -fomit-frame-pointer -mno-sse -falign-functions=1 -falign-jumps=1 -falign-loops=1 -fno-asynchronous-unwind-tables -g -Werror=implicit-function-declaration -ffile-prefix-map=/build/reproducible-path/mksh-59c=. -fstack-clash-protection -Wformat -Werror=format-security -fcf-protection -Wall -Wextra' 'CPPFLAGS=-Wdate-time -D_FORTIFY_SOURCE=2 -DMKSH_EARLY_LOCALE_TRACKING -DKSH_VERSIONNAME_VENDOR_EXT=\"\ +Debian\" -DMKSH_BUILDMEAT -DMKSH_BINSHPOSIX -DMKSH_BINSHREDUCED -DMKSH_SMALL -DMKSH_SMALL_BUT_FAST' 'LDFLAGS=-Wl,-z,relro -Wl,-z,now -Wl,--as-needed' LDSTATIC=-static LIBS= sh ../../Build.sh -r -c trace
 For the build logs, demonstrate that /dev/null and /dev/tty exist:
-crw-rw-rw- 1 root root 1, 3 Mar 25 11:25 /dev/null
-crw-rw-rw- 1 root root 5, 0 Mar 25 11:25 /dev/tty
+crw-rw-rw- 1 root root 1, 3 Apr 26 17:46 /dev/null
+crw-rw-rw- 1 root root 5, 0 Apr 29 09:39 /dev/tty
 Flags on entry (plus HAVE_* which are not shown here):
 - CC        <klcc>
 - CFLAGS    <-Os -fomit-frame-pointer -mno-sse -falign-functions=1 -falign-jumps=1 -falign-loops=1 -fno-asynchronous-unwind-tables -g -Werror=implicit-function-declaration -ffile-prefix-map=/build/reproducible-path/mksh-59c=. -fstack-clash-protection -Wformat -Werror=format-security -fcf-protection -Wall -Wextra>
@@ -2923,11 +2959,11 @@
 
 Hi from $MirOS: src/bin/mksh/Build.sh,v 1.858 2024/08/17 23:33:47 tg Exp $ on:
 $ uname -a >&2
-| Linux ionos11-amd64 6.1.0-32-amd64 #1 SMP PREEMPT_DYNAMIC Debian 6.1.129-1 (2025-03-06) x86_64 GNU/Linux
-Build.sh: Building The MirBSD Korn Shell (mksh) R59 2024/07/26 on Linux 6.1.0-32-amd64...
+| Linux i-capture-the-hostname 6.12.12+bpo-amd64 #1 SMP PREEMPT_DYNAMIC Debian 6.12.12-1~bpo12+1 (2025-02-23) x86_64 GNU/Linux
+Build.sh: Building The MirBSD Korn Shell (mksh) R59 2024/07/26 on Linux 6.12.12+bpo-amd64...
 Build.sh: Scanning for functions... please ignore any errors.
 ... which compiler type seems to be used
-$ klcc -E -Os -fomit-frame-pointer -mno-sse -falign-functions=1 -falign-jumps=1 -falign-loops=1 -fno-asynchronous-unwind-tables -g -Werror=implicit-function-declaration -ffile-prefix-map=/build/reproducible-path/mksh-59c=. -fstack-clash-protection -Wformat -Werror=format-security -fcf-protection -Wall -Wextra -I. -I'../..' -Wdate-time -D_FORTIFY_SOURCE=2 -DMKSH_EARLY_LOCALE_TRACKING -DKSH_VERSIONNAME_VENDOR_EXT=\"\ +Debian\" -DMKSH_BUILDMEAT -DMKSH_BINSHPOSIX -DMKSH_BINSHREDUCED -DMKSH_SMALL -DMKSH_SMALL_BUT_FAST -DMKSH_BUILDSH=1 -D_GNU_SOURCE -DSETUID_CAN_FAIL_WITH_EAGAIN=1   conftest.c |     sed -n '/^ *[ce]t *= */s/^ *\([ce]t\) *= */=/p' | tr -d \015 >x
+$ klcc -E -Os -fomit-frame-pointer -mno-sse -falign-functions=1 -falign-jumps=1 -falign-loops=1 -fno-asynchronous-unwind-tables -g -Werror=implicit-function-declaration -ffile-prefix-map=/build/reproducible-path/mksh-59c=. -fstack-clash-protection -Wformat -Werror=format-security -fcf-protection -Wall -Wextra -I. -I'../..' -Wdate-time -D_FORTIFY_SOURCE=2 -DMKSH_EARLY_LOCALE_TRACKING -DKSH_VERSIONNAME_VENDOR_EXT=\"\ +Debian\" -DMKSH_BUILDMEAT -DMKSH_BINSHPOSIX -DMKSH_BINSHREDUCED -DMKSH_SMALL -DMKSH_SMALL_BUT_FAST -DMKSH_BUILDSH=1 -D_GNU_SOURCE -DSETUID_CAN_FAIL_WITH_EAGAIN=1   conftest.c |     sed -n '/^ *[ce]t *= */s/^ *\([ce]t\) *= */\1=/p' | tr -d \\015 >x
 [ ct="gcc"
 [ et="klibc"
 $ klcc -Os -fomit-frame-pointer -mno-sse -falign-functions=1 -falign-jumps=1 -falign-loops=1 -fno-asynchronous-unwind-tables -g -Werror=implicit-function-declaration -ffile-prefix-map=/build/reproducible-path/mksh-59c=. -fstack-clash-protection -Wformat -Werror=format-security -fcf-protection -Wall -Wextra  -I. -I'../..' -Wdate-time -D_FORTIFY_SOURCE=2 -DMKSH_EARLY_LOCALE_TRACKING -DKSH_VERSIONNAME_VENDOR_EXT=\"\ +Debian\" -DMKSH_BUILDMEAT -DMKSH_BINSHPOSIX -DMKSH_BINSHREDUCED -DMKSH_SMALL -DMKSH_SMALL_BUT_FAST -DMKSH_BUILDSH=1 -D_GNU_SOURCE -DSETUID_CAN_FAIL_WITH_EAGAIN=1 -Wl,-z,relro -Wl,-z,now -Wl,--as-needed -static  -v conftest.c 
@@ -2942,7 +2978,7 @@
 | Supported LTO compression algorithms: zlib zstd
 | gcc version 14.2.0 (Debian 14.2.0-19) 
 | COLLECT_GCC_OPTIONS='-D' '__KLIBC__=2' '-D' '__KLIBC_MINOR__=0' '-D' '_BITSIZE=64' '-fno-stack-protector' '-fwrapv' '-fno-PIE' '-fno-builtin-bcmp' '-fcommon' '-ggdb' '-m64' '-nostdinc' '-iwithprefix' 'include' '-D' '__KLIBC__=2' '-D' '__KLIBC_MINOR__=0' '-D' '_BITSIZE=64' '-I' '/usr/lib/klibc/include/arch/x86_64' '-I' '/usr/lib/klibc/include/bits64' '-I' '/usr/lib/klibc/include' '-O' '-Os' '-fomit-frame-pointer' '-mno-sse' '-falign-functions=1' '-falign-jumps=1' '-falign-loops=1' '-fno-asynchronous-unwind-tables' '-g' '-Werror=implicit-function-declaration' '-ffile-prefix-map=/build/reproducible-path/mksh-59c=.' '-fstack-clash-protection' '-Wformat=1' '-Werror=format-security' '-fcf-protection=full' '-Wall' '-Wextra' '-I' '.' '-I' '../..' '-Wdate-time' '-D' '_FORTIFY_SOURCE=2' '-D' 'MKSH_EARLY_LOCALE_TRACKING' '-D' 'KSH_VERSIONNAME_VENDOR_EXT=" +Debian"' '-D' 'MKSH_BUILDMEAT' '-D' 'MKSH_BINSHPOSIX' '-D' 'MKSH_BINSHREDUCED' '-D' 'MKSH_SMALL' '-D' 'MKSH_SMALL_BUT_FAST' '-D' 'MKSH_BUILDSH=1' '-D' '_GNU_SOURCE' '-D' 'SETUID_CAN_FAIL_WITH_EAGAIN=1' '-v' '-mtune=generic' '-march=x86-64' '-dumpdir' 'a-'
-|  /usr/libexec/gcc/x86_64-linux-gnu/14/cc1 -quiet -nostdinc -v -I /usr/lib/klibc/include/arch/x86_64 -I /usr/lib/klibc/include/bits64 -I /usr/lib/klibc/include -I . -I ../.. -imultiarch x86_64-linux-gnu -D __KLIBC__=2 -D __KLIBC_MINOR__=0 -D _BITSIZE=64 -D __KLIBC__=2 -D __KLIBC_MINOR__=0 -D _BITSIZE=64 -D _FORTIFY_SOURCE=2 -D MKSH_EARLY_LOCALE_TRACKING -D KSH_VERSIONNAME_VENDOR_EXT=" +Debian" -D MKSH_BUILDMEAT -D MKSH_BINSHPOSIX -D MKSH_BINSHREDUCED -D MKSH_SMALL -D MKSH_SMALL_BUT_FAST -D MKSH_BUILDSH=1 -D _GNU_SOURCE -D SETUID_CAN_FAIL_WITH_EAGAIN=1 -iwithprefix include conftest.c -quiet -dumpdir a- -dumpbase conftest.c -dumpbase-ext .c -m64 -mno-sse -mtune=generic -march=x86-64 -ggdb -g -O -Os -Werror=implicit-function-declaration -Wformat=1 -Werror=format-security -Wall -Wextra -Wdate-time -version -fno-stack-protector -fwrapv -fno-PIE -fno-builtin-bcmp -fcommon -fomit-frame-pointer -falign-functions=1 -falign-jumps=1 -falign-loops=1 -fno-asynchronous-unwind-tables -ffile-prefix-map=/build/reproducible-path/mksh-59c=. -fstack-clash-protection -fcf-protection=full -o /tmp/cc6AFpd4.s
+|  /usr/libexec/gcc/x86_64-linux-gnu/14/cc1 -quiet -nostdinc -v -I /usr/lib/klibc/include/arch/x86_64 -I /usr/lib/klibc/include/bits64 -I /usr/lib/klibc/include -I . -I ../.. -imultiarch x86_64-linux-gnu -D __KLIBC__=2 -D __KLIBC_MINOR__=0 -D _BITSIZE=64 -D __KLIBC__=2 -D __KLIBC_MINOR__=0 -D _BITSIZE=64 -D _FORTIFY_SOURCE=2 -D MKSH_EARLY_LOCALE_TRACKING -D KSH_VERSIONNAME_VENDOR_EXT=" +Debian" -D MKSH_BUILDMEAT -D MKSH_BINSHPOSIX -D MKSH_BINSHREDUCED -D MKSH_SMALL -D MKSH_SMALL_BUT_FAST -D MKSH_BUILDSH=1 -D _GNU_SOURCE -D SETUID_CAN_FAIL_WITH_EAGAIN=1 -iwithprefix include conftest.c -quiet -dumpdir a- -dumpbase conftest.c -dumpbase-ext .c -m64 -mno-sse -mtune=generic -march=x86-64 -ggdb -g -O -Os -Werror=implicit-function-declaration -Wformat=1 -Werror=format-security -Wall -Wextra -Wdate-time -version -fno-stack-protector -fwrapv -fno-PIE -fno-builtin-bcmp -fcommon -fomit-frame-pointer -falign-functions=1 -falign-jumps=1 -falign-loops=1 -fno-asynchronous-unwind-tables -ffile-prefix-map=/build/reproducible-path/mksh-59c=. -fstack-clash-protection -fcf-protection=full -o /tmp/ccOyYvIw.s
 | GNU C17 (Debian 14.2.0-19) version 14.2.0 (x86_64-linux-gnu)
 | 	compiled by GNU C version 14.2.0, GMP version 6.3.0, MPFR version 4.2.1, MPC version 1.3.1, isl version isl-0.27-GMP
 | 
@@ -2958,12 +2994,12 @@
 | End of search list.
 | Compiler executable checksum: 0051dfc1fa4e89ba97760da93f2546f3
 | COLLECT_GCC_OPTIONS='-D' '__KLIBC__=2' '-D' '__KLIBC_MINOR__=0' '-D' '_BITSIZE=64' '-fno-stack-protector' '-fwrapv' '-fno-PIE' '-fno-builtin-bcmp' '-fcommon' '-ggdb' '-m64' '-nostdinc' '-iwithprefix' 'include' '-D' '__KLIBC__=2' '-D' '__KLIBC_MINOR__=0' '-D' '_BITSIZE=64' '-I' '/usr/lib/klibc/include/arch/x86_64' '-I' '/usr/lib/klibc/include/bits64' '-I' '/usr/lib/klibc/include' '-O' '-Os' '-fomit-frame-pointer' '-mno-sse' '-falign-functions=1' '-falign-jumps=1' '-falign-loops=1' '-fno-asynchronous-unwind-tables' '-g' '-Werror=implicit-function-declaration' '-ffile-prefix-map=/build/reproducible-path/mksh-59c=.' '-fstack-clash-protection' '-Wformat=1' '-Werror=format-security' '-fcf-protection=full' '-Wall' '-Wextra' '-I' '.' '-I' '../..' '-Wdate-time' '-D' '_FORTIFY_SOURCE=2' '-D' 'MKSH_EARLY_LOCALE_TRACKING' '-D' 'KSH_VERSIONNAME_VENDOR_EXT=" +Debian"' '-D' 'MKSH_BUILDMEAT' '-D' 'MKSH_BINSHPOSIX' '-D' 'MKSH_BINSHREDUCED' '-D' 'MKSH_SMALL' '-D' 'MKSH_SMALL_BUT_FAST' '-D' 'MKSH_BUILDSH=1' '-D' '_GNU_SOURCE' '-D' 'SETUID_CAN_FAIL_WITH_EAGAIN=1' '-v' '-mtune=generic' '-march=x86-64' '-dumpdir' 'a-'
-|  as -v -I /usr/lib/klibc/include/arch/x86_64 -I /usr/lib/klibc/include/bits64 -I /usr/lib/klibc/include -I . -I ../.. --gdwarf-5 --64 -o /tmp/ccRovoHV.o /tmp/cc6AFpd4.s
+|  as -v -I /usr/lib/klibc/include/arch/x86_64 -I /usr/lib/klibc/include/bits64 -I /usr/lib/klibc/include -I . -I ../.. --gdwarf-5 --64 -o /tmp/cc3WcaPT.o /tmp/ccOyYvIw.s
 | GNU assembler version 2.44 (x86_64-linux-gnu) using BFD version (GNU Binutils for Debian) 2.44
 | COMPILER_PATH=/usr/libexec/gcc/x86_64-linux-gnu/14/:/usr/libexec/gcc/x86_64-linux-gnu/14/:/usr/libexec/gcc/x86_64-linux-gnu/:/usr/lib/gcc/x86_64-linux-gnu/14/:/usr/lib/gcc/x86_64-linux-gnu/
 | LIBRARY_PATH=/usr/lib/gcc/x86_64-linux-gnu/14/:/usr/lib/gcc/x86_64-linux-gnu/14/../../../x86_64-linux-gnu/:/usr/lib/gcc/x86_64-linux-gnu/14/../../../../lib/:/lib/x86_64-linux-gnu/:/lib/../lib/:/usr/lib/x86_64-linux-gnu/:/usr/lib/../lib/:/usr/lib/gcc/x86_64-linux-gnu/14/../../../:/lib/:/usr/lib/
 | COLLECT_GCC_OPTIONS='-D' '__KLIBC__=2' '-D' '__KLIBC_MINOR__=0' '-D' '_BITSIZE=64' '-fno-stack-protector' '-fwrapv' '-fno-PIE' '-fno-builtin-bcmp' '-fcommon' '-ggdb' '-m64' '-nostdinc' '-iwithprefix' 'include' '-D' '__KLIBC__=2' '-D' '__KLIBC_MINOR__=0' '-D' '_BITSIZE=64' '-I' '/usr/lib/klibc/include/arch/x86_64' '-I' '/usr/lib/klibc/include/bits64' '-I' '/usr/lib/klibc/include' '-O' '-Os' '-fomit-frame-pointer' '-mno-sse' '-falign-functions=1' '-falign-jumps=1' '-falign-loops=1' '-fno-asynchronous-unwind-tables' '-g' '-Werror=implicit-function-declaration' '-ffile-prefix-map=/build/reproducible-path/mksh-59c=.' '-fstack-clash-protection' '-Wformat=1' '-Werror=format-security' '-fcf-protection=full' '-Wall' '-Wextra' '-I' '.' '-I' '../..' '-Wdate-time' '-D' '_FORTIFY_SOURCE=2' '-D' 'MKSH_EARLY_LOCALE_TRACKING' '-D' 'KSH_VERSIONNAME_VENDOR_EXT=" +Debian"' '-D' 'MKSH_BUILDMEAT' '-D' 'MKSH_BINSHPOSIX' '-D' 'MKSH_BINSHREDUCED' '-D' 'MKSH_SMALL' '-D' 'MKSH_SMALL_BUT_FAST' '-D' 'MKSH_BUILDSH=1' '-D' '_GNU_SOURCE' '-D' 'SETUID_CAN_FAIL_WITH_EAGAIN=1' '-v' '-mtune=generic' '-march=x86-64' '-dumpdir' 'a.'
-|  /usr/libexec/gcc/x86_64-linux-gnu/14/collect2 -plugin /usr/libexec/gcc/x86_64-linux-gnu/14/liblto_plugin.so -plugin-opt=/usr/libexec/gcc/x86_64-linux-gnu/14/lto-wrapper -plugin-opt=-fresolution=/tmp/ccdBGsBQ.res -plugin-opt=-pass-through=-lgcc -plugin-opt=-pass-through=-lgcc_s -plugin-opt=-pass-through=-lc -plugin-opt=-pass-through=-lgcc -plugin-opt=-pass-through=-lgcc_s --build-id --eh-frame-hdr -m elf_x86_64 --hash-style=gnu --as-needed -dynamic-linker /lib64/ld-linux-x86-64.so.2 -pie /usr/lib/gcc/x86_64-linux-gnu/14/../../../x86_64-linux-gnu/Scrt1.o /usr/lib/gcc/x86_64-linux-gnu/14/../../../x86_64-linux-gnu/crti.o /usr/lib/gcc/x86_64-linux-gnu/14/crtbeginS.o -L/usr/lib/gcc/x86_64-linux-gnu/14 -L/usr/lib/gcc/x86_64-linux-gnu/14/../../../x86_64-linux-gnu -L/usr/lib/gcc/x86_64-linux-gnu/14/../../../../lib -L/lib/x86_64-linux-gnu -L/lib/../lib -L/usr/lib/x86_64-linux-gnu -L/usr/lib/../lib -L/usr/lib/gcc/x86_64-linux-gnu/14/../../.. /tmp/ccRovoHV.o -lgcc --push-state --as-needed -lgcc_s --pop-state -lc -lgcc --push-state --as-needed -lgcc_s --pop-state /usr/lib/gcc/x86_64-linux-gnu/14/crtendS.o /usr/lib/gcc/x86_64-linux-gnu/14/../../../x86_64-linux-gnu/crtn.o
+|  /usr/libexec/gcc/x86_64-linux-gnu/14/collect2 -plugin /usr/libexec/gcc/x86_64-linux-gnu/14/liblto_plugin.so -plugin-opt=/usr/libexec/gcc/x86_64-linux-gnu/14/lto-wrapper -plugin-opt=-fresolution=/tmp/cc9c8E9k.res -plugin-opt=-pass-through=-lgcc -plugin-opt=-pass-through=-lgcc_s -plugin-opt=-pass-through=-lc -plugin-opt=-pass-through=-lgcc -plugin-opt=-pass-through=-lgcc_s --build-id --eh-frame-hdr -m elf_x86_64 --hash-style=gnu --as-needed -dynamic-linker /lib64/ld-linux-x86-64.so.2 -pie /usr/lib/gcc/x86_64-linux-gnu/14/../../../x86_64-linux-gnu/Scrt1.o /usr/lib/gcc/x86_64-linux-gnu/14/../../../x86_64-linux-gnu/crti.o /usr/lib/gcc/x86_64-linux-gnu/14/crtbeginS.o -L/usr/lib/gcc/x86_64-linux-gnu/14 -L/usr/lib/gcc/x86_64-linux-gnu/14/../../../x86_64-linux-gnu -L/usr/lib/gcc/x86_64-linux-gnu/14/../../../../lib -L/lib/x86_64-linux-gnu -L/lib/../lib -L/usr/lib/x86_64-linux-gnu -L/usr/lib/../lib -L/usr/lib/gcc/x86_64-linux-gnu/14/../../.. /tmp/cc3WcaPT.o -lgcc --push-state --as-needed -lgcc_s --pop-state -lc -lgcc --push-state --as-needed -lgcc_s --pop-state /usr/lib/gcc/x86_64-linux-gnu/14/crtendS.o /usr/lib/gcc/x86_64-linux-gnu/14/../../../x86_64-linux-gnu/crtn.o
 | COLLECT_GCC_OPTIONS='-D' '__KLIBC__=2' '-D' '__KLIBC_MINOR__=0' '-D' '_BITSIZE=64' '-fno-stack-protector' '-fwrapv' '-fno-PIE' '-fno-builtin-bcmp' '-fcommon' '-ggdb' '-m64' '-nostdinc' '-iwithprefix' 'include' '-D' '__KLIBC__=2' '-D' '__KLIBC_MINOR__=0' '-D' '_BITSIZE=64' '-I' '/usr/lib/klibc/include/arch/x86_64' '-I' '/usr/lib/klibc/include/bits64' '-I' '/usr/lib/klibc/include' '-O' '-Os' '-fomit-frame-pointer' '-mno-sse' '-falign-functions=1' '-falign-jumps=1' '-falign-loops=1' '-fno-asynchronous-unwind-tables' '-g' '-Werror=implicit-function-declaration' '-ffile-prefix-map=/build/reproducible-path/mksh-59c=.' '-fstack-clash-protection' '-Wformat=1' '-Werror=format-security' '-fcf-protection=full' '-Wall' '-Wextra' '-I' '.' '-I' '../..' '-Wdate-time' '-D' '_FORTIFY_SOURCE=2' '-D' 'MKSH_EARLY_LOCALE_TRACKING' '-D' 'KSH_VERSIONNAME_VENDOR_EXT=" +Debian"' '-D' 'MKSH_BUILDMEAT' '-D' 'MKSH_BINSHPOSIX' '-D' 'MKSH_BINSHREDUCED' '-D' 'MKSH_SMALL' '-D' 'MKSH_SMALL_BUT_FAST' '-D' 'MKSH_BUILDSH=1' '-D' '_GNU_SOURCE' '-D' 'SETUID_CAN_FAIL_WITH_EAGAIN=1' '-v' '-mtune=generic' '-march=x86-64' '-dumpdir' 'a.'
 $ eval echo "\`$CC $CFLAGS $Cg $CPPFLAGS $LDFLAGS $NOWARN $LIBS -dumpmachine\`" \
 		 "gcc\`$CC $CFLAGS $Cg $CPPFLAGS $LDFLAGS $NOWARN $LIBS -dumpversion\`"
@@ -4354,10 +4390,10 @@
 N: CPPFLAGS='-Wdate-time -D_FORTIFY_SOURCE=2 -DMKSH_EARLY_LOCALE_TRACKING -DKSH_VERSIONNAME_VENDOR_EXT=\"\ +Debian\" -DMKSH_BUILDMEAT -DMKSH_BINSHPOSIX -DMKSH_BINSHREDUCED -DMKSH_SMALL -DMKSH_SMALL_BUT_FAST'
 N: LDFLAGS='-Wl,-z,relro -Wl,-z,now -Wl,--as-needed'
 N: LDSTATIC=' ' LIBS=''
-+ env CC=diet -v -Os gcc CFLAGS=-g -Werror=implicit-function-declaration -ffile-prefix-map=/build/reproducible-path/mksh-59c=. -fstack-clash-protection -Wformat -Werror=format-security -fcf-protection -Wall -Wextra CPPFLAGS=-Wdate-time -D_FORTIFY_SOURCE=2 -DMKSH_EARLY_LOCALE_TRACKING -DKSH_VERSIONNAME_VENDOR_EXT=\"\ +Debian\" -DMKSH_BUILDMEAT -DMKSH_BINSHPOSIX -DMKSH_BINSHREDUCED -DMKSH_SMALL -DMKSH_SMALL_BUT_FAST LDFLAGS=-Wl,-z,relro -Wl,-z,now -Wl,--as-needed LDSTATIC=  LIBS= sh ../../Build.sh -r -c trace
++ env 'CC=diet -v -Os gcc' 'CFLAGS=-g -Werror=implicit-function-declaration -ffile-prefix-map=/build/reproducible-path/mksh-59c=. -fstack-clash-protection -Wformat -Werror=format-security -fcf-protection -Wall -Wextra' 'CPPFLAGS=-Wdate-time -D_FORTIFY_SOURCE=2 -DMKSH_EARLY_LOCALE_TRACKING -DKSH_VERSIONNAME_VENDOR_EXT=\"\ +Debian\" -DMKSH_BUILDMEAT -DMKSH_BINSHPOSIX -DMKSH_BINSHREDUCED -DMKSH_SMALL -DMKSH_SMALL_BUT_FAST' 'LDFLAGS=-Wl,-z,relro -Wl,-z,now -Wl,--as-needed' 'LDSTATIC= ' LIBS= sh ../../Build.sh -r -c trace
 For the build logs, demonstrate that /dev/null and /dev/tty exist:
-crw-rw-rw- 1 root root 1, 3 Mar 25 11:25 /dev/null
-crw-rw-rw- 1 root root 5, 0 Mar 25 11:25 /dev/tty
+crw-rw-rw- 1 root root 1, 3 Apr 26 17:46 /dev/null
+crw-rw-rw- 1 root root 5, 0 Apr 29 09:40 /dev/tty
 Flags on entry (plus HAVE_* which are not shown here):
 - CC        <diet -v -Os gcc>
 - CFLAGS    <-g -Werror=implicit-function-declaration -ffile-prefix-map=/build/reproducible-path/mksh-59c=. -fstack-clash-protection -Wformat -Werror=format-security -fcf-protection -Wall -Wextra>
@@ -4369,11 +4405,11 @@
 
 Hi from $MirOS: src/bin/mksh/Build.sh,v 1.858 2024/08/17 23:33:47 tg Exp $ on:
 $ uname -a >&2
-| Linux ionos11-amd64 6.1.0-32-amd64 #1 SMP PREEMPT_DYNAMIC Debian 6.1.129-1 (2025-03-06) x86_64 GNU/Linux
-Build.sh: Building The MirBSD Korn Shell (mksh) R59 2024/07/26 on Linux 6.1.0-32-amd64...
+| Linux i-capture-the-hostname 6.12.12+bpo-amd64 #1 SMP PREEMPT_DYNAMIC Debian 6.12.12-1~bpo12+1 (2025-02-23) x86_64 GNU/Linux
+Build.sh: Building The MirBSD Korn Shell (mksh) R59 2024/07/26 on Linux 6.12.12+bpo-amd64...
 Build.sh: Scanning for functions... please ignore any errors.
 ... which compiler type seems to be used
-$ diet -v -Os gcc -E -g -Werror=implicit-function-declaration -ffile-prefix-map=/build/reproducible-path/mksh-59c=. -fstack-clash-protection -Wformat -Werror=format-security -fcf-protection -Wall -Wextra -I. -I'../..' -Wdate-time -D_FORTIFY_SOURCE=2 -DMKSH_EARLY_LOCALE_TRACKING -DKSH_VERSIONNAME_VENDOR_EXT=\"\ +Debian\" -DMKSH_BUILDMEAT -DMKSH_BINSHPOSIX -DMKSH_BINSHREDUCED -DMKSH_SMALL -DMKSH_SMALL_BUT_FAST -DMKSH_BUILDSH=1 -D_GNU_SOURCE -DSETUID_CAN_FAIL_WITH_EAGAIN=1   conftest.c |     sed -n '/^ *[ce]t *= */s/^ *\([ce]t\) *= */=/p' | tr -d \015 >x
+$ diet -v -Os gcc -E -g -Werror=implicit-function-declaration -ffile-prefix-map=/build/reproducible-path/mksh-59c=. -fstack-clash-protection -Wformat -Werror=format-security -fcf-protection -Wall -Wextra -I. -I'../..' -Wdate-time -D_FORTIFY_SOURCE=2 -DMKSH_EARLY_LOCALE_TRACKING -DKSH_VERSIONNAME_VENDOR_EXT=\"\ +Debian\" -DMKSH_BUILDMEAT -DMKSH_BINSHPOSIX -DMKSH_BINSHREDUCED -DMKSH_SMALL -DMKSH_SMALL_BUT_FAST -DMKSH_BUILDSH=1 -D_GNU_SOURCE -DSETUID_CAN_FAIL_WITH_EAGAIN=1   conftest.c |     sed -n '/^ *[ce]t *= */s/^ *\([ce]t\) *= */\1=/p' | tr -d \\015 >x
 ] gcc -E -g -Werror=implicit-function-declaration -ffile-prefix-map=/build/reproducible-path/mksh-59c=. -fstack-clash-protection -Wformat -Werror=format-security -fcf-protection -Wall -Wextra -I. -I../.. -Wdate-time -D_FORTIFY_SOURCE=2 -DMKSH_EARLY_LOCALE_TRACKING -DKSH_VERSIONNAME_VENDOR_EXT=" +Debian" -DMKSH_BUILDMEAT -DMKSH_BINSHPOSIX -DMKSH_BINSHREDUCED -DMKSH_SMALL -DMKSH_SMALL_BUT_FAST -DMKSH_BUILDSH=1 -D_GNU_SOURCE -DSETUID_CAN_FAIL_WITH_EAGAIN=1 conftest.c -isystem /usr/lib/x86_64-linux-gnu/diet/include -D__dietlibc__ -D_DISTRO_EVADE_TIME_BITS -Os 
 [ ct="gcc"
 [ et="dietlibc"
@@ -4390,7 +4426,7 @@
 | Supported LTO compression algorithms: zlib zstd
 | gcc version 14.2.0 (Debian 14.2.0-19) 
 | COLLECT_GCC_OPTIONS='-nostdlib' '-static' '-L/usr/lib/x86_64-linux-gnu/diet/lib-x86_64' '-L/usr/lib/diet/lib' '-g' '-Werror=implicit-function-declaration' '-ffile-prefix-map=/build/reproducible-path/mksh-59c=.' '-fstack-clash-protection' '-Wformat=1' '-Werror=format-security' '-fcf-protection=full' '-Wall' '-Wextra' '-I' '.' '-I' '../..' '-Wdate-time' '-D' '_FORTIFY_SOURCE=2' '-D' 'MKSH_EARLY_LOCALE_TRACKING' '-D' 'KSH_VERSIONNAME_VENDOR_EXT=" +Debian"' '-D' 'MKSH_BUILDMEAT' '-D' 'MKSH_BINSHPOSIX' '-D' 'MKSH_BINSHREDUCED' '-D' 'MKSH_SMALL' '-D' 'MKSH_SMALL_BUT_FAST' '-D' 'MKSH_BUILDSH=1' '-D' '_GNU_SOURCE' '-D' 'SETUID_CAN_FAIL_WITH_EAGAIN=1' '-v' '-isystem' '/usr/lib/x86_64-linux-gnu/diet/include' '-D' '__dietlibc__' '-D' '_DISTRO_EVADE_TIME_BITS' '-Os' '-mtune=generic' '-march=x86-64' '-dumpdir' 'a-'
-|  /usr/libexec/gcc/x86_64-linux-gnu/14/cc1 -quiet -v -I . -I ../.. -imultiarch x86_64-linux-gnu -D _FORTIFY_SOURCE=2 -D MKSH_EARLY_LOCALE_TRACKING -D KSH_VERSIONNAME_VENDOR_EXT=" +Debian" -D MKSH_BUILDMEAT -D MKSH_BINSHPOSIX -D MKSH_BINSHREDUCED -D MKSH_SMALL -D MKSH_SMALL_BUT_FAST -D MKSH_BUILDSH=1 -D _GNU_SOURCE -D SETUID_CAN_FAIL_WITH_EAGAIN=1 -D __dietlibc__ -D _DISTRO_EVADE_TIME_BITS -isystem /usr/lib/x86_64-linux-gnu/diet/include conftest.c -quiet -dumpdir a- -dumpbase conftest.c -dumpbase-ext .c -mtune=generic -march=x86-64 -g -Os -Werror=implicit-function-declaration -Wformat=1 -Werror=format-security -Wall -Wextra -Wdate-time -version -ffile-prefix-map=/build/reproducible-path/mksh-59c=. -fstack-clash-protection -fcf-protection=full -fasynchronous-unwind-tables -o /tmp/ccNtEUpd.s
+|  /usr/libexec/gcc/x86_64-linux-gnu/14/cc1 -quiet -v -I . -I ../.. -imultiarch x86_64-linux-gnu -D _FORTIFY_SOURCE=2 -D MKSH_EARLY_LOCALE_TRACKING -D KSH_VERSIONNAME_VENDOR_EXT=" +Debian" -D MKSH_BUILDMEAT -D MKSH_BINSHPOSIX -D MKSH_BINSHREDUCED -D MKSH_SMALL -D MKSH_SMALL_BUT_FAST -D MKSH_BUILDSH=1 -D _GNU_SOURCE -D SETUID_CAN_FAIL_WITH_EAGAIN=1 -D __dietlibc__ -D _DISTRO_EVADE_TIME_BITS -isystem /usr/lib/x86_64-linux-gnu/diet/include conftest.c -quiet -dumpdir a- -dumpbase conftest.c -dumpbase-ext .c -mtune=generic -march=x86-64 -g -Os -Werror=implicit-function-declaration -Wformat=1 -Werror=format-security -Wall -Wextra -Wdate-time -version -ffile-prefix-map=/build/reproducible-path/mksh-59c=. -fstack-clash-protection -fcf-protection=full -fasynchronous-unwind-tables -o /tmp/ccvlfWJJ.s
 | GNU C17 (Debian 14.2.0-19) version 14.2.0 (x86_64-linux-gnu)
 | 	compiled by GNU C version 14.2.0, GMP version 6.3.0, MPFR version 4.2.1, MPC version 1.3.1, isl version isl-0.27-GMP
 | 
@@ -4411,12 +4447,12 @@
 | End of search list.
 | Compiler executable checksum: 0051dfc1fa4e89ba97760da93f2546f3
 | COLLECT_GCC_OPTIONS='-nostdlib' '-static' '-L/usr/lib/x86_64-linux-gnu/diet/lib-x86_64' '-L/usr/lib/diet/lib' '-g' '-Werror=implicit-function-declaration' '-ffile-prefix-map=/build/reproducible-path/mksh-59c=.' '-fstack-clash-protection' '-Wformat=1' '-Werror=format-security' '-fcf-protection=full' '-Wall' '-Wextra' '-I' '.' '-I' '../..' '-Wdate-time' '-D' '_FORTIFY_SOURCE=2' '-D' 'MKSH_EARLY_LOCALE_TRACKING' '-D' 'KSH_VERSIONNAME_VENDOR_EXT=" +Debian"' '-D' 'MKSH_BUILDMEAT' '-D' 'MKSH_BINSHPOSIX' '-D' 'MKSH_BINSHREDUCED' '-D' 'MKSH_SMALL' '-D' 'MKSH_SMALL_BUT_FAST' '-D' 'MKSH_BUILDSH=1' '-D' '_GNU_SOURCE' '-D' 'SETUID_CAN_FAIL_WITH_EAGAIN=1' '-v' '-isystem' '/usr/lib/x86_64-linux-gnu/diet/include' '-D' '__dietlibc__' '-D' '_DISTRO_EVADE_TIME_BITS' '-Os' '-mtune=generic' '-march=x86-64' '-dumpdir' 'a-'
-|  as -v -I . -I ../.. --gdwarf-5 --64 -o /tmp/cc6bd3it.o /tmp/ccNtEUpd.s
+|  as -v -I . -I ../.. --gdwarf-5 --64 -o /tmp/cc4tzlZJ.o /tmp/ccvlfWJJ.s
 | GNU assembler version 2.44 (x86_64-linux-gnu) using BFD version (GNU Binutils for Debian) 2.44
 | COMPILER_PATH=/usr/libexec/gcc/x86_64-linux-gnu/14/:/usr/libexec/gcc/x86_64-linux-gnu/14/:/usr/libexec/gcc/x86_64-linux-gnu/:/usr/lib/gcc/x86_64-linux-gnu/14/:/usr/lib/gcc/x86_64-linux-gnu/
 | LIBRARY_PATH=/usr/lib/gcc/x86_64-linux-gnu/14/:/usr/lib/gcc/x86_64-linux-gnu/14/../../../x86_64-linux-gnu/:/usr/lib/gcc/x86_64-linux-gnu/14/../../../../lib/:/lib/x86_64-linux-gnu/:/lib/../lib/:/usr/lib/x86_64-linux-gnu/:/usr/lib/../lib/:/usr/lib/gcc/x86_64-linux-gnu/14/../../../:/lib/:/usr/lib/
 | COLLECT_GCC_OPTIONS='-nostdlib' '-static' '-L/usr/lib/x86_64-linux-gnu/diet/lib-x86_64' '-L/usr/lib/diet/lib' '-g' '-Werror=implicit-function-declaration' '-ffile-prefix-map=/build/reproducible-path/mksh-59c=.' '-fstack-clash-protection' '-Wformat=1' '-Werror=format-security' '-fcf-protection=full' '-Wall' '-Wextra' '-I' '.' '-I' '../..' '-Wdate-time' '-D' '_FORTIFY_SOURCE=2' '-D' 'MKSH_EARLY_LOCALE_TRACKING' '-D' 'KSH_VERSIONNAME_VENDOR_EXT=" +Debian"' '-D' 'MKSH_BUILDMEAT' '-D' 'MKSH_BINSHPOSIX' '-D' 'MKSH_BINSHREDUCED' '-D' 'MKSH_SMALL' '-D' 'MKSH_SMALL_BUT_FAST' '-D' 'MKSH_BUILDSH=1' '-D' '_GNU_SOURCE' '-D' 'SETUID_CAN_FAIL_WITH_EAGAIN=1' '-v' '-isystem' '/usr/lib/x86_64-linux-gnu/diet/include' '-D' '__dietlibc__' '-D' '_DISTRO_EVADE_TIME_BITS' '-Os' '-mtune=generic' '-march=x86-64' '-dumpdir' 'a.'
-|  /usr/libexec/gcc/x86_64-linux-gnu/14/collect2 -plugin /usr/libexec/gcc/x86_64-linux-gnu/14/liblto_plugin.so -plugin-opt=/usr/libexec/gcc/x86_64-linux-gnu/14/lto-wrapper -plugin-opt=-fresolution=/tmp/cclvkxKq.res --build-id -m elf_x86_64 --hash-style=gnu --as-needed -static -L/usr/lib/x86_64-linux-gnu/diet/lib-x86_64 -L/usr/lib/diet/lib -L/usr/lib/gcc/x86_64-linux-gnu/14 -L/usr/lib/gcc/x86_64-linux-gnu/14/../../../x86_64-linux-gnu -L/usr/lib/gcc/x86_64-linux-gnu/14/../../../../lib -L/lib/x86_64-linux-gnu -L/lib/../lib -L/usr/lib/x86_64-linux-gnu -L/usr/lib/../lib -L/usr/lib/gcc/x86_64-linux-gnu/14/../../.. /usr/lib/x86_64-linux-gnu/diet/lib-x86_64/start.o -z relro -z now --as-needed /tmp/cc6bd3it.o /usr/lib/x86_64-linux-gnu/diet/lib-x86_64/libc.a -lgcc
+|  /usr/libexec/gcc/x86_64-linux-gnu/14/collect2 -plugin /usr/libexec/gcc/x86_64-linux-gnu/14/liblto_plugin.so -plugin-opt=/usr/libexec/gcc/x86_64-linux-gnu/14/lto-wrapper -plugin-opt=-fresolution=/tmp/ccOWdavB.res --build-id -m elf_x86_64 --hash-style=gnu --as-needed -static -L/usr/lib/x86_64-linux-gnu/diet/lib-x86_64 -L/usr/lib/diet/lib -L/usr/lib/gcc/x86_64-linux-gnu/14 -L/usr/lib/gcc/x86_64-linux-gnu/14/../../../x86_64-linux-gnu -L/usr/lib/gcc/x86_64-linux-gnu/14/../../../../lib -L/lib/x86_64-linux-gnu -L/lib/../lib -L/usr/lib/x86_64-linux-gnu -L/usr/lib/../lib -L/usr/lib/gcc/x86_64-linux-gnu/14/../../.. /usr/lib/x86_64-linux-gnu/diet/lib-x86_64/start.o -z relro -z now --as-needed /tmp/cc4tzlZJ.o /usr/lib/x86_64-linux-gnu/diet/lib-x86_64/libc.a -lgcc
 | COLLECT_GCC_OPTIONS='-nostdlib' '-static' '-L/usr/lib/x86_64-linux-gnu/diet/lib-x86_64' '-L/usr/lib/diet/lib' '-g' '-Werror=implicit-function-declaration' '-ffile-prefix-map=/build/reproducible-path/mksh-59c=.' '-fstack-clash-protection' '-Wformat=1' '-Werror=format-security' '-fcf-protection=full' '-Wall' '-Wextra' '-I' '.' '-I' '../..' '-Wdate-time' '-D' '_FORTIFY_SOURCE=2' '-D' 'MKSH_EARLY_LOCALE_TRACKING' '-D' 'KSH_VERSIONNAME_VENDOR_EXT=" +Debian"' '-D' 'MKSH_BUILDMEAT' '-D' 'MKSH_BINSHPOSIX' '-D' 'MKSH_BINSHREDUCED' '-D' 'MKSH_SMALL' '-D' 'MKSH_SMALL_BUT_FAST' '-D' 'MKSH_BUILDSH=1' '-D' '_GNU_SOURCE' '-D' 'SETUID_CAN_FAIL_WITH_EAGAIN=1' '-v' '-isystem' '/usr/lib/x86_64-linux-gnu/diet/include' '-D' '__dietlibc__' '-D' '_DISTRO_EVADE_TIME_BITS' '-Os' '-mtune=generic' '-march=x86-64' '-dumpdir' 'a.'
 $ eval echo "\`$CC $CFLAGS $Cg $CPPFLAGS $LDFLAGS $NOWARN $LIBS -dumpmachine\`" \
 		 "gcc\`$CC $CFLAGS $Cg $CPPFLAGS $LDFLAGS $NOWARN $LIBS -dumpversion\`"
@@ -4431,7 +4467,7 @@
 ... if the compiler does not fail correctly
 $ diet -v -Os gcc -g -Werror=implicit-function-declaration -ffile-prefix-map=/build/reproducible-path/mksh-59c=. -fstack-clash-protection -Wformat -Werror=format-security -fcf-protection -Wall -Wextra  -I. -I'../..' -Wdate-time -D_FORTIFY_SOURCE=2 -DMKSH_EARLY_LOCALE_TRACKING -DKSH_VERSIONNAME_VENDOR_EXT=\"\ +Debian\" -DMKSH_BUILDMEAT -DMKSH_BINSHPOSIX -DMKSH_BINSHREDUCED -DMKSH_SMALL -DMKSH_SMALL_BUT_FAST -DMKSH_BUILDSH=1 -D_GNU_SOURCE -DSETUID_CAN_FAIL_WITH_EAGAIN=1 -D_BSD_SOURCE -Wl,-z,relro -Wl,-z,now -Wl,--as-needed    conftest.c  || for _f in ${tcfn}*; do case $_f in lksh.1|mksh.1|mksh.faq|mksh.ico) ;; *) rm -f "$_f" ;; esac; done
 ] gcc -nostdlib -static -L/usr/lib/x86_64-linux-gnu/diet/lib-x86_64 -L/usr/lib/diet/lib /usr/lib/x86_64-linux-gnu/diet/lib-x86_64/start.o -g -Werror=implicit-function-declaration -ffile-prefix-map=/build/reproducible-path/mksh-59c=. -fstack-clash-protection -Wformat -Werror=format-security -fcf-protection -Wall -Wextra -I. -I../.. -Wdate-time -D_FORTIFY_SOURCE=2 -DMKSH_EARLY_LOCALE_TRACKING -DKSH_VERSIONNAME_VENDOR_EXT=" +Debian" -DMKSH_BUILDMEAT -DMKSH_BINSHPOSIX -DMKSH_BINSHREDUCED -DMKSH_SMALL -DMKSH_SMALL_BUT_FAST -DMKSH_BUILDSH=1 -D_GNU_SOURCE -DSETUID_CAN_FAIL_WITH_EAGAIN=1 -D_BSD_SOURCE -Wl,-z,relro -Wl,-z,now -Wl,--as-needed conftest.c -isystem /usr/lib/x86_64-linux-gnu/diet/include -D__dietlibc__ -D_DISTRO_EVADE_TIME_BITS -Os /usr/lib/x86_64-linux-gnu/diet/lib-x86_64/libc.a -lgcc 
-] /usr/bin/ld: /tmp/ccnZTnLF.o: in function `main':
+] /usr/bin/ld: /tmp/ccMurcUk.o: in function `main':
 ] ./builddir/static-dietlibc/./builddir/static-dietlibc/conftest.c:15:(.text.startup+0xf): undefined reference to `thiswillneverbedefinedIhope'
 ] collect2: error: ld returned 1 exit status
 ==> if the compiler does not fail correctly... no
@@ -4514,21 +4550,21 @@
 ... if mksh will be built without job control
 $ diet -v -Os gcc -g -Werror=implicit-function-declaration -ffile-prefix-map=/build/reproducible-path/mksh-59c=. -fstack-clash-protection -Wformat -Werror=format-security -fcf-protection -Wall -Wextra -fno-lto -Wno-deprecated-declarations -fno-asynchronous-unwind-tables -fno-strict-aliasing -fstack-protector-strong -malign-data=abi -fwrapv  -I. -I'../..' -Wdate-time -D_FORTIFY_SOURCE=2 -DMKSH_EARLY_LOCALE_TRACKING -DKSH_VERSIONNAME_VENDOR_EXT=\"\ +Debian\" -DMKSH_BUILDMEAT -DMKSH_BINSHPOSIX -DMKSH_BINSHREDUCED -DMKSH_SMALL -DMKSH_SMALL_BUT_FAST -DMKSH_BUILDSH=1 -D_GNU_SOURCE -DSETUID_CAN_FAIL_WITH_EAGAIN=1 -D_BSD_SOURCE -DHAVE_STRING_POOLING=2 -DHAVE_ATTRIBUTE_BOUNDED=0 -DHAVE_ATTRIBUTE_FORMAT=1 -DHAVE_ATTRIBUTE_NORETURN=1 -DHAVE_ATTRIBUTE_UNUSED=1 -DHAVE_ATTRIBUTE_USED=1 -Wl,-z,relro -Wl,-z,now -Wl,--as-needed   -fno-lto -Wno-error conftest.c  || for _f in ${tcfn}*; do case $_f in lksh.1|mksh.1|mksh.faq|mksh.ico) ;; *) rm -f "$_f" ;; esac; done
 ] gcc -nostdlib -static -L/usr/lib/x86_64-linux-gnu/diet/lib-x86_64 -L/usr/lib/diet/lib /usr/lib/x86_64-linux-gnu/diet/lib-x86_64/start.o -g -Werror=implicit-function-declaration -ffile-prefix-map=/build/reproducible-path/mksh-59c=. -fstack-clash-protection -Wformat -Werror=format-security -fcf-protection -Wall -Wextra -fno-lto -Wno-deprecated-declarations -fno-asynchronous-unwind-tables -fno-strict-aliasing -fstack-protector-strong -malign-data=abi -fwrapv -I. -I../.. -Wdate-time -D_FORTIFY_SOURCE=2 -DMKSH_EARLY_LOCALE_TRACKING -DKSH_VERSIONNAME_VENDOR_EXT=" +Debian" -DMKSH_BUILDMEAT -DMKSH_BINSHPOSIX -DMKSH_BINSHREDUCED -DMKSH_SMALL -DMKSH_SMALL_BUT_FAST -DMKSH_BUILDSH=1 -D_GNU_SOURCE -DSETUID_CAN_FAIL_WITH_EAGAIN=1 -D_BSD_SOURCE -DHAVE_STRING_POOLING=2 -DHAVE_ATTRIBUTE_BOUNDED=0 -DHAVE_ATTRIBUTE_FORMAT=1 -DHAVE_ATTRIBUTE_NORETURN=1 -DHAVE_ATTRIBUTE_UNUSED=1 -DHAVE_ATTRIBUTE_USED=1 -Wl,-z,relro -Wl,-z,now -Wl,--as-needed -fno-lto -Wno-error conftest.c -isystem /usr/lib/x86_64-linux-gnu/diet/include -D__dietlibc__ -D_DISTRO_EVADE_TIME_BITS -Os /usr/lib/x86_64-linux-gnu/diet/lib-x86_64/libc.a -lgcc 
-] /usr/bin/ld: /tmp/ccQPLqh1.o: in function `main':
+] /usr/bin/ld: /tmp/cc2o2dsA.o: in function `main':
 ] ./builddir/static-dietlibc/./builddir/static-dietlibc/conftest.c:15:(.text.startup+0xf): undefined reference to `thiswillneverbedefinedIhope'
 ] collect2: error: ld returned 1 exit status
 ==> if mksh will be built without job control... no
 ... if mksh will be built without job signals
 $ diet -v -Os gcc -g -Werror=implicit-function-declaration -ffile-prefix-map=/build/reproducible-path/mksh-59c=. -fstack-clash-protection -Wformat -Werror=format-security -fcf-protection -Wall -Wextra -fno-lto -Wno-deprecated-declarations -fno-asynchronous-unwind-tables -fno-strict-aliasing -fstack-protector-strong -malign-data=abi -fwrapv  -I. -I'../..' -Wdate-time -D_FORTIFY_SOURCE=2 -DMKSH_EARLY_LOCALE_TRACKING -DKSH_VERSIONNAME_VENDOR_EXT=\"\ +Debian\" -DMKSH_BUILDMEAT -DMKSH_BINSHPOSIX -DMKSH_BINSHREDUCED -DMKSH_SMALL -DMKSH_SMALL_BUT_FAST -DMKSH_BUILDSH=1 -D_GNU_SOURCE -DSETUID_CAN_FAIL_WITH_EAGAIN=1 -D_BSD_SOURCE -DHAVE_STRING_POOLING=2 -DHAVE_ATTRIBUTE_BOUNDED=0 -DHAVE_ATTRIBUTE_FORMAT=1 -DHAVE_ATTRIBUTE_NORETURN=1 -DHAVE_ATTRIBUTE_UNUSED=1 -DHAVE_ATTRIBUTE_USED=1 -Wl,-z,relro -Wl,-z,now -Wl,--as-needed   -fno-lto -Wno-error conftest.c  || for _f in ${tcfn}*; do case $_f in lksh.1|mksh.1|mksh.faq|mksh.ico) ;; *) rm -f "$_f" ;; esac; done
 ] gcc -nostdlib -static -L/usr/lib/x86_64-linux-gnu/diet/lib-x86_64 -L/usr/lib/diet/lib /usr/lib/x86_64-linux-gnu/diet/lib-x86_64/start.o -g -Werror=implicit-function-declaration -ffile-prefix-map=/build/reproducible-path/mksh-59c=. -fstack-clash-protection -Wformat -Werror=format-security -fcf-protection -Wall -Wextra -fno-lto -Wno-deprecated-declarations -fno-asynchronous-unwind-tables -fno-strict-aliasing -fstack-protector-strong -malign-data=abi -fwrapv -I. -I../.. -Wdate-time -D_FORTIFY_SOURCE=2 -DMKSH_EARLY_LOCALE_TRACKING -DKSH_VERSIONNAME_VENDOR_EXT=" +Debian" -DMKSH_BUILDMEAT -DMKSH_BINSHPOSIX -DMKSH_BINSHREDUCED -DMKSH_SMALL -DMKSH_SMALL_BUT_FAST -DMKSH_BUILDSH=1 -D_GNU_SOURCE -DSETUID_CAN_FAIL_WITH_EAGAIN=1 -D_BSD_SOURCE -DHAVE_STRING_POOLING=2 -DHAVE_ATTRIBUTE_BOUNDED=0 -DHAVE_ATTRIBUTE_FORMAT=1 -DHAVE_ATTRIBUTE_NORETURN=1 -DHAVE_ATTRIBUTE_UNUSED=1 -DHAVE_ATTRIBUTE_USED=1 -Wl,-z,relro -Wl,-z,now -Wl,--as-needed -fno-lto -Wno-error conftest.c -isystem /usr/lib/x86_64-linux-gnu/diet/include -D__dietlibc__ -D_DISTRO_EVADE_TIME_BITS -Os /usr/lib/x86_64-linux-gnu/diet/lib-x86_64/libc.a -lgcc 
-] /usr/bin/ld: /tmp/ccx1hnKt.o: in function `main':
+] /usr/bin/ld: /tmp/ccVtXoQI.o: in function `main':
 ] ./builddir/static-dietlibc/./builddir/static-dietlibc/conftest.c:15:(.text.startup+0xf): undefined reference to `thiswillneverbedefinedIhope'
 ] collect2: error: ld returned 1 exit status
 ==> if mksh will be built without job signals... no
 ... if the default UTF-8 mode is specified
 $ diet -v -Os gcc -g -Werror=implicit-function-declaration -ffile-prefix-map=/build/reproducible-path/mksh-59c=. -fstack-clash-protection -Wformat -Werror=format-security -fcf-protection -Wall -Wextra -fno-lto -Wno-deprecated-declarations -fno-asynchronous-unwind-tables -fno-strict-aliasing -fstack-protector-strong -malign-data=abi -fwrapv  -I. -I'../..' -Wdate-time -D_FORTIFY_SOURCE=2 -DMKSH_EARLY_LOCALE_TRACKING -DKSH_VERSIONNAME_VENDOR_EXT=\"\ +Debian\" -DMKSH_BUILDMEAT -DMKSH_BINSHPOSIX -DMKSH_BINSHREDUCED -DMKSH_SMALL -DMKSH_SMALL_BUT_FAST -DMKSH_BUILDSH=1 -D_GNU_SOURCE -DSETUID_CAN_FAIL_WITH_EAGAIN=1 -D_BSD_SOURCE -DHAVE_STRING_POOLING=2 -DHAVE_ATTRIBUTE_BOUNDED=0 -DHAVE_ATTRIBUTE_FORMAT=1 -DHAVE_ATTRIBUTE_NORETURN=1 -DHAVE_ATTRIBUTE_UNUSED=1 -DHAVE_ATTRIBUTE_USED=1 -Wl,-z,relro -Wl,-z,now -Wl,--as-needed   -fno-lto -Wno-error conftest.c  || for _f in ${tcfn}*; do case $_f in lksh.1|mksh.1|mksh.faq|mksh.ico) ;; *) rm -f "$_f" ;; esac; done
 ] gcc -nostdlib -static -L/usr/lib/x86_64-linux-gnu/diet/lib-x86_64 -L/usr/lib/diet/lib /usr/lib/x86_64-linux-gnu/diet/lib-x86_64/start.o -g -Werror=implicit-function-declaration -ffile-prefix-map=/build/reproducible-path/mksh-59c=. -fstack-clash-protection -Wformat -Werror=format-security -fcf-protection -Wall -Wextra -fno-lto -Wno-deprecated-declarations -fno-asynchronous-unwind-tables -fno-strict-aliasing -fstack-protector-strong -malign-data=abi -fwrapv -I. -I../.. -Wdate-time -D_FORTIFY_SOURCE=2 -DMKSH_EARLY_LOCALE_TRACKING -DKSH_VERSIONNAME_VENDOR_EXT=" +Debian" -DMKSH_BUILDMEAT -DMKSH_BINSHPOSIX -DMKSH_BINSHREDUCED -DMKSH_SMALL -DMKSH_SMALL_BUT_FAST -DMKSH_BUILDSH=1 -D_GNU_SOURCE -DSETUID_CAN_FAIL_WITH_EAGAIN=1 -D_BSD_SOURCE -DHAVE_STRING_POOLING=2 -DHAVE_ATTRIBUTE_BOUNDED=0 -DHAVE_ATTRIBUTE_FORMAT=1 -DHAVE_ATTRIBUTE_NORETURN=1 -DHAVE_ATTRIBUTE_UNUSED=1 -DHAVE_ATTRIBUTE_USED=1 -Wl,-z,relro -Wl,-z,now -Wl,--as-needed -fno-lto -Wno-error conftest.c -isystem /usr/lib/x86_64-linux-gnu/diet/include -D__dietlibc__ -D_DISTRO_EVADE_TIME_BITS -Os /usr/lib/x86_64-linux-gnu/diet/lib-x86_64/libc.a -lgcc 
-] /usr/bin/ld: /tmp/ccJMQxa4.o: in function `main':
+] /usr/bin/ld: /tmp/ccHDH0iT.o: in function `main':
 ] ./builddir/static-dietlibc/./builddir/static-dietlibc/conftest.c:15:(.text.startup+0xf): undefined reference to `thiswillneverbedefinedIhope'
 ] collect2: error: ld returned 1 exit status
 ==> if the default UTF-8 mode is specified... no
@@ -4536,7 +4572,7 @@
 ... if the MidnightBSD 0.1 ash compatibility mode is requested
 $ diet -v -Os gcc -g -Werror=implicit-function-declaration -ffile-prefix-map=/build/reproducible-path/mksh-59c=. -fstack-clash-protection -Wformat -Werror=format-security -fcf-protection -Wall -Wextra -fno-lto -Wno-deprecated-declarations -fno-asynchronous-unwind-tables -fno-strict-aliasing -fstack-protector-strong -malign-data=abi -fwrapv  -I. -I'../..' -Wdate-time -D_FORTIFY_SOURCE=2 -DMKSH_EARLY_LOCALE_TRACKING -DKSH_VERSIONNAME_VENDOR_EXT=\"\ +Debian\" -DMKSH_BUILDMEAT -DMKSH_BINSHPOSIX -DMKSH_BINSHREDUCED -DMKSH_SMALL -DMKSH_SMALL_BUT_FAST -DMKSH_BUILDSH=1 -D_GNU_SOURCE -DSETUID_CAN_FAIL_WITH_EAGAIN=1 -D_BSD_SOURCE -DHAVE_STRING_POOLING=2 -DHAVE_ATTRIBUTE_BOUNDED=0 -DHAVE_ATTRIBUTE_FORMAT=1 -DHAVE_ATTRIBUTE_NORETURN=1 -DHAVE_ATTRIBUTE_UNUSED=1 -DHAVE_ATTRIBUTE_USED=1 -Wl,-z,relro -Wl,-z,now -Wl,--as-needed   -fno-lto -Wno-error conftest.c  || for _f in ${tcfn}*; do case $_f in lksh.1|mksh.1|mksh.faq|mksh.ico) ;; *) rm -f "$_f" ;; esac; done
 ] gcc -nostdlib -static -L/usr/lib/x86_64-linux-gnu/diet/lib-x86_64 -L/usr/lib/diet/lib /usr/lib/x86_64-linux-gnu/diet/lib-x86_64/start.o -g -Werror=implicit-function-declaration -ffile-prefix-map=/build/reproducible-path/mksh-59c=. -fstack-clash-protection -Wformat -Werror=format-security -fcf-protection -Wall -Wextra -fno-lto -Wno-deprecated-declarations -fno-asynchronous-unwind-tables -fno-strict-aliasing -fstack-protector-strong -malign-data=abi -fwrapv -I. -I../.. -Wdate-time -D_FORTIFY_SOURCE=2 -DMKSH_EARLY_LOCALE_TRACKING -DKSH_VERSIONNAME_VENDOR_EXT=" +Debian" -DMKSH_BUILDMEAT -DMKSH_BINSHPOSIX -DMKSH_BINSHREDUCED -DMKSH_SMALL -DMKSH_SMALL_BUT_FAST -DMKSH_BUILDSH=1 -D_GNU_SOURCE -DSETUID_CAN_FAIL_WITH_EAGAIN=1 -D_BSD_SOURCE -DHAVE_STRING_POOLING=2 -DHAVE_ATTRIBUTE_BOUNDED=0 -DHAVE_ATTRIBUTE_FORMAT=1 -DHAVE_ATTRIBUTE_NORETURN=1 -DHAVE_ATTRIBUTE_UNUSED=1 -DHAVE_ATTRIBUTE_USED=1 -Wl,-z,relro -Wl,-z,now -Wl,--as-needed -fno-lto -Wno-error conftest.c -isystem /usr/lib/x86_64-linux-gnu/diet/include -D__dietlibc__ -D_DISTRO_EVADE_TIME_BITS -Os /usr/lib/x86_64-linux-gnu/diet/lib-x86_64/libc.a -lgcc 
-] /usr/bin/ld: /tmp/cc6neYpP.o: in function `main':
+] /usr/bin/ld: /tmp/ccGxTTvn.o: in function `main':
 ] ./builddir/static-dietlibc/./builddir/static-dietlibc/conftest.c:15:(.text.startup+0xf): undefined reference to `thiswillneverbedefinedIhope'
 ] collect2: error: ld returned 1 exit status
 ==> if the MidnightBSD 0.1 ash compatibility mode is requested... no
@@ -4706,7 +4742,7 @@
 ... GNU strerrordesc_np()
 $ diet -v -Os gcc -g -Werror=implicit-function-declaration -ffile-prefix-map=/build/reproducible-path/mksh-59c=. -fstack-clash-protection -Wformat -Werror=format-security -fcf-protection -Wall -Wextra -fno-lto -Wno-deprecated-declarations -fno-asynchronous-unwind-tables -fno-strict-aliasing -fstack-protector-strong -malign-data=abi -fwrapv  -I. -I'../..' -Wdate-time -D_FORTIFY_SOURCE=2 -DMKSH_EARLY_LOCALE_TRACKING -DKSH_VERSIONNAME_VENDOR_EXT=\"\ +Debian\" -DMKSH_BUILDMEAT -DMKSH_BINSHPOSIX -DMKSH_BINSHREDUCED -DMKSH_SMALL -DMKSH_SMALL_BUT_FAST -DMKSH_BUILDSH=1 -D_GNU_SOURCE -DSETUID_CAN_FAIL_WITH_EAGAIN=1 -D_BSD_SOURCE -DHAVE_STRING_POOLING=2 -DHAVE_ATTRIBUTE_BOUNDED=0 -DHAVE_ATTRIBUTE_FORMAT=1 -DHAVE_ATTRIBUTE_NORETURN=1 -DHAVE_ATTRIBUTE_UNUSED=1 -DHAVE_ATTRIBUTE_USED=1 -DHAVE_SYS_TIME_H=1 -DHAVE_TIME_H=1 -DHAVE_BOTH_TIME_H=1 -DHAVE_SYS_SELECT_H=1 -DHAVE_SELECT_TIME_H=1 -DHAVE_SYS_BSDTYPES_H=0 -DHAVE_SYS_FILE_H=1 -DHAVE_SYS_MKDEV_H=0 -DHAVE_SYS_MMAN_H=1 -DHAVE_SYS_PARAM_H=1 -DHAVE_SYS_PTEM_H=0 -DHAVE_SYS_RESOURCE_H=1 -DHAVE_SYS_SYSMACROS_H=1 -DHAVE_BSTRING_H=0 -DHAVE_GRP_H=1 -DHAVE_IO_H=0 -DHAVE_LIBGEN_H=1 -DHAVE_LIBUTIL_H=0 -DHAVE_PATHS_H=1 -DHAVE_STDINT_H=1 -DHAVE_STRINGS_H=1 -DHAVE_TERMIOS_H=1 -DHAVE_ULIMIT_H=1 -DHAVE_CAN_INTTYPES=1 -DHAVE_SIG_T=1 -Wl,-z,relro -Wl,-z,now -Wl,--as-needed   -fno-lto -Wno-error conftest.c  || for _f in ${tcfn}*; do case $_f in lksh.1|mksh.1|mksh.faq|mksh.ico) ;; *) rm -f "$_f" ;; esac; done
 ] gcc -nostdlib -static -L/usr/lib/x86_64-linux-gnu/diet/lib-x86_64 -L/usr/lib/diet/lib /usr/lib/x86_64-linux-gnu/diet/lib-x86_64/start.o -g -Werror=implicit-function-declaration -ffile-prefix-map=/build/reproducible-path/mksh-59c=. -fstack-clash-protection -Wformat -Werror=format-security -fcf-protection -Wall -Wextra -fno-lto -Wno-deprecated-declarations -fno-asynchronous-unwind-tables -fno-strict-aliasing -fstack-protector-strong -malign-data=abi -fwrapv -I. -I../.. -Wdate-time -D_FORTIFY_SOURCE=2 -DMKSH_EARLY_LOCALE_TRACKING -DKSH_VERSIONNAME_VENDOR_EXT=" +Debian" -DMKSH_BUILDMEAT -DMKSH_BINSHPOSIX -DMKSH_BINSHREDUCED -DMKSH_SMALL -DMKSH_SMALL_BUT_FAST -DMKSH_BUILDSH=1 -D_GNU_SOURCE -DSETUID_CAN_FAIL_WITH_EAGAIN=1 -D_BSD_SOURCE -DHAVE_STRING_POOLING=2 -DHAVE_ATTRIBUTE_BOUNDED=0 -DHAVE_ATTRIBUTE_FORMAT=1 -DHAVE_ATTRIBUTE_NORETURN=1 -DHAVE_ATTRIBUTE_UNUSED=1 -DHAVE_ATTRIBUTE_USED=1 -DHAVE_SYS_TIME_H=1 -DHAVE_TIME_H=1 -DHAVE_BOTH_TIME_H=1 -DHAVE_SYS_SELECT_H=1 -DHAVE_SELECT_TIME_H=1 -DHAVE_SYS_BSDTYPES_H=0 -DHAVE_SYS_FILE_H=1 -DHAVE_SYS_MKDEV_H=0 -DHAVE_SYS_MMAN_H=1 -DHAVE_SYS_PARAM_H=1 -DHAVE_SYS_PTEM_H=0 -DHAVE_SYS_RESOURCE_H=1 -DHAVE_SYS_SYSMACROS_H=1 -DHAVE_BSTRING_H=0 -DHAVE_GRP_H=1 -DHAVE_IO_H=0 -DHAVE_LIBGEN_H=1 -DHAVE_LIBUTIL_H=0 -DHAVE_PATHS_H=1 -DHAVE_STDINT_H=1 -DHAVE_STRINGS_H=1 -DHAVE_TERMIOS_H=1 -DHAVE_ULIMIT_H=1 -DHAVE_CAN_INTTYPES=1 -DHAVE_SIG_T=1 -Wl,-z,relro -Wl,-z,now -Wl,--as-needed -fno-lto -Wno-error conftest.c -isystem /usr/lib/x86_64-linux-gnu/diet/include -D__dietlibc__ -D_DISTRO_EVADE_TIME_BITS -Os /usr/lib/x86_64-linux-gnu/diet/lib-x86_64/libc.a -lgcc 
-] /usr/bin/ld: /tmp/ccf8EncJ.o: in function `main':
+] /usr/bin/ld: /tmp/cczeR1MI.o: in function `main':
 ] ./builddir/static-dietlibc/./builddir/static-dietlibc/conftest.c:9:(.text.startup+0x10): undefined reference to `strerrordesc_np'
 ] collect2: error: ld returned 1 exit status
 ==> GNU strerrordesc_np()... no
@@ -4718,28 +4754,28 @@
 ... GNU sigabbrev_np()
 $ diet -v -Os gcc -g -Werror=implicit-function-declaration -ffile-prefix-map=/build/reproducible-path/mksh-59c=. -fstack-clash-protection -Wformat -Werror=format-security -fcf-protection -Wall -Wextra -fno-lto -Wno-deprecated-declarations -fno-asynchronous-unwind-tables -fno-strict-aliasing -fstack-protector-strong -malign-data=abi -fwrapv  -I. -I'../..' -Wdate-time -D_FORTIFY_SOURCE=2 -DMKSH_EARLY_LOCALE_TRACKING -DKSH_VERSIONNAME_VENDOR_EXT=\"\ +Debian\" -DMKSH_BUILDMEAT -DMKSH_BINSHPOSIX -DMKSH_BINSHREDUCED -DMKSH_SMALL -DMKSH_SMALL_BUT_FAST -DMKSH_BUILDSH=1 -D_GNU_SOURCE -DSETUID_CAN_FAIL_WITH_EAGAIN=1 -D_BSD_SOURCE -DHAVE_STRING_POOLING=2 -DHAVE_ATTRIBUTE_BOUNDED=0 -DHAVE_ATTRIBUTE_FORMAT=1 -DHAVE_ATTRIBUTE_NORETURN=1 -DHAVE_ATTRIBUTE_UNUSED=1 -DHAVE_ATTRIBUTE_USED=1 -DHAVE_SYS_TIME_H=1 -DHAVE_TIME_H=1 -DHAVE_BOTH_TIME_H=1 -DHAVE_SYS_SELECT_H=1 -DHAVE_SELECT_TIME_H=1 -DHAVE_SYS_BSDTYPES_H=0 -DHAVE_SYS_FILE_H=1 -DHAVE_SYS_MKDEV_H=0 -DHAVE_SYS_MMAN_H=1 -DHAVE_SYS_PARAM_H=1 -DHAVE_SYS_PTEM_H=0 -DHAVE_SYS_RESOURCE_H=1 -DHAVE_SYS_SYSMACROS_H=1 -DHAVE_BSTRING_H=0 -DHAVE_GRP_H=1 -DHAVE_IO_H=0 -DHAVE_LIBGEN_H=1 -DHAVE_LIBUTIL_H=0 -DHAVE_PATHS_H=1 -DHAVE_STDINT_H=1 -DHAVE_STRINGS_H=1 -DHAVE_TERMIOS_H=1 -DHAVE_ULIMIT_H=1 -DHAVE_CAN_INTTYPES=1 -DHAVE_SIG_T=1 -DHAVE_STRERRORDESC_NP=0 -DHAVE_SYS_ERRLIST=1 -Wl,-z,relro -Wl,-z,now -Wl,--as-needed   -fno-lto -Wno-error conftest.c  || for _f in ${tcfn}*; do case $_f in lksh.1|mksh.1|mksh.faq|mksh.ico) ;; *) rm -f "$_f" ;; esac; done
 ] gcc -nostdlib -static -L/usr/lib/x86_64-linux-gnu/diet/lib-x86_64 -L/usr/lib/diet/lib /usr/lib/x86_64-linux-gnu/diet/lib-x86_64/start.o -g -Werror=implicit-function-declaration -ffile-prefix-map=/build/reproducible-path/mksh-59c=. -fstack-clash-protection -Wformat -Werror=format-security -fcf-protection -Wall -Wextra -fno-lto -Wno-deprecated-declarations -fno-asynchronous-unwind-tables -fno-strict-aliasing -fstack-protector-strong -malign-data=abi -fwrapv -I. -I../.. -Wdate-time -D_FORTIFY_SOURCE=2 -DMKSH_EARLY_LOCALE_TRACKING -DKSH_VERSIONNAME_VENDOR_EXT=" +Debian" -DMKSH_BUILDMEAT -DMKSH_BINSHPOSIX -DMKSH_BINSHREDUCED -DMKSH_SMALL -DMKSH_SMALL_BUT_FAST -DMKSH_BUILDSH=1 -D_GNU_SOURCE -DSETUID_CAN_FAIL_WITH_EAGAIN=1 -D_BSD_SOURCE -DHAVE_STRING_POOLING=2 -DHAVE_ATTRIBUTE_BOUNDED=0 -DHAVE_ATTRIBUTE_FORMAT=1 -DHAVE_ATTRIBUTE_NORETURN=1 -DHAVE_ATTRIBUTE_UNUSED=1 -DHAVE_ATTRIBUTE_USED=1 -DHAVE_SYS_TIME_H=1 -DHAVE_TIME_H=1 -DHAVE_BOTH_TIME_H=1 -DHAVE_SYS_SELECT_H=1 -DHAVE_SELECT_TIME_H=1 -DHAVE_SYS_BSDTYPES_H=0 -DHAVE_SYS_FILE_H=1 -DHAVE_SYS_MKDEV_H=0 -DHAVE_SYS_MMAN_H=1 -DHAVE_SYS_PARAM_H=1 -DHAVE_SYS_PTEM_H=0 -DHAVE_SYS_RESOURCE_H=1 -DHAVE_SYS_SYSMACROS_H=1 -DHAVE_BSTRING_H=0 -DHAVE_GRP_H=1 -DHAVE_IO_H=0 -DHAVE_LIBGEN_H=1 -DHAVE_LIBUTIL_H=0 -DHAVE_PATHS_H=1 -DHAVE_STDINT_H=1 -DHAVE_STRINGS_H=1 -DHAVE_TERMIOS_H=1 -DHAVE_ULIMIT_H=1 -DHAVE_CAN_INTTYPES=1 -DHAVE_SIG_T=1 -DHAVE_STRERRORDESC_NP=0 -DHAVE_SYS_ERRLIST=1 -Wl,-z,relro -Wl,-z,now -Wl,--as-needed -fno-lto -Wno-error conftest.c -isystem /usr/lib/x86_64-linux-gnu/diet/include -D__dietlibc__ -D_DISTRO_EVADE_TIME_BITS -Os /usr/lib/x86_64-linux-gnu/diet/lib-x86_64/libc.a -lgcc 
-] /usr/bin/ld: /tmp/ccxb3IKQ.o: in function `main':
+] /usr/bin/ld: /tmp/ccStTSkP.o: in function `main':
 ] ./builddir/static-dietlibc/./builddir/static-dietlibc/conftest.c:9:(.text.startup+0x10): undefined reference to `sigabbrev_np'
 ] collect2: error: ld returned 1 exit status
 ==> GNU sigabbrev_np()... no
 ... the sys_signame[] array
 $ diet -v -Os gcc -g -Werror=implicit-function-declaration -ffile-prefix-map=/build/reproducible-path/mksh-59c=. -fstack-clash-protection -Wformat -Werror=format-security -fcf-protection -Wall -Wextra -fno-lto -Wno-deprecated-declarations -fno-asynchronous-unwind-tables -fno-strict-aliasing -fstack-protector-strong -malign-data=abi -fwrapv  -I. -I'../..' -Wdate-time -D_FORTIFY_SOURCE=2 -DMKSH_EARLY_LOCALE_TRACKING -DKSH_VERSIONNAME_VENDOR_EXT=\"\ +Debian\" -DMKSH_BUILDMEAT -DMKSH_BINSHPOSIX -DMKSH_BINSHREDUCED -DMKSH_SMALL -DMKSH_SMALL_BUT_FAST -DMKSH_BUILDSH=1 -D_GNU_SOURCE -DSETUID_CAN_FAIL_WITH_EAGAIN=1 -D_BSD_SOURCE -DHAVE_STRING_POOLING=2 -DHAVE_ATTRIBUTE_BOUNDED=0 -DHAVE_ATTRIBUTE_FORMAT=1 -DHAVE_ATTRIBUTE_NORETURN=1 -DHAVE_ATTRIBUTE_UNUSED=1 -DHAVE_ATTRIBUTE_USED=1 -DHAVE_SYS_TIME_H=1 -DHAVE_TIME_H=1 -DHAVE_BOTH_TIME_H=1 -DHAVE_SYS_SELECT_H=1 -DHAVE_SELECT_TIME_H=1 -DHAVE_SYS_BSDTYPES_H=0 -DHAVE_SYS_FILE_H=1 -DHAVE_SYS_MKDEV_H=0 -DHAVE_SYS_MMAN_H=1 -DHAVE_SYS_PARAM_H=1 -DHAVE_SYS_PTEM_H=0 -DHAVE_SYS_RESOURCE_H=1 -DHAVE_SYS_SYSMACROS_H=1 -DHAVE_BSTRING_H=0 -DHAVE_GRP_H=1 -DHAVE_IO_H=0 -DHAVE_LIBGEN_H=1 -DHAVE_LIBUTIL_H=0 -DHAVE_PATHS_H=1 -DHAVE_STDINT_H=1 -DHAVE_STRINGS_H=1 -DHAVE_TERMIOS_H=1 -DHAVE_ULIMIT_H=1 -DHAVE_CAN_INTTYPES=1 -DHAVE_SIG_T=1 -DHAVE_STRERRORDESC_NP=0 -DHAVE_SYS_ERRLIST=1 -DHAVE_SIGABBREV_NP=0 -Wl,-z,relro -Wl,-z,now -Wl,--as-needed   -fno-lto -Wno-error conftest.c  || for _f in ${tcfn}*; do case $_f in lksh.1|mksh.1|mksh.faq|mksh.ico) ;; *) rm -f "$_f" ;; esac; done
 ] gcc -nostdlib -static -L/usr/lib/x86_64-linux-gnu/diet/lib-x86_64 -L/usr/lib/diet/lib /usr/lib/x86_64-linux-gnu/diet/lib-x86_64/start.o -g -Werror=implicit-function-declaration -ffile-prefix-map=/build/reproducible-path/mksh-59c=. -fstack-clash-protection -Wformat -Werror=format-security -fcf-protection -Wall -Wextra -fno-lto -Wno-deprecated-declarations -fno-asynchronous-unwind-tables -fno-strict-aliasing -fstack-protector-strong -malign-data=abi -fwrapv -I. -I../.. -Wdate-time -D_FORTIFY_SOURCE=2 -DMKSH_EARLY_LOCALE_TRACKING -DKSH_VERSIONNAME_VENDOR_EXT=" +Debian" -DMKSH_BUILDMEAT -DMKSH_BINSHPOSIX -DMKSH_BINSHREDUCED -DMKSH_SMALL -DMKSH_SMALL_BUT_FAST -DMKSH_BUILDSH=1 -D_GNU_SOURCE -DSETUID_CAN_FAIL_WITH_EAGAIN=1 -D_BSD_SOURCE -DHAVE_STRING_POOLING=2 -DHAVE_ATTRIBUTE_BOUNDED=0 -DHAVE_ATTRIBUTE_FORMAT=1 -DHAVE_ATTRIBUTE_NORETURN=1 -DHAVE_ATTRIBUTE_UNUSED=1 -DHAVE_ATTRIBUTE_USED=1 -DHAVE_SYS_TIME_H=1 -DHAVE_TIME_H=1 -DHAVE_BOTH_TIME_H=1 -DHAVE_SYS_SELECT_H=1 -DHAVE_SELECT_TIME_H=1 -DHAVE_SYS_BSDTYPES_H=0 -DHAVE_SYS_FILE_H=1 -DHAVE_SYS_MKDEV_H=0 -DHAVE_SYS_MMAN_H=1 -DHAVE_SYS_PARAM_H=1 -DHAVE_SYS_PTEM_H=0 -DHAVE_SYS_RESOURCE_H=1 -DHAVE_SYS_SYSMACROS_H=1 -DHAVE_BSTRING_H=0 -DHAVE_GRP_H=1 -DHAVE_IO_H=0 -DHAVE_LIBGEN_H=1 -DHAVE_LIBUTIL_H=0 -DHAVE_PATHS_H=1 -DHAVE_STDINT_H=1 -DHAVE_STRINGS_H=1 -DHAVE_TERMIOS_H=1 -DHAVE_ULIMIT_H=1 -DHAVE_CAN_INTTYPES=1 -DHAVE_SIG_T=1 -DHAVE_STRERRORDESC_NP=0 -DHAVE_SYS_ERRLIST=1 -DHAVE_SIGABBREV_NP=0 -Wl,-z,relro -Wl,-z,now -Wl,--as-needed -fno-lto -Wno-error conftest.c -isystem /usr/lib/x86_64-linux-gnu/diet/include -D__dietlibc__ -D_DISTRO_EVADE_TIME_BITS -Os /usr/lib/x86_64-linux-gnu/diet/lib-x86_64/libc.a -lgcc 
-] /usr/bin/ld: /tmp/ccBLZ5vD.o: in function `main':
+] /usr/bin/ld: /tmp/ccYRNMcW.o: in function `main':
 ] ./builddir/static-dietlibc/./builddir/static-dietlibc/conftest.c:10:(.text.startup+0x8): undefined reference to `sys_signame'
 ] collect2: error: ld returned 1 exit status
 ==> the sys_signame[] array... no
 ... the _sys_signame[] array
 $ diet -v -Os gcc -g -Werror=implicit-function-declaration -ffile-prefix-map=/build/reproducible-path/mksh-59c=. -fstack-clash-protection -Wformat -Werror=format-security -fcf-protection -Wall -Wextra -fno-lto -Wno-deprecated-declarations -fno-asynchronous-unwind-tables -fno-strict-aliasing -fstack-protector-strong -malign-data=abi -fwrapv  -I. -I'../..' -Wdate-time -D_FORTIFY_SOURCE=2 -DMKSH_EARLY_LOCALE_TRACKING -DKSH_VERSIONNAME_VENDOR_EXT=\"\ +Debian\" -DMKSH_BUILDMEAT -DMKSH_BINSHPOSIX -DMKSH_BINSHREDUCED -DMKSH_SMALL -DMKSH_SMALL_BUT_FAST -DMKSH_BUILDSH=1 -D_GNU_SOURCE -DSETUID_CAN_FAIL_WITH_EAGAIN=1 -D_BSD_SOURCE -DHAVE_STRING_POOLING=2 -DHAVE_ATTRIBUTE_BOUNDED=0 -DHAVE_ATTRIBUTE_FORMAT=1 -DHAVE_ATTRIBUTE_NORETURN=1 -DHAVE_ATTRIBUTE_UNUSED=1 -DHAVE_ATTRIBUTE_USED=1 -DHAVE_SYS_TIME_H=1 -DHAVE_TIME_H=1 -DHAVE_BOTH_TIME_H=1 -DHAVE_SYS_SELECT_H=1 -DHAVE_SELECT_TIME_H=1 -DHAVE_SYS_BSDTYPES_H=0 -DHAVE_SYS_FILE_H=1 -DHAVE_SYS_MKDEV_H=0 -DHAVE_SYS_MMAN_H=1 -DHAVE_SYS_PARAM_H=1 -DHAVE_SYS_PTEM_H=0 -DHAVE_SYS_RESOURCE_H=1 -DHAVE_SYS_SYSMACROS_H=1 -DHAVE_BSTRING_H=0 -DHAVE_GRP_H=1 -DHAVE_IO_H=0 -DHAVE_LIBGEN_H=1 -DHAVE_LIBUTIL_H=0 -DHAVE_PATHS_H=1 -DHAVE_STDINT_H=1 -DHAVE_STRINGS_H=1 -DHAVE_TERMIOS_H=1 -DHAVE_ULIMIT_H=1 -DHAVE_CAN_INTTYPES=1 -DHAVE_SIG_T=1 -DHAVE_STRERRORDESC_NP=0 -DHAVE_SYS_ERRLIST=1 -DHAVE_SIGABBREV_NP=0 -Wl,-z,relro -Wl,-z,now -Wl,--as-needed   -fno-lto -Wno-error conftest.c  || for _f in ${tcfn}*; do case $_f in lksh.1|mksh.1|mksh.faq|mksh.ico) ;; *) rm -f "$_f" ;; esac; done
 ] gcc -nostdlib -static -L/usr/lib/x86_64-linux-gnu/diet/lib-x86_64 -L/usr/lib/diet/lib /usr/lib/x86_64-linux-gnu/diet/lib-x86_64/start.o -g -Werror=implicit-function-declaration -ffile-prefix-map=/build/reproducible-path/mksh-59c=. -fstack-clash-protection -Wformat -Werror=format-security -fcf-protection -Wall -Wextra -fno-lto -Wno-deprecated-declarations -fno-asynchronous-unwind-tables -fno-strict-aliasing -fstack-protector-strong -malign-data=abi -fwrapv -I. -I../.. -Wdate-time -D_FORTIFY_SOURCE=2 -DMKSH_EARLY_LOCALE_TRACKING -DKSH_VERSIONNAME_VENDOR_EXT=" +Debian" -DMKSH_BUILDMEAT -DMKSH_BINSHPOSIX -DMKSH_BINSHREDUCED -DMKSH_SMALL -DMKSH_SMALL_BUT_FAST -DMKSH_BUILDSH=1 -D_GNU_SOURCE -DSETUID_CAN_FAIL_WITH_EAGAIN=1 -D_BSD_SOURCE -DHAVE_STRING_POOLING=2 -DHAVE_ATTRIBUTE_BOUNDED=0 -DHAVE_ATTRIBUTE_FORMAT=1 -DHAVE_ATTRIBUTE_NORETURN=1 -DHAVE_ATTRIBUTE_UNUSED=1 -DHAVE_ATTRIBUTE_USED=1 -DHAVE_SYS_TIME_H=1 -DHAVE_TIME_H=1 -DHAVE_BOTH_TIME_H=1 -DHAVE_SYS_SELECT_H=1 -DHAVE_SELECT_TIME_H=1 -DHAVE_SYS_BSDTYPES_H=0 -DHAVE_SYS_FILE_H=1 -DHAVE_SYS_MKDEV_H=0 -DHAVE_SYS_MMAN_H=1 -DHAVE_SYS_PARAM_H=1 -DHAVE_SYS_PTEM_H=0 -DHAVE_SYS_RESOURCE_H=1 -DHAVE_SYS_SYSMACROS_H=1 -DHAVE_BSTRING_H=0 -DHAVE_GRP_H=1 -DHAVE_IO_H=0 -DHAVE_LIBGEN_H=1 -DHAVE_LIBUTIL_H=0 -DHAVE_PATHS_H=1 -DHAVE_STDINT_H=1 -DHAVE_STRINGS_H=1 -DHAVE_TERMIOS_H=1 -DHAVE_ULIMIT_H=1 -DHAVE_CAN_INTTYPES=1 -DHAVE_SIG_T=1 -DHAVE_STRERRORDESC_NP=0 -DHAVE_SYS_ERRLIST=1 -DHAVE_SIGABBREV_NP=0 -Wl,-z,relro -Wl,-z,now -Wl,--as-needed -fno-lto -Wno-error conftest.c -isystem /usr/lib/x86_64-linux-gnu/diet/include -D__dietlibc__ -D_DISTRO_EVADE_TIME_BITS -Os /usr/lib/x86_64-linux-gnu/diet/lib-x86_64/libc.a -lgcc 
-] /usr/bin/ld: /tmp/ccEr6SfF.o: in function `main':
+] /usr/bin/ld: /tmp/ccqKcpMK.o: in function `main':
 ] ./builddir/static-dietlibc/./builddir/static-dietlibc/conftest.c:10:(.text.startup+0x8): undefined reference to `_sys_signame'
 ] collect2: error: ld returned 1 exit status
 ==> the _sys_signame[] array... no
 ... GNU sigdescr_np()
 $ diet -v -Os gcc -g -Werror=implicit-function-declaration -ffile-prefix-map=/build/reproducible-path/mksh-59c=. -fstack-clash-protection -Wformat -Werror=format-security -fcf-protection -Wall -Wextra -fno-lto -Wno-deprecated-declarations -fno-asynchronous-unwind-tables -fno-strict-aliasing -fstack-protector-strong -malign-data=abi -fwrapv  -I. -I'../..' -Wdate-time -D_FORTIFY_SOURCE=2 -DMKSH_EARLY_LOCALE_TRACKING -DKSH_VERSIONNAME_VENDOR_EXT=\"\ +Debian\" -DMKSH_BUILDMEAT -DMKSH_BINSHPOSIX -DMKSH_BINSHREDUCED -DMKSH_SMALL -DMKSH_SMALL_BUT_FAST -DMKSH_BUILDSH=1 -D_GNU_SOURCE -DSETUID_CAN_FAIL_WITH_EAGAIN=1 -D_BSD_SOURCE -DHAVE_STRING_POOLING=2 -DHAVE_ATTRIBUTE_BOUNDED=0 -DHAVE_ATTRIBUTE_FORMAT=1 -DHAVE_ATTRIBUTE_NORETURN=1 -DHAVE_ATTRIBUTE_UNUSED=1 -DHAVE_ATTRIBUTE_USED=1 -DHAVE_SYS_TIME_H=1 -DHAVE_TIME_H=1 -DHAVE_BOTH_TIME_H=1 -DHAVE_SYS_SELECT_H=1 -DHAVE_SELECT_TIME_H=1 -DHAVE_SYS_BSDTYPES_H=0 -DHAVE_SYS_FILE_H=1 -DHAVE_SYS_MKDEV_H=0 -DHAVE_SYS_MMAN_H=1 -DHAVE_SYS_PARAM_H=1 -DHAVE_SYS_PTEM_H=0 -DHAVE_SYS_RESOURCE_H=1 -DHAVE_SYS_SYSMACROS_H=1 -DHAVE_BSTRING_H=0 -DHAVE_GRP_H=1 -DHAVE_IO_H=0 -DHAVE_LIBGEN_H=1 -DHAVE_LIBUTIL_H=0 -DHAVE_PATHS_H=1 -DHAVE_STDINT_H=1 -DHAVE_STRINGS_H=1 -DHAVE_TERMIOS_H=1 -DHAVE_ULIMIT_H=1 -DHAVE_CAN_INTTYPES=1 -DHAVE_SIG_T=1 -DHAVE_STRERRORDESC_NP=0 -DHAVE_SYS_ERRLIST=1 -DHAVE_SIGABBREV_NP=0 -DHAVE_SYS_SIGNAME=0 -Wl,-z,relro -Wl,-z,now -Wl,--as-needed   -fno-lto -Wno-error conftest.c  || for _f in ${tcfn}*; do case $_f in lksh.1|mksh.1|mksh.faq|mksh.ico) ;; *) rm -f "$_f" ;; esac; done
 ] gcc -nostdlib -static -L/usr/lib/x86_64-linux-gnu/diet/lib-x86_64 -L/usr/lib/diet/lib /usr/lib/x86_64-linux-gnu/diet/lib-x86_64/start.o -g -Werror=implicit-function-declaration -ffile-prefix-map=/build/reproducible-path/mksh-59c=. -fstack-clash-protection -Wformat -Werror=format-security -fcf-protection -Wall -Wextra -fno-lto -Wno-deprecated-declarations -fno-asynchronous-unwind-tables -fno-strict-aliasing -fstack-protector-strong -malign-data=abi -fwrapv -I. -I../.. -Wdate-time -D_FORTIFY_SOURCE=2 -DMKSH_EARLY_LOCALE_TRACKING -DKSH_VERSIONNAME_VENDOR_EXT=" +Debian" -DMKSH_BUILDMEAT -DMKSH_BINSHPOSIX -DMKSH_BINSHREDUCED -DMKSH_SMALL -DMKSH_SMALL_BUT_FAST -DMKSH_BUILDSH=1 -D_GNU_SOURCE -DSETUID_CAN_FAIL_WITH_EAGAIN=1 -D_BSD_SOURCE -DHAVE_STRING_POOLING=2 -DHAVE_ATTRIBUTE_BOUNDED=0 -DHAVE_ATTRIBUTE_FORMAT=1 -DHAVE_ATTRIBUTE_NORETURN=1 -DHAVE_ATTRIBUTE_UNUSED=1 -DHAVE_ATTRIBUTE_USED=1 -DHAVE_SYS_TIME_H=1 -DHAVE_TIME_H=1 -DHAVE_BOTH_TIME_H=1 -DHAVE_SYS_SELECT_H=1 -DHAVE_SELECT_TIME_H=1 -DHAVE_SYS_BSDTYPES_H=0 -DHAVE_SYS_FILE_H=1 -DHAVE_SYS_MKDEV_H=0 -DHAVE_SYS_MMAN_H=1 -DHAVE_SYS_PARAM_H=1 -DHAVE_SYS_PTEM_H=0 -DHAVE_SYS_RESOURCE_H=1 -DHAVE_SYS_SYSMACROS_H=1 -DHAVE_BSTRING_H=0 -DHAVE_GRP_H=1 -DHAVE_IO_H=0 -DHAVE_LIBGEN_H=1 -DHAVE_LIBUTIL_H=0 -DHAVE_PATHS_H=1 -DHAVE_STDINT_H=1 -DHAVE_STRINGS_H=1 -DHAVE_TERMIOS_H=1 -DHAVE_ULIMIT_H=1 -DHAVE_CAN_INTTYPES=1 -DHAVE_SIG_T=1 -DHAVE_STRERRORDESC_NP=0 -DHAVE_SYS_ERRLIST=1 -DHAVE_SIGABBREV_NP=0 -DHAVE_SYS_SIGNAME=0 -Wl,-z,relro -Wl,-z,now -Wl,--as-needed -fno-lto -Wno-error conftest.c -isystem /usr/lib/x86_64-linux-gnu/diet/include -D__dietlibc__ -D_DISTRO_EVADE_TIME_BITS -Os /usr/lib/x86_64-linux-gnu/diet/lib-x86_64/libc.a -lgcc 
-] /usr/bin/ld: /tmp/ccXmWcMs.o: in function `main':
+] /usr/bin/ld: /tmp/ccXk2s46.o: in function `main':
 ] ./builddir/static-dietlibc/./builddir/static-dietlibc/conftest.c:9:(.text.startup+0x10): undefined reference to `sigdescr_np'
 ] collect2: error: ld returned 1 exit status
 ==> GNU sigdescr_np()... no
@@ -6381,10 +6417,10 @@
 N: CPPFLAGS='-Wdate-time -D_FORTIFY_SOURCE=2 -DMKSH_EARLY_LOCALE_TRACKING -DKSH_VERSIONNAME_VENDOR_EXT=\"\ +Debian\" -DMKSH_BUILDMEAT -DMKSH_BINSHPOSIX -DMKSH_BINSHREDUCED'
 N: LDFLAGS='-Wl,-z,relro -Wl,-z,now -Wl,--as-needed'
 N: LDSTATIC='-static -static-pie -Wl,-z,text' LIBS=''
-+ env CC=musl-gcc CFLAGS=-O2 -g -Werror=implicit-function-declaration -ffile-prefix-map=/build/reproducible-path/mksh-59c=. -fstack-clash-protection -Wformat -Werror=format-security -fcf-protection -Wall -Wextra -fPIE CPPFLAGS=-Wdate-time -D_FORTIFY_SOURCE=2 -DMKSH_EARLY_LOCALE_TRACKING -DKSH_VERSIONNAME_VENDOR_EXT=\"\ +Debian\" -DMKSH_BUILDMEAT -DMKSH_BINSHPOSIX -DMKSH_BINSHREDUCED LDFLAGS=-Wl,-z,relro -Wl,-z,now -Wl,--as-needed LDSTATIC=-static -static-pie -Wl,-z,text LIBS= sh ../../Build.sh -r -L -c trace
++ env CC=musl-gcc 'CFLAGS=-O2 -g -Werror=implicit-function-declaration -ffile-prefix-map=/build/reproducible-path/mksh-59c=. -fstack-clash-protection -Wformat -Werror=format-security -fcf-protection -Wall -Wextra -fPIE' 'CPPFLAGS=-Wdate-time -D_FORTIFY_SOURCE=2 -DMKSH_EARLY_LOCALE_TRACKING -DKSH_VERSIONNAME_VENDOR_EXT=\"\ +Debian\" -DMKSH_BUILDMEAT -DMKSH_BINSHPOSIX -DMKSH_BINSHREDUCED' 'LDFLAGS=-Wl,-z,relro -Wl,-z,now -Wl,--as-needed' 'LDSTATIC=-static -static-pie -Wl,-z,text' LIBS= sh ../../Build.sh -r -L -c trace
 For the build logs, demonstrate that /dev/null and /dev/tty exist:
-crw-rw-rw- 1 root root 1, 3 Mar 25 11:25 /dev/null
-crw-rw-rw- 1 root root 5, 0 Mar 25 11:25 /dev/tty
+crw-rw-rw- 1 root root 1, 3 Apr 26 17:46 /dev/null
+crw-rw-rw- 1 root root 5, 0 Apr 29 09:42 /dev/tty
 Flags on entry (plus HAVE_* which are not shown here):
 - CC        <musl-gcc>
 - CFLAGS    <-O2 -g -Werror=implicit-function-declaration -ffile-prefix-map=/build/reproducible-path/mksh-59c=. -fstack-clash-protection -Wformat -Werror=format-security -fcf-protection -Wall -Wextra -fPIE>
@@ -6396,11 +6432,11 @@
 
 Hi from $MirOS: src/bin/mksh/Build.sh,v 1.858 2024/08/17 23:33:47 tg Exp $ on:
 $ uname -a >&2
-| Linux ionos11-amd64 6.1.0-32-amd64 #1 SMP PREEMPT_DYNAMIC Debian 6.1.129-1 (2025-03-06) x86_64 GNU/Linux
-Build.sh: Building The MirBSD Korn Shell (mksh) R59 2024/07/26 on Linux 6.1.0-32-amd64...
+| Linux i-capture-the-hostname 6.12.12+bpo-amd64 #1 SMP PREEMPT_DYNAMIC Debian 6.12.12-1~bpo12+1 (2025-02-23) x86_64 GNU/Linux
+Build.sh: Building The MirBSD Korn Shell (mksh) R59 2024/07/26 on Linux 6.12.12+bpo-amd64...
 Build.sh: Scanning for functions... please ignore any errors.
 ... which compiler type seems to be used
-$ musl-gcc -E -O2 -g -Werror=implicit-function-declaration -ffile-prefix-map=/build/reproducible-path/mksh-59c=. -fstack-clash-protection -Wformat -Werror=format-security -fcf-protection -Wall -Wextra -fPIE -I. -I'../..' -Wdate-time -D_FORTIFY_SOURCE=2 -DMKSH_EARLY_LOCALE_TRACKING -DKSH_VERSIONNAME_VENDOR_EXT=\"\ +Debian\" -DMKSH_BUILDMEAT -DMKSH_BINSHPOSIX -DMKSH_BINSHREDUCED -DMKSH_BUILDSH=1 -DMKSH_LEGACY_MODE=1 -D_GNU_SOURCE -DSETUID_CAN_FAIL_WITH_EAGAIN=1   conftest.c |     sed -n '/^ *[ce]t *= */s/^ *\([ce]t\) *= */=/p' | tr -d \015 >x
+$ musl-gcc -E -O2 -g -Werror=implicit-function-declaration -ffile-prefix-map=/build/reproducible-path/mksh-59c=. -fstack-clash-protection -Wformat -Werror=format-security -fcf-protection -Wall -Wextra -fPIE -I. -I'../..' -Wdate-time -D_FORTIFY_SOURCE=2 -DMKSH_EARLY_LOCALE_TRACKING -DKSH_VERSIONNAME_VENDOR_EXT=\"\ +Debian\" -DMKSH_BUILDMEAT -DMKSH_BINSHPOSIX -DMKSH_BINSHREDUCED -DMKSH_BUILDSH=1 -DMKSH_LEGACY_MODE=1 -D_GNU_SOURCE -DSETUID_CAN_FAIL_WITH_EAGAIN=1   conftest.c |     sed -n '/^ *[ce]t *= */s/^ *\([ce]t\) *= */\1=/p' | tr -d \\015 >x
 [ ct="gcc"
 [ et="unknown"
 $ musl-gcc -O2 -g -Werror=implicit-function-declaration -ffile-prefix-map=/build/reproducible-path/mksh-59c=. -fstack-clash-protection -Wformat -Werror=format-security -fcf-protection -Wall -Wextra -fPIE  -I. -I'../..' -Wdate-time -D_FORTIFY_SOURCE=2 -DMKSH_EARLY_LOCALE_TRACKING -DKSH_VERSIONNAME_VENDOR_EXT=\"\ +Debian\" -DMKSH_BUILDMEAT -DMKSH_BINSHPOSIX -DMKSH_BINSHREDUCED -DMKSH_BUILDSH=1 -DMKSH_LEGACY_MODE=1 -D_GNU_SOURCE -DSETUID_CAN_FAIL_WITH_EAGAIN=1 -Wl,-z,relro -Wl,-z,now -Wl,--as-needed -static -static-pie -Wl,-z,text  -v conftest.c 
@@ -6417,7 +6453,7 @@
 | Supported LTO compression algorithms: zlib zstd
 | gcc version 14.2.0 (Debian 14.2.0-19) 
 | COLLECT_GCC_OPTIONS='-O2' '-g' '-Werror=implicit-function-declaration' '-ffile-prefix-map=/build/reproducible-path/mksh-59c=.' '-fstack-clash-protection' '-Wformat=1' '-Werror=format-security' '-fcf-protection=full' '-Wall' '-Wextra' '-fPIE' '-I' '.' '-I' '../..' '-Wdate-time' '-D' '_FORTIFY_SOURCE=2' '-D' 'MKSH_EARLY_LOCALE_TRACKING' '-D' 'KSH_VERSIONNAME_VENDOR_EXT=" +Debian"' '-D' 'MKSH_BUILDMEAT' '-D' 'MKSH_BINSHPOSIX' '-D' 'MKSH_BINSHREDUCED' '-D' 'MKSH_BUILDSH=1' '-D' 'MKSH_LEGACY_MODE=1' '-D' '_GNU_SOURCE' '-D' 'SETUID_CAN_FAIL_WITH_EAGAIN=1' '-static' '-static-pie' '-v' '-specs=/usr/lib/x86_64-linux-musl/musl-gcc.specs' '-mtune=generic' '-march=x86-64' '-dumpdir' 'a-'
-|  /usr/libexec/gcc/x86_64-linux-gnu/14/cc1 -quiet -v -I . -I ../.. -imultiarch x86_64-linux-gnu -D _FORTIFY_SOURCE=2 -D MKSH_EARLY_LOCALE_TRACKING -D KSH_VERSIONNAME_VENDOR_EXT=" +Debian" -D MKSH_BUILDMEAT -D MKSH_BINSHPOSIX -D MKSH_BINSHREDUCED -D MKSH_BUILDSH=1 -D MKSH_LEGACY_MODE=1 -D _GNU_SOURCE -D SETUID_CAN_FAIL_WITH_EAGAIN=1 conftest.c -nostdinc -isystem /usr/include/x86_64-linux-musl -isystem /usr/lib/gcc/x86_64-linux-gnu/14/include -quiet -dumpdir a- -dumpbase conftest.c -dumpbase-ext .c -mtune=generic -march=x86-64 -g -O2 -Werror=implicit-function-declaration -Wformat=1 -Werror=format-security -Wall -Wextra -Wdate-time -version -ffile-prefix-map=/build/reproducible-path/mksh-59c=. -fstack-clash-protection -fcf-protection=full -fPIE -fasynchronous-unwind-tables -o /tmp/cci6Rk6j.s
+|  /usr/libexec/gcc/x86_64-linux-gnu/14/cc1 -quiet -v -I . -I ../.. -imultiarch x86_64-linux-gnu -D _FORTIFY_SOURCE=2 -D MKSH_EARLY_LOCALE_TRACKING -D KSH_VERSIONNAME_VENDOR_EXT=" +Debian" -D MKSH_BUILDMEAT -D MKSH_BINSHPOSIX -D MKSH_BINSHREDUCED -D MKSH_BUILDSH=1 -D MKSH_LEGACY_MODE=1 -D _GNU_SOURCE -D SETUID_CAN_FAIL_WITH_EAGAIN=1 conftest.c -nostdinc -isystem /usr/include/x86_64-linux-musl -isystem /usr/lib/gcc/x86_64-linux-gnu/14/include -quiet -dumpdir a- -dumpbase conftest.c -dumpbase-ext .c -mtune=generic -march=x86-64 -g -O2 -Werror=implicit-function-declaration -Wformat=1 -Werror=format-security -Wall -Wextra -Wdate-time -version -ffile-prefix-map=/build/reproducible-path/mksh-59c=. -fstack-clash-protection -fcf-protection=full -fPIE -fasynchronous-unwind-tables -o /tmp/cczTCrUV.s
 | GNU C17 (Debian 14.2.0-19) version 14.2.0 (x86_64-linux-gnu)
 | 	compiled by GNU C version 14.2.0, GMP version 6.3.0, MPFR version 4.2.1, MPC version 1.3.1, isl version isl-0.27-GMP
 | 
@@ -6431,12 +6467,12 @@
 | End of search list.
 | Compiler executable checksum: 0051dfc1fa4e89ba97760da93f2546f3
 | COLLECT_GCC_OPTIONS='-O2' '-g' '-Werror=implicit-function-declaration' '-ffile-prefix-map=/build/reproducible-path/mksh-59c=.' '-fstack-clash-protection' '-Wformat=1' '-Werror=format-security' '-fcf-protection=full' '-Wall' '-Wextra' '-fPIE' '-I' '.' '-I' '../..' '-Wdate-time' '-D' '_FORTIFY_SOURCE=2' '-D' 'MKSH_EARLY_LOCALE_TRACKING' '-D' 'KSH_VERSIONNAME_VENDOR_EXT=" +Debian"' '-D' 'MKSH_BUILDMEAT' '-D' 'MKSH_BINSHPOSIX' '-D' 'MKSH_BINSHREDUCED' '-D' 'MKSH_BUILDSH=1' '-D' 'MKSH_LEGACY_MODE=1' '-D' '_GNU_SOURCE' '-D' 'SETUID_CAN_FAIL_WITH_EAGAIN=1' '-static' '-static-pie' '-v' '-specs=/usr/lib/x86_64-linux-musl/musl-gcc.specs' '-mtune=generic' '-march=x86-64' '-dumpdir' 'a-'
-|  as -v -I . -I ../.. --gdwarf-5 --64 -o /tmp/cczb3GPk.o /tmp/cci6Rk6j.s
+|  as -v -I . -I ../.. --gdwarf-5 --64 -o /tmp/ccAZZsZo.o /tmp/cczTCrUV.s
 | GNU assembler version 2.44 (x86_64-linux-gnu) using BFD version (GNU Binutils for Debian) 2.44
 | COMPILER_PATH=/usr/libexec/gcc/x86_64-linux-gnu/14/:/usr/libexec/gcc/x86_64-linux-gnu/14/:/usr/libexec/gcc/x86_64-linux-gnu/:/usr/lib/gcc/x86_64-linux-gnu/14/:/usr/lib/gcc/x86_64-linux-gnu/
 | LIBRARY_PATH=/usr/lib/gcc/x86_64-linux-gnu/14/:/usr/lib/gcc/x86_64-linux-gnu/14/../../../x86_64-linux-gnu/:/usr/lib/gcc/x86_64-linux-gnu/14/../../../../lib/:/lib/x86_64-linux-gnu/:/lib/../lib/:/usr/lib/x86_64-linux-gnu/:/usr/lib/../lib/:/usr/lib/gcc/x86_64-linux-gnu/14/../../../:/lib/:/usr/lib/
 | COLLECT_GCC_OPTIONS='-O2' '-g' '-Werror=implicit-function-declaration' '-ffile-prefix-map=/build/reproducible-path/mksh-59c=.' '-fstack-clash-protection' '-Wformat=1' '-Werror=format-security' '-fcf-protection=full' '-Wall' '-Wextra' '-fPIE' '-I' '.' '-I' '../..' '-Wdate-time' '-D' '_FORTIFY_SOURCE=2' '-D' 'MKSH_EARLY_LOCALE_TRACKING' '-D' 'KSH_VERSIONNAME_VENDOR_EXT=" +Debian"' '-D' 'MKSH_BUILDMEAT' '-D' 'MKSH_BINSHPOSIX' '-D' 'MKSH_BINSHREDUCED' '-D' 'MKSH_BUILDSH=1' '-D' 'MKSH_LEGACY_MODE=1' '-D' '_GNU_SOURCE' '-D' 'SETUID_CAN_FAIL_WITH_EAGAIN=1' '-static' '-static-pie' '-v' '-specs=/usr/lib/x86_64-linux-musl/musl-gcc.specs' '-mtune=generic' '-march=x86-64' '-dumpdir' 'a.'
-|  /usr/libexec/gcc/x86_64-linux-gnu/14/collect2 -plugin /usr/libexec/gcc/x86_64-linux-gnu/14/liblto_plugin.so -plugin-opt=/usr/libexec/gcc/x86_64-linux-gnu/14/lto-wrapper -plugin-opt=-fresolution=/tmp/cc44XQWM.res -plugin-opt=-pass-through=/usr/lib/gcc/x86_64-linux-gnu/14/libgcc.a -plugin-opt=-pass-through=/usr/lib/gcc/x86_64-linux-gnu/14/libgcc_eh.a -plugin-opt=-pass-through=-lc -dynamic-linker /lib/ld-musl-x86_64.so.1 -nostdlib -static -static -pie --no-dynamic-linker /usr/lib/x86_64-linux-musl/rcrt1.o /usr/lib/x86_64-linux-musl/crti.o /usr/lib/gcc/x86_64-linux-gnu/14/crtbeginS.o -L/usr/lib/x86_64-linux-musl -L /usr/lib/gcc/x86_64-linux-gnu/14/. -z relro -z now --as-needed -z text /tmp/cczb3GPk.o --start-group /usr/lib/gcc/x86_64-linux-gnu/14/libgcc.a /usr/lib/gcc/x86_64-linux-gnu/14/libgcc_eh.a -lc --end-group /usr/lib/gcc/x86_64-linux-gnu/14/crtendS.o /usr/lib/x86_64-linux-musl/crtn.o
+|  /usr/libexec/gcc/x86_64-linux-gnu/14/collect2 -plugin /usr/libexec/gcc/x86_64-linux-gnu/14/liblto_plugin.so -plugin-opt=/usr/libexec/gcc/x86_64-linux-gnu/14/lto-wrapper -plugin-opt=-fresolution=/tmp/ccv8OHYW.res -plugin-opt=-pass-through=/usr/lib/gcc/x86_64-linux-gnu/14/libgcc.a -plugin-opt=-pass-through=/usr/lib/gcc/x86_64-linux-gnu/14/libgcc_eh.a -plugin-opt=-pass-through=-lc -dynamic-linker /lib/ld-musl-x86_64.so.1 -nostdlib -static -static -pie --no-dynamic-linker /usr/lib/x86_64-linux-musl/rcrt1.o /usr/lib/x86_64-linux-musl/crti.o /usr/lib/gcc/x86_64-linux-gnu/14/crtbeginS.o -L/usr/lib/x86_64-linux-musl -L /usr/lib/gcc/x86_64-linux-gnu/14/. -z relro -z now --as-needed -z text /tmp/ccAZZsZo.o --start-group /usr/lib/gcc/x86_64-linux-gnu/14/libgcc.a /usr/lib/gcc/x86_64-linux-gnu/14/libgcc_eh.a -lc --end-group /usr/lib/gcc/x86_64-linux-gnu/14/crtendS.o /usr/lib/x86_64-linux-musl/crtn.o
 | COLLECT_GCC_OPTIONS='-O2' '-g' '-Werror=implicit-function-declaration' '-ffile-prefix-map=/build/reproducible-path/mksh-59c=.' '-fstack-clash-protection' '-Wformat=1' '-Werror=format-security' '-fcf-protection=full' '-Wall' '-Wextra' '-fPIE' '-I' '.' '-I' '../..' '-Wdate-time' '-D' '_FORTIFY_SOURCE=2' '-D' 'MKSH_EARLY_LOCALE_TRACKING' '-D' 'KSH_VERSIONNAME_VENDOR_EXT=" +Debian"' '-D' 'MKSH_BUILDMEAT' '-D' 'MKSH_BINSHPOSIX' '-D' 'MKSH_BINSHREDUCED' '-D' 'MKSH_BUILDSH=1' '-D' 'MKSH_LEGACY_MODE=1' '-D' '_GNU_SOURCE' '-D' 'SETUID_CAN_FAIL_WITH_EAGAIN=1' '-static' '-static-pie' '-v' '-specs=/usr/lib/x86_64-linux-musl/musl-gcc.specs' '-mtune=generic' '-march=x86-64' '-dumpdir' 'a.'
 $ eval echo "\`$CC $CFLAGS $Cg $CPPFLAGS $LDFLAGS $NOWARN $LIBS -dumpmachine\`" \
 		 "gcc\`$CC $CFLAGS $Cg $CPPFLAGS $LDFLAGS $NOWARN $LIBS -dumpversion\`"
@@ -6447,7 +6483,7 @@
 ==> if the compiler works... yes
 ... if the compiler does not fail correctly
 $ musl-gcc -O2 -g -Werror=implicit-function-declaration -ffile-prefix-map=/build/reproducible-path/mksh-59c=. -fstack-clash-protection -Wformat -Werror=format-security -fcf-protection -Wall -Wextra -fPIE  -I. -I'../..' -Wdate-time -D_FORTIFY_SOURCE=2 -DMKSH_EARLY_LOCALE_TRACKING -DKSH_VERSIONNAME_VENDOR_EXT=\"\ +Debian\" -DMKSH_BUILDMEAT -DMKSH_BINSHPOSIX -DMKSH_BINSHREDUCED -DMKSH_BUILDSH=1 -DMKSH_LEGACY_MODE=1 -D_GNU_SOURCE -DSETUID_CAN_FAIL_WITH_EAGAIN=1 -Wl,-z,relro -Wl,-z,now -Wl,--as-needed -static -static-pie -Wl,-z,text  conftest.c  || for _f in ${tcfn}*; do case $_f in lksh.1|mksh.1|mksh.faq|mksh.ico) ;; *) rm -f "$_f" ;; esac; done
-] /usr/bin/ld: /tmp/cc936ATP.o: in function `main':
+] /usr/bin/ld: /tmp/ccV7qcUY.o: in function `main':
 ] ./builddir/legacy/./builddir/legacy/conftest.c:15:(.text.startup+0xf): undefined reference to `thiswillneverbedefinedIhope'
 ] collect2: error: ld returned 1 exit status
 ==> if the compiler does not fail correctly... no
@@ -6503,7 +6539,7 @@
 ==> for __attribute__((__used__))... yes
 ... if a reduced-feature mksh is requested
 $ musl-gcc -O2 -g -Werror=implicit-function-declaration -ffile-prefix-map=/build/reproducible-path/mksh-59c=. -fstack-clash-protection -Wformat -Werror=format-security -fcf-protection -Wall -Wextra -fPIE -fno-lto -Wno-deprecated-declarations -fno-asynchronous-unwind-tables -fno-strict-aliasing -fstack-protector-strong -malign-data=abi -fwrapv  -I. -I'../..' -Wdate-time -D_FORTIFY_SOURCE=2 -DMKSH_EARLY_LOCALE_TRACKING -DKSH_VERSIONNAME_VENDOR_EXT=\"\ +Debian\" -DMKSH_BUILDMEAT -DMKSH_BINSHPOSIX -DMKSH_BINSHREDUCED -DMKSH_BUILDSH=1 -DMKSH_LEGACY_MODE=1 -D_GNU_SOURCE -DSETUID_CAN_FAIL_WITH_EAGAIN=1 -DHAVE_STRING_POOLING=2 -DHAVE_ATTRIBUTE_BOUNDED=0 -DHAVE_ATTRIBUTE_FORMAT=1 -DHAVE_ATTRIBUTE_NORETURN=1 -DHAVE_ATTRIBUTE_UNUSED=1 -DHAVE_ATTRIBUTE_USED=1 -Wl,-z,relro -Wl,-z,now -Wl,--as-needed -static -static-pie -Wl,-z,text -fno-lto -Wno-error conftest.c  || for _f in ${tcfn}*; do case $_f in lksh.1|mksh.1|mksh.faq|mksh.ico) ;; *) rm -f "$_f" ;; esac; done
-] /usr/bin/ld: /tmp/ccdXGLDU.o: in function `main':
+] /usr/bin/ld: /tmp/ccruWU1s.o: in function `main':
 ] ./builddir/legacy/./builddir/legacy/conftest.c:15:(.text.startup+0xf): undefined reference to `thiswillneverbedefinedIhope'
 ] collect2: error: ld returned 1 exit status
 ==> if a reduced-feature mksh is requested... no
@@ -6512,26 +6548,26 @@
 ==> if invoking as sh should be handled specially... yes
 ... if mksh will be built without job control
 $ musl-gcc -O2 -g -Werror=implicit-function-declaration -ffile-prefix-map=/build/reproducible-path/mksh-59c=. -fstack-clash-protection -Wformat -Werror=format-security -fcf-protection -Wall -Wextra -fPIE -fno-lto -Wno-deprecated-declarations -fno-asynchronous-unwind-tables -fno-strict-aliasing -fstack-protector-strong -malign-data=abi -fwrapv  -I. -I'../..' -Wdate-time -D_FORTIFY_SOURCE=2 -DMKSH_EARLY_LOCALE_TRACKING -DKSH_VERSIONNAME_VENDOR_EXT=\"\ +Debian\" -DMKSH_BUILDMEAT -DMKSH_BINSHPOSIX -DMKSH_BINSHREDUCED -DMKSH_BUILDSH=1 -DMKSH_LEGACY_MODE=1 -D_GNU_SOURCE -DSETUID_CAN_FAIL_WITH_EAGAIN=1 -DHAVE_STRING_POOLING=2 -DHAVE_ATTRIBUTE_BOUNDED=0 -DHAVE_ATTRIBUTE_FORMAT=1 -DHAVE_ATTRIBUTE_NORETURN=1 -DHAVE_ATTRIBUTE_UNUSED=1 -DHAVE_ATTRIBUTE_USED=1 -Wl,-z,relro -Wl,-z,now -Wl,--as-needed -static -static-pie -Wl,-z,text -fno-lto -Wno-error conftest.c  || for _f in ${tcfn}*; do case $_f in lksh.1|mksh.1|mksh.faq|mksh.ico) ;; *) rm -f "$_f" ;; esac; done
-] /usr/bin/ld: /tmp/ccx2xqSB.o: in function `main':
+] /usr/bin/ld: /tmp/cc6xPIep.o: in function `main':
 ] ./builddir/legacy/./builddir/legacy/conftest.c:15:(.text.startup+0xf): undefined reference to `thiswillneverbedefinedIhope'
 ] collect2: error: ld returned 1 exit status
 ==> if mksh will be built without job control... no
 ... if mksh will be built without job signals
 $ musl-gcc -O2 -g -Werror=implicit-function-declaration -ffile-prefix-map=/build/reproducible-path/mksh-59c=. -fstack-clash-protection -Wformat -Werror=format-security -fcf-protection -Wall -Wextra -fPIE -fno-lto -Wno-deprecated-declarations -fno-asynchronous-unwind-tables -fno-strict-aliasing -fstack-protector-strong -malign-data=abi -fwrapv  -I. -I'../..' -Wdate-time -D_FORTIFY_SOURCE=2 -DMKSH_EARLY_LOCALE_TRACKING -DKSH_VERSIONNAME_VENDOR_EXT=\"\ +Debian\" -DMKSH_BUILDMEAT -DMKSH_BINSHPOSIX -DMKSH_BINSHREDUCED -DMKSH_BUILDSH=1 -DMKSH_LEGACY_MODE=1 -D_GNU_SOURCE -DSETUID_CAN_FAIL_WITH_EAGAIN=1 -DHAVE_STRING_POOLING=2 -DHAVE_ATTRIBUTE_BOUNDED=0 -DHAVE_ATTRIBUTE_FORMAT=1 -DHAVE_ATTRIBUTE_NORETURN=1 -DHAVE_ATTRIBUTE_UNUSED=1 -DHAVE_ATTRIBUTE_USED=1 -Wl,-z,relro -Wl,-z,now -Wl,--as-needed -static -static-pie -Wl,-z,text -fno-lto -Wno-error conftest.c  || for _f in ${tcfn}*; do case $_f in lksh.1|mksh.1|mksh.faq|mksh.ico) ;; *) rm -f "$_f" ;; esac; done
-] /usr/bin/ld: /tmp/cc5qORQF.o: in function `main':
+] /usr/bin/ld: /tmp/ccoTDmPM.o: in function `main':
 ] ./builddir/legacy/./builddir/legacy/conftest.c:15:(.text.startup+0xf): undefined reference to `thiswillneverbedefinedIhope'
 ] collect2: error: ld returned 1 exit status
 ==> if mksh will be built without job signals... no
 ... if the default UTF-8 mode is specified
 $ musl-gcc -O2 -g -Werror=implicit-function-declaration -ffile-prefix-map=/build/reproducible-path/mksh-59c=. -fstack-clash-protection -Wformat -Werror=format-security -fcf-protection -Wall -Wextra -fPIE -fno-lto -Wno-deprecated-declarations -fno-asynchronous-unwind-tables -fno-strict-aliasing -fstack-protector-strong -malign-data=abi -fwrapv  -I. -I'../..' -Wdate-time -D_FORTIFY_SOURCE=2 -DMKSH_EARLY_LOCALE_TRACKING -DKSH_VERSIONNAME_VENDOR_EXT=\"\ +Debian\" -DMKSH_BUILDMEAT -DMKSH_BINSHPOSIX -DMKSH_BINSHREDUCED -DMKSH_BUILDSH=1 -DMKSH_LEGACY_MODE=1 -D_GNU_SOURCE -DSETUID_CAN_FAIL_WITH_EAGAIN=1 -DHAVE_STRING_POOLING=2 -DHAVE_ATTRIBUTE_BOUNDED=0 -DHAVE_ATTRIBUTE_FORMAT=1 -DHAVE_ATTRIBUTE_NORETURN=1 -DHAVE_ATTRIBUTE_UNUSED=1 -DHAVE_ATTRIBUTE_USED=1 -Wl,-z,relro -Wl,-z,now -Wl,--as-needed -static -static-pie -Wl,-z,text -fno-lto -Wno-error conftest.c  || for _f in ${tcfn}*; do case $_f in lksh.1|mksh.1|mksh.faq|mksh.ico) ;; *) rm -f "$_f" ;; esac; done
-] /usr/bin/ld: /tmp/ccBhIs3R.o: in function `main':
+] /usr/bin/ld: /tmp/ccSZMD2U.o: in function `main':
 ] ./builddir/legacy/./builddir/legacy/conftest.c:15:(.text.startup+0xf): undefined reference to `thiswillneverbedefinedIhope'
 ] collect2: error: ld returned 1 exit status
 ==> if the default UTF-8 mode is specified... no
 ==> if the default UTF-8 mode is disabled... no (implied)
 ... if the MidnightBSD 0.1 ash compatibility mode is requested
 $ musl-gcc -O2 -g -Werror=implicit-function-declaration -ffile-prefix-map=/build/reproducible-path/mksh-59c=. -fstack-clash-protection -Wformat -Werror=format-security -fcf-protection -Wall -Wextra -fPIE -fno-lto -Wno-deprecated-declarations -fno-asynchronous-unwind-tables -fno-strict-aliasing -fstack-protector-strong -malign-data=abi -fwrapv  -I. -I'../..' -Wdate-time -D_FORTIFY_SOURCE=2 -DMKSH_EARLY_LOCALE_TRACKING -DKSH_VERSIONNAME_VENDOR_EXT=\"\ +Debian\" -DMKSH_BUILDMEAT -DMKSH_BINSHPOSIX -DMKSH_BINSHREDUCED -DMKSH_BUILDSH=1 -DMKSH_LEGACY_MODE=1 -D_GNU_SOURCE -DSETUID_CAN_FAIL_WITH_EAGAIN=1 -DHAVE_STRING_POOLING=2 -DHAVE_ATTRIBUTE_BOUNDED=0 -DHAVE_ATTRIBUTE_FORMAT=1 -DHAVE_ATTRIBUTE_NORETURN=1 -DHAVE_ATTRIBUTE_UNUSED=1 -DHAVE_ATTRIBUTE_USED=1 -Wl,-z,relro -Wl,-z,now -Wl,--as-needed -static -static-pie -Wl,-z,text -fno-lto -Wno-error conftest.c  || for _f in ${tcfn}*; do case $_f in lksh.1|mksh.1|mksh.faq|mksh.ico) ;; *) rm -f "$_f" ;; esac; done
-] /usr/bin/ld: /tmp/ccoFF3YR.o: in function `main':
+] /usr/bin/ld: /tmp/cc2UA80v.o: in function `main':
 ] ./builddir/legacy/./builddir/legacy/conftest.c:15:(.text.startup+0xf): undefined reference to `thiswillneverbedefinedIhope'
 ] collect2: error: ld returned 1 exit status
 ==> if the MidnightBSD 0.1 ash compatibility mode is requested... no
@@ -6689,14 +6725,14 @@
 ==> if the final link command may succeed... yes
 ... GNU strerrordesc_np()
 $ musl-gcc -O2 -g -Werror=implicit-function-declaration -ffile-prefix-map=/build/reproducible-path/mksh-59c=. -fstack-clash-protection -Wformat -Werror=format-security -fcf-protection -Wall -Wextra -fPIE -fno-lto -Wno-deprecated-declarations -fno-asynchronous-unwind-tables -fno-strict-aliasing -fstack-protector-strong -malign-data=abi -fwrapv  -I. -I'../..' -Wdate-time -D_FORTIFY_SOURCE=2 -DMKSH_EARLY_LOCALE_TRACKING -DKSH_VERSIONNAME_VENDOR_EXT=\"\ +Debian\" -DMKSH_BUILDMEAT -DMKSH_BINSHPOSIX -DMKSH_BINSHREDUCED -DMKSH_BUILDSH=1 -DMKSH_LEGACY_MODE=1 -D_GNU_SOURCE -DSETUID_CAN_FAIL_WITH_EAGAIN=1 -DHAVE_STRING_POOLING=2 -DHAVE_ATTRIBUTE_BOUNDED=0 -DHAVE_ATTRIBUTE_FORMAT=1 -DHAVE_ATTRIBUTE_NORETURN=1 -DHAVE_ATTRIBUTE_UNUSED=1 -DHAVE_ATTRIBUTE_USED=1 -DHAVE_SYS_TIME_H=1 -DHAVE_TIME_H=1 -DHAVE_BOTH_TIME_H=1 -DHAVE_SYS_SELECT_H=1 -DHAVE_SELECT_TIME_H=1 -DHAVE_SYS_BSDTYPES_H=0 -DHAVE_SYS_FILE_H=1 -DHAVE_SYS_MKDEV_H=0 -DHAVE_SYS_MMAN_H=1 -DHAVE_SYS_PARAM_H=1 -DHAVE_SYS_PTEM_H=0 -DHAVE_SYS_RESOURCE_H=1 -DHAVE_SYS_SYSMACROS_H=1 -DHAVE_BSTRING_H=0 -DHAVE_GRP_H=1 -DHAVE_IO_H=0 -DHAVE_LIBGEN_H=1 -DHAVE_LIBUTIL_H=0 -DHAVE_PATHS_H=1 -DHAVE_STDINT_H=1 -DHAVE_STRINGS_H=1 -DHAVE_TERMIOS_H=1 -DHAVE_ULIMIT_H=1 -DHAVE_CAN_INTTYPES=1 -DHAVE_SIG_T=1 -Wl,-z,relro -Wl,-z,now -Wl,--as-needed -static -static-pie -Wl,-z,text -fno-lto -Wno-error conftest.c  || for _f in ${tcfn}*; do case $_f in lksh.1|mksh.1|mksh.faq|mksh.ico) ;; *) rm -f "$_f" ;; esac; done
-] /usr/bin/ld: /tmp/cc8SBUEA.o: in function `main':
+] /usr/bin/ld: /tmp/ccD4GPPQ.o: in function `main':
 ] ./builddir/legacy/./builddir/legacy/conftest.c:9:(.text.startup+0x13): undefined reference to `strerrordesc_np'
 ] collect2: error: ld returned 1 exit status
 ==> GNU strerrordesc_np()... no
 ... the sys_errlist[] array and sys_nerr
 $ musl-gcc -O2 -g -Werror=implicit-function-declaration -ffile-prefix-map=/build/reproducible-path/mksh-59c=. -fstack-clash-protection -Wformat -Werror=format-security -fcf-protection -Wall -Wextra -fPIE -fno-lto -Wno-deprecated-declarations -fno-asynchronous-unwind-tables -fno-strict-aliasing -fstack-protector-strong -malign-data=abi -fwrapv  -I. -I'../..' -Wdate-time -D_FORTIFY_SOURCE=2 -DMKSH_EARLY_LOCALE_TRACKING -DKSH_VERSIONNAME_VENDOR_EXT=\"\ +Debian\" -DMKSH_BUILDMEAT -DMKSH_BINSHPOSIX -DMKSH_BINSHREDUCED -DMKSH_BUILDSH=1 -DMKSH_LEGACY_MODE=1 -D_GNU_SOURCE -DSETUID_CAN_FAIL_WITH_EAGAIN=1 -DHAVE_STRING_POOLING=2 -DHAVE_ATTRIBUTE_BOUNDED=0 -DHAVE_ATTRIBUTE_FORMAT=1 -DHAVE_ATTRIBUTE_NORETURN=1 -DHAVE_ATTRIBUTE_UNUSED=1 -DHAVE_ATTRIBUTE_USED=1 -DHAVE_SYS_TIME_H=1 -DHAVE_TIME_H=1 -DHAVE_BOTH_TIME_H=1 -DHAVE_SYS_SELECT_H=1 -DHAVE_SELECT_TIME_H=1 -DHAVE_SYS_BSDTYPES_H=0 -DHAVE_SYS_FILE_H=1 -DHAVE_SYS_MKDEV_H=0 -DHAVE_SYS_MMAN_H=1 -DHAVE_SYS_PARAM_H=1 -DHAVE_SYS_PTEM_H=0 -DHAVE_SYS_RESOURCE_H=1 -DHAVE_SYS_SYSMACROS_H=1 -DHAVE_BSTRING_H=0 -DHAVE_GRP_H=1 -DHAVE_IO_H=0 -DHAVE_LIBGEN_H=1 -DHAVE_LIBUTIL_H=0 -DHAVE_PATHS_H=1 -DHAVE_STDINT_H=1 -DHAVE_STRINGS_H=1 -DHAVE_TERMIOS_H=1 -DHAVE_ULIMIT_H=1 -DHAVE_CAN_INTTYPES=1 -DHAVE_SIG_T=1 -DHAVE_STRERRORDESC_NP=0 -Wl,-z,relro -Wl,-z,now -Wl,--as-needed -static -static-pie -Wl,-z,text -fno-lto -Wno-error conftest.c  || for _f in ${tcfn}*; do case $_f in lksh.1|mksh.1|mksh.faq|mksh.ico) ;; *) rm -f "$_f" ;; esac; done
-] /usr/bin/ld: /tmp/ccglqtM2.o: warning: relocation against `sys_nerr' in read-only section `.text.startup'
-] /usr/bin/ld: /tmp/ccglqtM2.o: in function `main':
+] /usr/bin/ld: /tmp/ccBir6j4.o: warning: relocation against `sys_nerr' in read-only section `.text.startup'
+] /usr/bin/ld: /tmp/ccBir6j4.o: in function `main':
 ] ./builddir/legacy/./builddir/legacy/conftest.c:11:(.text.startup+0x6): undefined reference to `sys_nerr'
 ] /usr/bin/ld: ./builddir/legacy/./builddir/legacy/conftest.c:11:(.text.startup+0xd): undefined reference to `sys_errlist'
 ] /usr/bin/ld: read-only segment has dynamic relocations
@@ -6704,8 +6740,8 @@
 ==> the sys_errlist[] array and sys_nerr... no
 ... the _sys_errlist[] array and _sys_nerr
 $ musl-gcc -O2 -g -Werror=implicit-function-declaration -ffile-prefix-map=/build/reproducible-path/mksh-59c=. -fstack-clash-protection -Wformat -Werror=format-security -fcf-protection -Wall -Wextra -fPIE -fno-lto -Wno-deprecated-declarations -fno-asynchronous-unwind-tables -fno-strict-aliasing -fstack-protector-strong -malign-data=abi -fwrapv  -I. -I'../..' -Wdate-time -D_FORTIFY_SOURCE=2 -DMKSH_EARLY_LOCALE_TRACKING -DKSH_VERSIONNAME_VENDOR_EXT=\"\ +Debian\" -DMKSH_BUILDMEAT -DMKSH_BINSHPOSIX -DMKSH_BINSHREDUCED -DMKSH_BUILDSH=1 -DMKSH_LEGACY_MODE=1 -D_GNU_SOURCE -DSETUID_CAN_FAIL_WITH_EAGAIN=1 -DHAVE_STRING_POOLING=2 -DHAVE_ATTRIBUTE_BOUNDED=0 -DHAVE_ATTRIBUTE_FORMAT=1 -DHAVE_ATTRIBUTE_NORETURN=1 -DHAVE_ATTRIBUTE_UNUSED=1 -DHAVE_ATTRIBUTE_USED=1 -DHAVE_SYS_TIME_H=1 -DHAVE_TIME_H=1 -DHAVE_BOTH_TIME_H=1 -DHAVE_SYS_SELECT_H=1 -DHAVE_SELECT_TIME_H=1 -DHAVE_SYS_BSDTYPES_H=0 -DHAVE_SYS_FILE_H=1 -DHAVE_SYS_MKDEV_H=0 -DHAVE_SYS_MMAN_H=1 -DHAVE_SYS_PARAM_H=1 -DHAVE_SYS_PTEM_H=0 -DHAVE_SYS_RESOURCE_H=1 -DHAVE_SYS_SYSMACROS_H=1 -DHAVE_BSTRING_H=0 -DHAVE_GRP_H=1 -DHAVE_IO_H=0 -DHAVE_LIBGEN_H=1 -DHAVE_LIBUTIL_H=0 -DHAVE_PATHS_H=1 -DHAVE_STDINT_H=1 -DHAVE_STRINGS_H=1 -DHAVE_TERMIOS_H=1 -DHAVE_ULIMIT_H=1 -DHAVE_CAN_INTTYPES=1 -DHAVE_SIG_T=1 -DHAVE_STRERRORDESC_NP=0 -Wl,-z,relro -Wl,-z,now -Wl,--as-needed -static -static-pie -Wl,-z,text -fno-lto -Wno-error conftest.c  || for _f in ${tcfn}*; do case $_f in lksh.1|mksh.1|mksh.faq|mksh.ico) ;; *) rm -f "$_f" ;; esac; done
-] /usr/bin/ld: /tmp/cc5PiaaC.o: warning: relocation against `_sys_nerr' in read-only section `.text.startup'
-] /usr/bin/ld: /tmp/cc5PiaaC.o: in function `main':
+] /usr/bin/ld: /tmp/ccPc75cz.o: warning: relocation against `_sys_nerr' in read-only section `.text.startup'
+] /usr/bin/ld: /tmp/ccPc75cz.o: in function `main':
 ] ./builddir/legacy/./builddir/legacy/conftest.c:11:(.text.startup+0x6): undefined reference to `_sys_nerr'
 ] /usr/bin/ld: ./builddir/legacy/./builddir/legacy/conftest.c:11:(.text.startup+0xd): undefined reference to `_sys_errlist'
 ] /usr/bin/ld: read-only segment has dynamic relocations
@@ -6713,44 +6749,44 @@
 ==> the _sys_errlist[] array and _sys_nerr... no
 ... GNU sigabbrev_np()
 $ musl-gcc -O2 -g -Werror=implicit-function-declaration -ffile-prefix-map=/build/reproducible-path/mksh-59c=. -fstack-clash-protection -Wformat -Werror=format-security -fcf-protection -Wall -Wextra -fPIE -fno-lto -Wno-deprecated-declarations -fno-asynchronous-unwind-tables -fno-strict-aliasing -fstack-protector-strong -malign-data=abi -fwrapv  -I. -I'../..' -Wdate-time -D_FORTIFY_SOURCE=2 -DMKSH_EARLY_LOCALE_TRACKING -DKSH_VERSIONNAME_VENDOR_EXT=\"\ +Debian\" -DMKSH_BUILDMEAT -DMKSH_BINSHPOSIX -DMKSH_BINSHREDUCED -DMKSH_BUILDSH=1 -DMKSH_LEGACY_MODE=1 -D_GNU_SOURCE -DSETUID_CAN_FAIL_WITH_EAGAIN=1 -DHAVE_STRING_POOLING=2 -DHAVE_ATTRIBUTE_BOUNDED=0 -DHAVE_ATTRIBUTE_FORMAT=1 -DHAVE_ATTRIBUTE_NORETURN=1 -DHAVE_ATTRIBUTE_UNUSED=1 -DHAVE_ATTRIBUTE_USED=1 -DHAVE_SYS_TIME_H=1 -DHAVE_TIME_H=1 -DHAVE_BOTH_TIME_H=1 -DHAVE_SYS_SELECT_H=1 -DHAVE_SELECT_TIME_H=1 -DHAVE_SYS_BSDTYPES_H=0 -DHAVE_SYS_FILE_H=1 -DHAVE_SYS_MKDEV_H=0 -DHAVE_SYS_MMAN_H=1 -DHAVE_SYS_PARAM_H=1 -DHAVE_SYS_PTEM_H=0 -DHAVE_SYS_RESOURCE_H=1 -DHAVE_SYS_SYSMACROS_H=1 -DHAVE_BSTRING_H=0 -DHAVE_GRP_H=1 -DHAVE_IO_H=0 -DHAVE_LIBGEN_H=1 -DHAVE_LIBUTIL_H=0 -DHAVE_PATHS_H=1 -DHAVE_STDINT_H=1 -DHAVE_STRINGS_H=1 -DHAVE_TERMIOS_H=1 -DHAVE_ULIMIT_H=1 -DHAVE_CAN_INTTYPES=1 -DHAVE_SIG_T=1 -DHAVE_STRERRORDESC_NP=0 -DHAVE_SYS_ERRLIST=0 -Wl,-z,relro -Wl,-z,now -Wl,--as-needed -static -static-pie -Wl,-z,text -fno-lto -Wno-error conftest.c  || for _f in ${tcfn}*; do case $_f in lksh.1|mksh.1|mksh.faq|mksh.ico) ;; *) rm -f "$_f" ;; esac; done
-] /usr/bin/ld: /tmp/ccks7dSP.o: in function `main':
+] /usr/bin/ld: /tmp/ccdpm9dw.o: in function `main':
 ] ./builddir/legacy/./builddir/legacy/conftest.c:9:(.text.startup+0x13): undefined reference to `sigabbrev_np'
 ] collect2: error: ld returned 1 exit status
 ==> GNU sigabbrev_np()... no
 ... the sys_signame[] array
 $ musl-gcc -O2 -g -Werror=implicit-function-declaration -ffile-prefix-map=/build/reproducible-path/mksh-59c=. -fstack-clash-protection -Wformat -Werror=format-security -fcf-protection -Wall -Wextra -fPIE -fno-lto -Wno-deprecated-declarations -fno-asynchronous-unwind-tables -fno-strict-aliasing -fstack-protector-strong -malign-data=abi -fwrapv  -I. -I'../..' -Wdate-time -D_FORTIFY_SOURCE=2 -DMKSH_EARLY_LOCALE_TRACKING -DKSH_VERSIONNAME_VENDOR_EXT=\"\ +Debian\" -DMKSH_BUILDMEAT -DMKSH_BINSHPOSIX -DMKSH_BINSHREDUCED -DMKSH_BUILDSH=1 -DMKSH_LEGACY_MODE=1 -D_GNU_SOURCE -DSETUID_CAN_FAIL_WITH_EAGAIN=1 -DHAVE_STRING_POOLING=2 -DHAVE_ATTRIBUTE_BOUNDED=0 -DHAVE_ATTRIBUTE_FORMAT=1 -DHAVE_ATTRIBUTE_NORETURN=1 -DHAVE_ATTRIBUTE_UNUSED=1 -DHAVE_ATTRIBUTE_USED=1 -DHAVE_SYS_TIME_H=1 -DHAVE_TIME_H=1 -DHAVE_BOTH_TIME_H=1 -DHAVE_SYS_SELECT_H=1 -DHAVE_SELECT_TIME_H=1 -DHAVE_SYS_BSDTYPES_H=0 -DHAVE_SYS_FILE_H=1 -DHAVE_SYS_MKDEV_H=0 -DHAVE_SYS_MMAN_H=1 -DHAVE_SYS_PARAM_H=1 -DHAVE_SYS_PTEM_H=0 -DHAVE_SYS_RESOURCE_H=1 -DHAVE_SYS_SYSMACROS_H=1 -DHAVE_BSTRING_H=0 -DHAVE_GRP_H=1 -DHAVE_IO_H=0 -DHAVE_LIBGEN_H=1 -DHAVE_LIBUTIL_H=0 -DHAVE_PATHS_H=1 -DHAVE_STDINT_H=1 -DHAVE_STRINGS_H=1 -DHAVE_TERMIOS_H=1 -DHAVE_ULIMIT_H=1 -DHAVE_CAN_INTTYPES=1 -DHAVE_SIG_T=1 -DHAVE_STRERRORDESC_NP=0 -DHAVE_SYS_ERRLIST=0 -DHAVE_SIGABBREV_NP=0 -Wl,-z,relro -Wl,-z,now -Wl,--as-needed -static -static-pie -Wl,-z,text -fno-lto -Wno-error conftest.c  || for _f in ${tcfn}*; do case $_f in lksh.1|mksh.1|mksh.faq|mksh.ico) ;; *) rm -f "$_f" ;; esac; done
-] /usr/bin/ld: /tmp/ccHPKLwA.o: warning: relocation against `sys_signame' in read-only section `.text.startup'
-] /usr/bin/ld: /tmp/ccHPKLwA.o: in function `main':
+] /usr/bin/ld: /tmp/ccmfXVVt.o: warning: relocation against `sys_signame' in read-only section `.text.startup'
+] /usr/bin/ld: /tmp/ccmfXVVt.o: in function `main':
 ] ./builddir/legacy/./builddir/legacy/conftest.c:10:(.text.startup+0x8): undefined reference to `sys_signame'
 ] /usr/bin/ld: read-only segment has dynamic relocations
 ] collect2: error: ld returned 1 exit status
 ==> the sys_signame[] array... no
 ... the _sys_signame[] array
 $ musl-gcc -O2 -g -Werror=implicit-function-declaration -ffile-prefix-map=/build/reproducible-path/mksh-59c=. -fstack-clash-protection -Wformat -Werror=format-security -fcf-protection -Wall -Wextra -fPIE -fno-lto -Wno-deprecated-declarations -fno-asynchronous-unwind-tables -fno-strict-aliasing -fstack-protector-strong -malign-data=abi -fwrapv  -I. -I'../..' -Wdate-time -D_FORTIFY_SOURCE=2 -DMKSH_EARLY_LOCALE_TRACKING -DKSH_VERSIONNAME_VENDOR_EXT=\"\ +Debian\" -DMKSH_BUILDMEAT -DMKSH_BINSHPOSIX -DMKSH_BINSHREDUCED -DMKSH_BUILDSH=1 -DMKSH_LEGACY_MODE=1 -D_GNU_SOURCE -DSETUID_CAN_FAIL_WITH_EAGAIN=1 -DHAVE_STRING_POOLING=2 -DHAVE_ATTRIBUTE_BOUNDED=0 -DHAVE_ATTRIBUTE_FORMAT=1 -DHAVE_ATTRIBUTE_NORETURN=1 -DHAVE_ATTRIBUTE_UNUSED=1 -DHAVE_ATTRIBUTE_USED=1 -DHAVE_SYS_TIME_H=1 -DHAVE_TIME_H=1 -DHAVE_BOTH_TIME_H=1 -DHAVE_SYS_SELECT_H=1 -DHAVE_SELECT_TIME_H=1 -DHAVE_SYS_BSDTYPES_H=0 -DHAVE_SYS_FILE_H=1 -DHAVE_SYS_MKDEV_H=0 -DHAVE_SYS_MMAN_H=1 -DHAVE_SYS_PARAM_H=1 -DHAVE_SYS_PTEM_H=0 -DHAVE_SYS_RESOURCE_H=1 -DHAVE_SYS_SYSMACROS_H=1 -DHAVE_BSTRING_H=0 -DHAVE_GRP_H=1 -DHAVE_IO_H=0 -DHAVE_LIBGEN_H=1 -DHAVE_LIBUTIL_H=0 -DHAVE_PATHS_H=1 -DHAVE_STDINT_H=1 -DHAVE_STRINGS_H=1 -DHAVE_TERMIOS_H=1 -DHAVE_ULIMIT_H=1 -DHAVE_CAN_INTTYPES=1 -DHAVE_SIG_T=1 -DHAVE_STRERRORDESC_NP=0 -DHAVE_SYS_ERRLIST=0 -DHAVE_SIGABBREV_NP=0 -Wl,-z,relro -Wl,-z,now -Wl,--as-needed -static -static-pie -Wl,-z,text -fno-lto -Wno-error conftest.c  || for _f in ${tcfn}*; do case $_f in lksh.1|mksh.1|mksh.faq|mksh.ico) ;; *) rm -f "$_f" ;; esac; done
-] /usr/bin/ld: /tmp/cca1XIO6.o: warning: relocation against `_sys_signame' in read-only section `.text.startup'
-] /usr/bin/ld: /tmp/cca1XIO6.o: in function `main':
+] /usr/bin/ld: /tmp/ccWrWGUu.o: warning: relocation against `_sys_signame' in read-only section `.text.startup'
+] /usr/bin/ld: /tmp/ccWrWGUu.o: in function `main':
 ] ./builddir/legacy/./builddir/legacy/conftest.c:10:(.text.startup+0x8): undefined reference to `_sys_signame'
 ] /usr/bin/ld: read-only segment has dynamic relocations
 ] collect2: error: ld returned 1 exit status
 ==> the _sys_signame[] array... no
 ... GNU sigdescr_np()
 $ musl-gcc -O2 -g -Werror=implicit-function-declaration -ffile-prefix-map=/build/reproducible-path/mksh-59c=. -fstack-clash-protection -Wformat -Werror=format-security -fcf-protection -Wall -Wextra -fPIE -fno-lto -Wno-deprecated-declarations -fno-asynchronous-unwind-tables -fno-strict-aliasing -fstack-protector-strong -malign-data=abi -fwrapv  -I. -I'../..' -Wdate-time -D_FORTIFY_SOURCE=2 -DMKSH_EARLY_LOCALE_TRACKING -DKSH_VERSIONNAME_VENDOR_EXT=\"\ +Debian\" -DMKSH_BUILDMEAT -DMKSH_BINSHPOSIX -DMKSH_BINSHREDUCED -DMKSH_BUILDSH=1 -DMKSH_LEGACY_MODE=1 -D_GNU_SOURCE -DSETUID_CAN_FAIL_WITH_EAGAIN=1 -DHAVE_STRING_POOLING=2 -DHAVE_ATTRIBUTE_BOUNDED=0 -DHAVE_ATTRIBUTE_FORMAT=1 -DHAVE_ATTRIBUTE_NORETURN=1 -DHAVE_ATTRIBUTE_UNUSED=1 -DHAVE_ATTRIBUTE_USED=1 -DHAVE_SYS_TIME_H=1 -DHAVE_TIME_H=1 -DHAVE_BOTH_TIME_H=1 -DHAVE_SYS_SELECT_H=1 -DHAVE_SELECT_TIME_H=1 -DHAVE_SYS_BSDTYPES_H=0 -DHAVE_SYS_FILE_H=1 -DHAVE_SYS_MKDEV_H=0 -DHAVE_SYS_MMAN_H=1 -DHAVE_SYS_PARAM_H=1 -DHAVE_SYS_PTEM_H=0 -DHAVE_SYS_RESOURCE_H=1 -DHAVE_SYS_SYSMACROS_H=1 -DHAVE_BSTRING_H=0 -DHAVE_GRP_H=1 -DHAVE_IO_H=0 -DHAVE_LIBGEN_H=1 -DHAVE_LIBUTIL_H=0 -DHAVE_PATHS_H=1 -DHAVE_STDINT_H=1 -DHAVE_STRINGS_H=1 -DHAVE_TERMIOS_H=1 -DHAVE_ULIMIT_H=1 -DHAVE_CAN_INTTYPES=1 -DHAVE_SIG_T=1 -DHAVE_STRERRORDESC_NP=0 -DHAVE_SYS_ERRLIST=0 -DHAVE_SIGABBREV_NP=0 -DHAVE_SYS_SIGNAME=0 -Wl,-z,relro -Wl,-z,now -Wl,--as-needed -static -static-pie -Wl,-z,text -fno-lto -Wno-error conftest.c  || for _f in ${tcfn}*; do case $_f in lksh.1|mksh.1|mksh.faq|mksh.ico) ;; *) rm -f "$_f" ;; esac; done
-] /usr/bin/ld: /tmp/ccAd8p1s.o: in function `main':
+] /usr/bin/ld: /tmp/cckBcgjO.o: in function `main':
 ] ./builddir/legacy/./builddir/legacy/conftest.c:9:(.text.startup+0x13): undefined reference to `sigdescr_np'
 ] collect2: error: ld returned 1 exit status
 ==> GNU sigdescr_np()... no
 ... the sys_siglist[] array
 $ musl-gcc -O2 -g -Werror=implicit-function-declaration -ffile-prefix-map=/build/reproducible-path/mksh-59c=. -fstack-clash-protection -Wformat -Werror=format-security -fcf-protection -Wall -Wextra -fPIE -fno-lto -Wno-deprecated-declarations -fno-asynchronous-unwind-tables -fno-strict-aliasing -fstack-protector-strong -malign-data=abi -fwrapv  -I. -I'../..' -Wdate-time -D_FORTIFY_SOURCE=2 -DMKSH_EARLY_LOCALE_TRACKING -DKSH_VERSIONNAME_VENDOR_EXT=\"\ +Debian\" -DMKSH_BUILDMEAT -DMKSH_BINSHPOSIX -DMKSH_BINSHREDUCED -DMKSH_BUILDSH=1 -DMKSH_LEGACY_MODE=1 -D_GNU_SOURCE -DSETUID_CAN_FAIL_WITH_EAGAIN=1 -DHAVE_STRING_POOLING=2 -DHAVE_ATTRIBUTE_BOUNDED=0 -DHAVE_ATTRIBUTE_FORMAT=1 -DHAVE_ATTRIBUTE_NORETURN=1 -DHAVE_ATTRIBUTE_UNUSED=1 -DHAVE_ATTRIBUTE_USED=1 -DHAVE_SYS_TIME_H=1 -DHAVE_TIME_H=1 -DHAVE_BOTH_TIME_H=1 -DHAVE_SYS_SELECT_H=1 -DHAVE_SELECT_TIME_H=1 -DHAVE_SYS_BSDTYPES_H=0 -DHAVE_SYS_FILE_H=1 -DHAVE_SYS_MKDEV_H=0 -DHAVE_SYS_MMAN_H=1 -DHAVE_SYS_PARAM_H=1 -DHAVE_SYS_PTEM_H=0 -DHAVE_SYS_RESOURCE_H=1 -DHAVE_SYS_SYSMACROS_H=1 -DHAVE_BSTRING_H=0 -DHAVE_GRP_H=1 -DHAVE_IO_H=0 -DHAVE_LIBGEN_H=1 -DHAVE_LIBUTIL_H=0 -DHAVE_PATHS_H=1 -DHAVE_STDINT_H=1 -DHAVE_STRINGS_H=1 -DHAVE_TERMIOS_H=1 -DHAVE_ULIMIT_H=1 -DHAVE_CAN_INTTYPES=1 -DHAVE_SIG_T=1 -DHAVE_STRERRORDESC_NP=0 -DHAVE_SYS_ERRLIST=0 -DHAVE_SIGABBREV_NP=0 -DHAVE_SYS_SIGNAME=0 -DHAVE_SIGDESCR_NP=0 -Wl,-z,relro -Wl,-z,now -Wl,--as-needed -static -static-pie -Wl,-z,text -fno-lto -Wno-error conftest.c  || for _f in ${tcfn}*; do case $_f in lksh.1|mksh.1|mksh.faq|mksh.ico) ;; *) rm -f "$_f" ;; esac; done
-] /usr/bin/ld: /tmp/ccgB3vA5.o: warning: relocation against `sys_siglist' in read-only section `.text.startup'
-] /usr/bin/ld: /tmp/ccgB3vA5.o: in function `main':
+] /usr/bin/ld: /tmp/ccowgV3b.o: warning: relocation against `sys_siglist' in read-only section `.text.startup'
+] /usr/bin/ld: /tmp/ccowgV3b.o: in function `main':
 ] ./builddir/legacy/./builddir/legacy/conftest.c:10:(.text.startup+0x8): undefined reference to `sys_siglist'
 ] /usr/bin/ld: read-only segment has dynamic relocations
 ] collect2: error: ld returned 1 exit status
 ==> the sys_siglist[] array... no
 ... the _sys_siglist[] array
 $ musl-gcc -O2 -g -Werror=implicit-function-declaration -ffile-prefix-map=/build/reproducible-path/mksh-59c=. -fstack-clash-protection -Wformat -Werror=format-security -fcf-protection -Wall -Wextra -fPIE -fno-lto -Wno-deprecated-declarations -fno-asynchronous-unwind-tables -fno-strict-aliasing -fstack-protector-strong -malign-data=abi -fwrapv  -I. -I'../..' -Wdate-time -D_FORTIFY_SOURCE=2 -DMKSH_EARLY_LOCALE_TRACKING -DKSH_VERSIONNAME_VENDOR_EXT=\"\ +Debian\" -DMKSH_BUILDMEAT -DMKSH_BINSHPOSIX -DMKSH_BINSHREDUCED -DMKSH_BUILDSH=1 -DMKSH_LEGACY_MODE=1 -D_GNU_SOURCE -DSETUID_CAN_FAIL_WITH_EAGAIN=1 -DHAVE_STRING_POOLING=2 -DHAVE_ATTRIBUTE_BOUNDED=0 -DHAVE_ATTRIBUTE_FORMAT=1 -DHAVE_ATTRIBUTE_NORETURN=1 -DHAVE_ATTRIBUTE_UNUSED=1 -DHAVE_ATTRIBUTE_USED=1 -DHAVE_SYS_TIME_H=1 -DHAVE_TIME_H=1 -DHAVE_BOTH_TIME_H=1 -DHAVE_SYS_SELECT_H=1 -DHAVE_SELECT_TIME_H=1 -DHAVE_SYS_BSDTYPES_H=0 -DHAVE_SYS_FILE_H=1 -DHAVE_SYS_MKDEV_H=0 -DHAVE_SYS_MMAN_H=1 -DHAVE_SYS_PARAM_H=1 -DHAVE_SYS_PTEM_H=0 -DHAVE_SYS_RESOURCE_H=1 -DHAVE_SYS_SYSMACROS_H=1 -DHAVE_BSTRING_H=0 -DHAVE_GRP_H=1 -DHAVE_IO_H=0 -DHAVE_LIBGEN_H=1 -DHAVE_LIBUTIL_H=0 -DHAVE_PATHS_H=1 -DHAVE_STDINT_H=1 -DHAVE_STRINGS_H=1 -DHAVE_TERMIOS_H=1 -DHAVE_ULIMIT_H=1 -DHAVE_CAN_INTTYPES=1 -DHAVE_SIG_T=1 -DHAVE_STRERRORDESC_NP=0 -DHAVE_SYS_ERRLIST=0 -DHAVE_SIGABBREV_NP=0 -DHAVE_SYS_SIGNAME=0 -DHAVE_SIGDESCR_NP=0 -Wl,-z,relro -Wl,-z,now -Wl,--as-needed -static -static-pie -Wl,-z,text -fno-lto -Wno-error conftest.c  || for _f in ${tcfn}*; do case $_f in lksh.1|mksh.1|mksh.faq|mksh.ico) ;; *) rm -f "$_f" ;; esac; done
-] /usr/bin/ld: /tmp/ccwaL6wI.o: warning: relocation against `_sys_siglist' in read-only section `.text.startup'
-] /usr/bin/ld: /tmp/ccwaL6wI.o: in function `main':
+] /usr/bin/ld: /tmp/ccXSYj09.o: warning: relocation against `_sys_siglist' in read-only section `.text.startup'
+] /usr/bin/ld: /tmp/ccXSYj09.o: in function `main':
 ] ./builddir/legacy/./builddir/legacy/conftest.c:10:(.text.startup+0x8): undefined reference to `_sys_siglist'
 ] /usr/bin/ld: read-only segment has dynamic relocations
 ] collect2: error: ld returned 1 exit status
@@ -8061,10 +8097,10 @@
 	install -p -m0644 ./lksh.1 debian/mksh/usr/share/man/man1/lksh.1
 	man-recode --to-code UTF-8 --suffix .dh-new debian/mksh/usr/share/man/man1/lksh.1
 	man-recode --to-code UTF-8 --suffix .dh-new debian/mksh/usr/share/man/man1/mksh.1
-	mv debian/mksh/usr/share/man/man1/mksh.1.dh-new debian/mksh/usr/share/man/man1/mksh.1
-	chmod 0644 -- debian/mksh/usr/share/man/man1/mksh.1
 	mv debian/mksh/usr/share/man/man1/lksh.1.dh-new debian/mksh/usr/share/man/man1/lksh.1
 	chmod 0644 -- debian/mksh/usr/share/man/man1/lksh.1
+	mv debian/mksh/usr/share/man/man1/mksh.1.dh-new debian/mksh/usr/share/man/man1/mksh.1
+	chmod 0644 -- debian/mksh/usr/share/man/man1/mksh.1
    dh_installsystemduser -O--buildsystem=none
    dh_installmenu -O--buildsystem=none
 	install -m0755 -d debian/mksh/usr/share/menu
@@ -8101,12 +8137,12 @@
 	chmod a-x usr/share/doc/mksh/NEWS.Debian usr/share/doc/mksh/changelog.Debian usr/share/doc/mksh/check.pl usr/share/doc/mksh/check.t usr/share/doc/mksh/srctrace usr/share/man/man1/lksh.1 usr/share/man/man1/mksh.1
 	gzip -9nf usr/share/doc/mksh/NEWS.Debian usr/share/doc/mksh/changelog.Debian usr/share/doc/mksh/check.pl usr/share/doc/mksh/check.t usr/share/doc/mksh/srctrace usr/share/man/man1/lksh.1 usr/share/man/man1/mksh.1
 	cd '/build/reproducible-path/mksh-59c'
+	rm -f debian/mksh/usr/share/man/man1/rlksh.1 debian/mksh/usr/share/man/man1/rlksh.1.gz
+	ln -s lksh.1.gz debian/mksh/usr/share/man/man1/rlksh.1.gz
 	rm -f debian/mksh/usr/share/man/man1/rmksh.1 debian/mksh/usr/share/man/man1/rmksh.1.gz
 	ln -s mksh.1.gz debian/mksh/usr/share/man/man1/rmksh.1.gz
 	rm -f debian/mksh/usr/share/man/man1/mksh-static.1 debian/mksh/usr/share/man/man1/mksh-static.1.gz
 	ln -s mksh.1.gz debian/mksh/usr/share/man/man1/mksh-static.1.gz
-	rm -f debian/mksh/usr/share/man/man1/rlksh.1 debian/mksh/usr/share/man/man1/rlksh.1.gz
-	ln -s lksh.1.gz debian/mksh/usr/share/man/man1/rlksh.1.gz
    dh_fixperms -O--buildsystem=none
 	find debian/mksh ! -type l -a -true -a -true -print0 2>/dev/null | xargs -0r chmod go=rX,u+rw,a-s
 	find debian/mksh/usr/share/doc -type f -a -true -a ! -regex 'debian/mksh/usr/share/doc/[^/]*/examples/.*' -print0 2>/dev/null | xargs -0r chmod 0644
@@ -8122,11 +8158,6 @@
 	objcopy --compress-debug-sections debian/mksh/usr/lib/debug/.dwz/x86_64-linux-gnu/mksh.debug
 	chmod 0644 -- debian/mksh/usr/lib/debug/.dwz/x86_64-linux-gnu/mksh.debug
    dh_strip -a -O--buildsystem=none
-	install -m0755 -d debian/.debhelper/mksh/dbgsym-root/usr/lib/debug/.build-id/bf
-	objcopy --only-keep-debug --compress-debug-sections debian/mksh/usr/lib/diet/bin/mksh debian/.debhelper/mksh/dbgsym-root/usr/lib/debug/.build-id/bf/8905a911ec94de92295286383ea9faa35b4f6d.debug
-	chmod 0644 -- debian/.debhelper/mksh/dbgsym-root/usr/lib/debug/.build-id/bf/8905a911ec94de92295286383ea9faa35b4f6d.debug
-	strip --remove-section=.comment --remove-section=.note debian/mksh/usr/lib/diet/bin/mksh
-	objcopy --add-gnu-debuglink debian/.debhelper/mksh/dbgsym-root/usr/lib/debug/.build-id/bf/8905a911ec94de92295286383ea9faa35b4f6d.debug debian/mksh/usr/lib/diet/bin/mksh
 dh_strip: warning: Could not find the BuildID in debian/mksh/usr/lib/x86_64-linux-musl/bin/mksh
 	strip --remove-section=.comment --remove-section=.note debian/mksh/usr/lib/x86_64-linux-musl/bin/mksh
 	install -m0755 -d debian/.debhelper/mksh/dbgsym-root/usr/lib/debug/.build-id/ee
@@ -8134,13 +8165,18 @@
 	chmod 0644 -- debian/.debhelper/mksh/dbgsym-root/usr/lib/debug/.build-id/ee/0bec2097c9eaa2dcea3b460adc5aab02cc84f1.debug
 	strip --remove-section=.comment --remove-section=.note debian/mksh/usr/lib/klibc/bin/mksh
 	objcopy --add-gnu-debuglink debian/.debhelper/mksh/dbgsym-root/usr/lib/debug/.build-id/ee/0bec2097c9eaa2dcea3b460adc5aab02cc84f1.debug debian/mksh/usr/lib/klibc/bin/mksh
+	install -m0755 -d debian/.debhelper/mksh/dbgsym-root/usr/lib/debug/.build-id/bf
+	objcopy --only-keep-debug --compress-debug-sections debian/mksh/usr/lib/diet/bin/mksh debian/.debhelper/mksh/dbgsym-root/usr/lib/debug/.build-id/bf/8905a911ec94de92295286383ea9faa35b4f6d.debug
+	chmod 0644 -- debian/.debhelper/mksh/dbgsym-root/usr/lib/debug/.build-id/bf/8905a911ec94de92295286383ea9faa35b4f6d.debug
+	strip --remove-section=.comment --remove-section=.note debian/mksh/usr/lib/diet/bin/mksh
+	objcopy --add-gnu-debuglink debian/.debhelper/mksh/dbgsym-root/usr/lib/debug/.build-id/bf/8905a911ec94de92295286383ea9faa35b4f6d.debug debian/mksh/usr/lib/diet/bin/mksh
+dh_strip: warning: Could not find the BuildID in debian/mksh/bin/lksh
+	strip --remove-section=.comment --remove-section=.note debian/mksh/bin/lksh
 	install -m0755 -d debian/.debhelper/mksh/dbgsym-root/usr/lib/debug/.build-id/67
 	objcopy --only-keep-debug --compress-debug-sections debian/mksh/bin/mksh debian/.debhelper/mksh/dbgsym-root/usr/lib/debug/.build-id/67/f1a475b4106fc9957b42414fa5d87d2357552d.debug
 	chmod 0644 -- debian/.debhelper/mksh/dbgsym-root/usr/lib/debug/.build-id/67/f1a475b4106fc9957b42414fa5d87d2357552d.debug
 	strip --remove-section=.comment --remove-section=.note debian/mksh/bin/mksh
 	objcopy --add-gnu-debuglink debian/.debhelper/mksh/dbgsym-root/usr/lib/debug/.build-id/67/f1a475b4106fc9957b42414fa5d87d2357552d.debug debian/mksh/bin/mksh
-dh_strip: warning: Could not find the BuildID in debian/mksh/bin/lksh
-	strip --remove-section=.comment --remove-section=.note debian/mksh/bin/lksh
 	install -m0755 -d debian/.debhelper/mksh/dbgsym-root/usr/lib/debug/.dwz
 	cp --reflink=auto -a debian/mksh/usr/lib/debug/.dwz/x86_64-linux-gnu debian/.debhelper/mksh/dbgsym-root/usr/lib/debug/.dwz
 	rm -fr debian/mksh/usr/lib/debug/.dwz
@@ -8152,15 +8188,17 @@
 	rm -f debian/mksh/DEBIAN/shlibs
    dh_shlibdeps -a -O--buildsystem=none
 	install -m0755 -d debian/mksh/DEBIAN
-	dpkg-shlibdeps -Tdebian/mksh.substvars debian/mksh/usr/lib/x86_64-linux-musl/bin/mksh debian/mksh/bin/mksh debian/mksh/bin/lksh
+	dpkg-shlibdeps -Tdebian/mksh.substvars debian/mksh/usr/lib/x86_64-linux-musl/bin/mksh debian/mksh/bin/lksh debian/mksh/bin/mksh
 dpkg-shlibdeps: warning: couldn't parse dynamic symbol definition: no symbols
 dpkg-shlibdeps: warning: couldn't parse dynamic symbol definition: no symbols
    debian/rules execute_before_dh_installdeb
 make[1]: Entering directory '/build/reproducible-path/mksh-59c'
 if command -v dh_movetousr >/dev/null 2>&1; then dh_movetousr; fi
 	install -m0755 -d debian/mksh/usr/bin
-	mv debian/mksh/bin/mksh debian/mksh/usr/bin/mksh
-	mv debian/mksh/bin/lksh debian/mksh/usr/bin/lksh
+	install -m0755 -d debian/mksh/usr/bin
+	rm -f debian/mksh/usr/bin/mksh-static
+	ln -s ../lib/x86_64-linux-musl/bin/mksh debian/mksh/usr/bin/mksh-static
+	rm -f debian/mksh/bin/mksh-static
 	install -m0755 -d debian/mksh/usr/bin
 	rm -f debian/mksh/usr/bin/rmksh
 	ln -s mksh debian/mksh/usr/bin/rmksh
@@ -8169,10 +8207,8 @@
 	rm -f debian/mksh/usr/bin/rlksh
 	ln -s lksh debian/mksh/usr/bin/rlksh
 	rm -f debian/mksh/bin/rlksh
-	install -m0755 -d debian/mksh/usr/bin
-	rm -f debian/mksh/usr/bin/mksh-static
-	ln -s ../lib/x86_64-linux-musl/bin/mksh debian/mksh/usr/bin/mksh-static
-	rm -f debian/mksh/bin/mksh-static
+	mv debian/mksh/bin/lksh debian/mksh/usr/bin/lksh
+	mv debian/mksh/bin/mksh debian/mksh/usr/bin/mksh
 	chown --reference debian/mksh/bin debian/mksh/usr/bin
 	chmod --reference debian/mksh/bin debian/mksh/usr/bin
 	rmdir debian/mksh/bin
@@ -8312,12 +8348,14 @@
 dpkg-buildpackage: info: binary-only upload (no source included)
 dpkg-genchanges: info: not including original source code in upload
 I: copying local configuration
+I: user script /srv/workspace/pbuilder/3833837/tmp/hooks/B01_cleanup starting
+I: user script /srv/workspace/pbuilder/3833837/tmp/hooks/B01_cleanup finished
 I: unmounting dev/ptmx filesystem
 I: unmounting dev/pts filesystem
 I: unmounting dev/shm filesystem
 I: unmounting proc filesystem
 I: unmounting sys filesystem
 I: cleaning the build env 
-I: removing directory /srv/workspace/pbuilder/3177922 and its subdirectories
-I: Current time: Wed Mar 26 15:39:38 -12 2025
-I: pbuilder-time-stamp: 1743046778
+I: removing directory /srv/workspace/pbuilder/3833837 and its subdirectories
+I: Current time: Wed Apr 29 23:44:35 +14 2026
+I: pbuilder-time-stamp: 1777455875