Diff of the two buildlogs:

--
--- b1/build.log	2024-07-03 21:13:17.060267252 +0000
+++ b2/build.log	2024-07-03 21:22:56.807665291 +0000
@@ -1,6 +1,6 @@
 I: pbuilder: network access will be disabled during build
-I: Current time: Wed Jul  3 09:06:51 -12 2024
-I: pbuilder-time-stamp: 1720040811
+I: Current time: Wed Aug  6 17:36:20 +14 2025
+I: pbuilder-time-stamp: 1754451380
 I: Building the build Environment
 I: extracting base tarball [/var/cache/pbuilder/bookworm-reproducible-base.tgz]
 I: copying local configuration
@@ -16,7 +16,7 @@
 I: copying [./mksh_59c.orig.tar.gz]
 I: copying [./mksh_59c-28+deb12u1.debian.tar.xz]
 I: Extracting source
-gpgv: Signature made Sat Apr  6 05:51:49 2024 -12
+gpgv: Signature made Sun Apr  7 07:51:49 2024 +14
 gpgv:                using RSA key 76B534B2E99007E0
 gpgv: Can't check signature: No public key
 dpkg-source: warning: cannot verify inline signature for ./mksh_59c-28+deb12u1.dsc: no acceptable signature found
@@ -31,134 +31,166 @@
 dpkg-source: info: applying metadata-update.diff
 I: Not using root during the build.
 I: Installing the build-deps
-I: user script /srv/workspace/pbuilder/2392442/tmp/hooks/D02_print_environment starting
+I: user script /srv/workspace/pbuilder/2295609/tmp/hooks/D01_modify_environment starting
+debug: Running on infom02-amd64.
+I: Changing host+domainname to test build reproducibility
+I: Adding a custom variable just for the fun of it...
+I: Changing /bin/sh to bash
+'/bin/sh' -> '/bin/bash'
+lrwxrwxrwx 1 root root 9 Aug  6 17:36 /bin/sh -> /bin/bash
+I: Setting pbuilder2's login shell to /bin/bash
+I: Setting pbuilder2's GECOS to second user,second room,second work-phone,second home-phone,second other
+I: user script /srv/workspace/pbuilder/2295609/tmp/hooks/D01_modify_environment finished
+I: user script /srv/workspace/pbuilder/2295609/tmp/hooks/D02_print_environment starting
 I: set
-  BUILDDIR='/build/reproducible-path'
-  BUILDUSERGECOS='first user,first room,first work-phone,first home-phone,first other'
-  BUILDUSERNAME='pbuilder1'
-  BUILD_ARCH='amd64'
-  DEBIAN_FRONTEND='noninteractive'
+  BASH=/bin/sh
+  BASHOPTS=checkwinsize:cmdhist:complete_fullquote:extquote:force_fignore:globasciiranges:globskipdots:hostcomplete:interactive_comments:patsub_replacement:progcomp:promptvars:sourcepath
+  BASH_ALIASES=()
+  BASH_ARGC=()
+  BASH_ARGV=()
+  BASH_CMDS=()
+  BASH_LINENO=([0]="12" [1]="0")
+  BASH_LOADABLES_PATH=/usr/local/lib/bash:/usr/lib/bash:/opt/local/lib/bash:/usr/pkg/lib/bash:/opt/pkg/lib/bash:.
+  BASH_SOURCE=([0]="/tmp/hooks/D02_print_environment" [1]="/tmp/hooks/D02_print_environment")
+  BASH_VERSINFO=([0]="5" [1]="2" [2]="15" [3]="1" [4]="release" [5]="x86_64-pc-linux-gnu")
+  BASH_VERSION='5.2.15(1)-release'
+  BUILDDIR=/build/reproducible-path
+  BUILDUSERGECOS='second user,second room,second work-phone,second home-phone,second other'
+  BUILDUSERNAME=pbuilder2
+  BUILD_ARCH=amd64
+  DEBIAN_FRONTEND=noninteractive
   DEB_BUILD_OPTIONS='buildinfo=+all reproducible=+all parallel=12 '
-  DISTRIBUTION='bookworm'
-  HOME='/root'
-  HOST_ARCH='amd64'
+  DIRSTACK=()
+  DISTRIBUTION=bookworm
+  EUID=0
+  FUNCNAME=([0]="Echo" [1]="main")
+  GROUPS=()
+  HOME=/root
+  HOSTNAME=i-capture-the-hostname
+  HOSTTYPE=x86_64
+  HOST_ARCH=amd64
   IFS=' 	
   '
-  INVOCATION_ID='78622633fe4d4f2aa53014a2fc161fde'
-  LANG='C'
-  LANGUAGE='en_US:en'
-  LC_ALL='C'
-  MAIL='/var/mail/root'
-  OPTIND='1'
-  PATH='/usr/sbin:/usr/bin:/sbin:/bin:/usr/games'
-  PBCURRENTCOMMANDLINEOPERATION='build'
-  PBUILDER_OPERATION='build'
-  PBUILDER_PKGDATADIR='/usr/share/pbuilder'
-  PBUILDER_PKGLIBDIR='/usr/lib/pbuilder'
-  PBUILDER_SYSCONFDIR='/etc'
-  PPID='2392442'
-  PS1='# '
-  PS2='> '
+  INVOCATION_ID=cf23c02a852d48bab12bc3da66472840
+  LANG=C
+  LANGUAGE=et_EE:et
+  LC_ALL=C
+  MACHTYPE=x86_64-pc-linux-gnu
+  MAIL=/var/mail/root
+  OPTERR=1
+  OPTIND=1
+  OSTYPE=linux-gnu
+  PATH=/usr/sbin:/usr/bin:/sbin:/bin:/usr/games:/i/capture/the/path
+  PBCURRENTCOMMANDLINEOPERATION=build
+  PBUILDER_OPERATION=build
+  PBUILDER_PKGDATADIR=/usr/share/pbuilder
+  PBUILDER_PKGLIBDIR=/usr/lib/pbuilder
+  PBUILDER_SYSCONFDIR=/etc
+  PIPESTATUS=([0]="0")
+  POSIXLY_CORRECT=y
+  PPID=2295609
   PS4='+ '
-  PWD='/'
-  SHELL='/bin/bash'
-  SHLVL='2'
-  SUDO_COMMAND='/usr/bin/timeout -k 18.1h 18h /usr/bin/ionice -c 3 /usr/bin/nice /usr/sbin/pbuilder --build --configfile /srv/reproducible-results/rbuild-debian/r-b-build.pETW2Vsa/pbuilderrc_Lzfz --distribution bookworm --hookdir /etc/pbuilder/first-build-hooks --debbuildopts -b --basetgz /var/cache/pbuilder/bookworm-reproducible-base.tgz --buildresult /srv/reproducible-results/rbuild-debian/r-b-build.pETW2Vsa/b1 --logfile b1/build.log mksh_59c-28+deb12u1.dsc'
-  SUDO_GID='109'
-  SUDO_UID='104'
-  SUDO_USER='jenkins'
-  TERM='unknown'
-  TZ='/usr/share/zoneinfo/Etc/GMT+12'
-  USER='root'
-  _='/usr/bin/systemd-run'
+  PWD=/
+  SHELL=/bin/bash
+  SHELLOPTS=braceexpand:errexit:hashall:interactive-comments:posix
+  SHLVL=3
+  SUDO_COMMAND='/usr/bin/timeout -k 24.1h 24h /usr/bin/ionice -c 3 /usr/bin/nice -n 11 /usr/bin/unshare --uts -- /usr/sbin/pbuilder --build --configfile /srv/reproducible-results/rbuild-debian/r-b-build.pETW2Vsa/pbuilderrc_gil7 --distribution bookworm --hookdir /etc/pbuilder/rebuild-hooks --debbuildopts -b --basetgz /var/cache/pbuilder/bookworm-reproducible-base.tgz --buildresult /srv/reproducible-results/rbuild-debian/r-b-build.pETW2Vsa/b2 --logfile b2/build.log mksh_59c-28+deb12u1.dsc'
+  SUDO_GID=109
+  SUDO_UID=104
+  SUDO_USER=jenkins
+  TERM=unknown
+  TZ=/usr/share/zoneinfo/Etc/GMT-14
+  UID=0
+  USER=root
+  _='I: set'
 I: uname -a
-  Linux infom01-amd64 6.1.0-22-cloud-amd64 #1 SMP PREEMPT_DYNAMIC Debian 6.1.94-1 (2024-06-21) x86_64 GNU/Linux
+  Linux i-capture-the-hostname 6.7.12+bpo-amd64 #1 SMP PREEMPT_DYNAMIC Debian 6.7.12-1~bpo12+1 (2024-05-06) x86_64 GNU/Linux
 I: ls -l /bin
   total 5632
-  -rwxr-xr-x 1 root root 1265648 Mar 29 07:40 bash
-  -rwxr-xr-x 3 root root   39224 Sep 18  2022 bunzip2
-  -rwxr-xr-x 3 root root   39224 Sep 18  2022 bzcat
-  lrwxrwxrwx 1 root root       6 Sep 18  2022 bzcmp -> bzdiff
-  -rwxr-xr-x 1 root root    2225 Sep 18  2022 bzdiff
-  lrwxrwxrwx 1 root root       6 Sep 18  2022 bzegrep -> bzgrep
-  -rwxr-xr-x 1 root root    4893 Nov 27  2021 bzexe
-  lrwxrwxrwx 1 root root       6 Sep 18  2022 bzfgrep -> bzgrep
-  -rwxr-xr-x 1 root root    3775 Sep 18  2022 bzgrep
-  -rwxr-xr-x 3 root root   39224 Sep 18  2022 bzip2
-  -rwxr-xr-x 1 root root   14568 Sep 18  2022 bzip2recover
-  lrwxrwxrwx 1 root root       6 Sep 18  2022 bzless -> bzmore
-  -rwxr-xr-x 1 root root    1297 Sep 18  2022 bzmore
-  -rwxr-xr-x 1 root root   44016 Sep 20  2022 cat
-  -rwxr-xr-x 1 root root   68656 Sep 20  2022 chgrp
-  -rwxr-xr-x 1 root root   64496 Sep 20  2022 chmod
-  -rwxr-xr-x 1 root root   72752 Sep 20  2022 chown
-  -rwxr-xr-x 1 root root  151152 Sep 20  2022 cp
-  -rwxr-xr-x 1 root root  125640 Jan  5  2023 dash
-  -rwxr-xr-x 1 root root  121904 Sep 20  2022 date
-  -rwxr-xr-x 1 root root   89240 Sep 20  2022 dd
-  -rwxr-xr-x 1 root root  102200 Sep 20  2022 df
-  -rwxr-xr-x 1 root root  151344 Sep 20  2022 dir
-  -rwxr-xr-x 1 root root   88656 Mar 27 21:52 dmesg
-  lrwxrwxrwx 1 root root       8 Dec 19  2022 dnsdomainname -> hostname
-  lrwxrwxrwx 1 root root       8 Dec 19  2022 domainname -> hostname
-  -rwxr-xr-x 1 root root   43856 Sep 20  2022 echo
-  -rwxr-xr-x 1 root root      41 Jan 24  2023 egrep
-  -rwxr-xr-x 1 root root   35664 Sep 20  2022 false
-  -rwxr-xr-x 1 root root      41 Jan 24  2023 fgrep
-  -rwxr-xr-x 1 root root   85600 Mar 27 21:52 findmnt
-  -rwsr-xr-x 1 root root   35128 Mar 22  2023 fusermount
-  -rwxr-xr-x 1 root root  203152 Jan 24  2023 grep
-  -rwxr-xr-x 2 root root    2346 Apr  9  2022 gunzip
-  -rwxr-xr-x 1 root root    6447 Apr  9  2022 gzexe
-  -rwxr-xr-x 1 root root   98136 Apr  9  2022 gzip
-  -rwxr-xr-x 1 root root   22680 Dec 19  2022 hostname
-  -rwxr-xr-x 1 root root   72824 Sep 20  2022 ln
-  -rwxr-xr-x 1 root root   53024 Mar 23  2023 login
-  -rwxr-xr-x 1 root root  151344 Sep 20  2022 ls
-  -rwxr-xr-x 1 root root  207168 Mar 27 21:52 lsblk
-  -rwxr-xr-x 1 root root   97552 Sep 20  2022 mkdir
-  -rwxr-xr-x 1 root root   72912 Sep 20  2022 mknod
-  -rwxr-xr-x 1 root root   43952 Sep 20  2022 mktemp
-  -rwxr-xr-x 1 root root   59712 Mar 27 21:52 more
-  -rwsr-xr-x 1 root root   59704 Mar 27 21:52 mount
-  -rwxr-xr-x 1 root root   18744 Mar 27 21:52 mountpoint
-  -rwxr-xr-x 1 root root  142968 Sep 20  2022 mv
-  lrwxrwxrwx 1 root root       8 Dec 19  2022 nisdomainname -> hostname
-  lrwxrwxrwx 1 root root      14 Apr  2  2023 pidof -> /sbin/killall5
-  -rwxr-xr-x 1 root root   43952 Sep 20  2022 pwd
-  lrwxrwxrwx 1 root root       4 Mar 29 07:40 rbash -> bash
-  -rwxr-xr-x 1 root root   52112 Sep 20  2022 readlink
-  -rwxr-xr-x 1 root root   72752 Sep 20  2022 rm
-  -rwxr-xr-x 1 root root   56240 Sep 20  2022 rmdir
-  -rwxr-xr-x 1 root root   27560 Jul 28  2023 run-parts
-  -rwxr-xr-x 1 root root  126424 Jan  5  2023 sed
-  lrwxrwxrwx 1 root root       4 Jan  5  2023 sh -> dash
-  -rwxr-xr-x 1 root root   43888 Sep 20  2022 sleep
-  -rwxr-xr-x 1 root root   85008 Sep 20  2022 stty
-  -rwsr-xr-x 1 root root   72000 Mar 27 21:52 su
-  -rwxr-xr-x 1 root root   39824 Sep 20  2022 sync
-  -rwxr-xr-x 1 root root  531984 Jan 19 21:27 tar
-  -rwxr-xr-x 1 root root   14520 Jul 28  2023 tempfile
-  -rwxr-xr-x 1 root root  109616 Sep 20  2022 touch
-  -rwxr-xr-x 1 root root   35664 Sep 20  2022 true
-  -rwxr-xr-x 1 root root   14568 Mar 22  2023 ulockmgr_server
-  -rwsr-xr-x 1 root root   35128 Mar 27 21:52 umount
-  -rwxr-xr-x 1 root root   43888 Sep 20  2022 uname
-  -rwxr-xr-x 2 root root    2346 Apr  9  2022 uncompress
-  -rwxr-xr-x 1 root root  151344 Sep 20  2022 vdir
-  -rwxr-xr-x 1 root root   72024 Mar 27 21:52 wdctl
-  lrwxrwxrwx 1 root root       8 Dec 19  2022 ypdomainname -> hostname
-  -rwxr-xr-x 1 root root    1984 Apr  9  2022 zcat
-  -rwxr-xr-x 1 root root    1678 Apr  9  2022 zcmp
-  -rwxr-xr-x 1 root root    6460 Apr  9  2022 zdiff
-  -rwxr-xr-x 1 root root      29 Apr  9  2022 zegrep
-  -rwxr-xr-x 1 root root      29 Apr  9  2022 zfgrep
-  -rwxr-xr-x 1 root root    2081 Apr  9  2022 zforce
-  -rwxr-xr-x 1 root root    8103 Apr  9  2022 zgrep
-  -rwxr-xr-x 1 root root    2206 Apr  9  2022 zless
-  -rwxr-xr-x 1 root root    1842 Apr  9  2022 zmore
-  -rwxr-xr-x 1 root root    4577 Apr  9  2022 znew
-I: user script /srv/workspace/pbuilder/2392442/tmp/hooks/D02_print_environment finished
+  -rwxr-xr-x 1 root root 1265648 Mar 30  2024 bash
+  -rwxr-xr-x 3 root root   39224 Sep 19  2022 bunzip2
+  -rwxr-xr-x 3 root root   39224 Sep 19  2022 bzcat
+  lrwxrwxrwx 1 root root       6 Sep 19  2022 bzcmp -> bzdiff
+  -rwxr-xr-x 1 root root    2225 Sep 19  2022 bzdiff
+  lrwxrwxrwx 1 root root       6 Sep 19  2022 bzegrep -> bzgrep
+  -rwxr-xr-x 1 root root    4893 Nov 28  2021 bzexe
+  lrwxrwxrwx 1 root root       6 Sep 19  2022 bzfgrep -> bzgrep
+  -rwxr-xr-x 1 root root    3775 Sep 19  2022 bzgrep
+  -rwxr-xr-x 3 root root   39224 Sep 19  2022 bzip2
+  -rwxr-xr-x 1 root root   14568 Sep 19  2022 bzip2recover
+  lrwxrwxrwx 1 root root       6 Sep 19  2022 bzless -> bzmore
+  -rwxr-xr-x 1 root root    1297 Sep 19  2022 bzmore
+  -rwxr-xr-x 1 root root   44016 Sep 21  2022 cat
+  -rwxr-xr-x 1 root root   68656 Sep 21  2022 chgrp
+  -rwxr-xr-x 1 root root   64496 Sep 21  2022 chmod
+  -rwxr-xr-x 1 root root   72752 Sep 21  2022 chown
+  -rwxr-xr-x 1 root root  151152 Sep 21  2022 cp
+  -rwxr-xr-x 1 root root  125640 Jan  6  2023 dash
+  -rwxr-xr-x 1 root root  121904 Sep 21  2022 date
+  -rwxr-xr-x 1 root root   89240 Sep 21  2022 dd
+  -rwxr-xr-x 1 root root  102200 Sep 21  2022 df
+  -rwxr-xr-x 1 root root  151344 Sep 21  2022 dir
+  -rwxr-xr-x 1 root root   88656 Mar 28  2024 dmesg
+  lrwxrwxrwx 1 root root       8 Dec 20  2022 dnsdomainname -> hostname
+  lrwxrwxrwx 1 root root       8 Dec 20  2022 domainname -> hostname
+  -rwxr-xr-x 1 root root   43856 Sep 21  2022 echo
+  -rwxr-xr-x 1 root root      41 Jan 25  2023 egrep
+  -rwxr-xr-x 1 root root   35664 Sep 21  2022 false
+  -rwxr-xr-x 1 root root      41 Jan 25  2023 fgrep
+  -rwxr-xr-x 1 root root   85600 Mar 28  2024 findmnt
+  -rwsr-xr-x 1 root root   35128 Mar 23  2023 fusermount
+  -rwxr-xr-x 1 root root  203152 Jan 25  2023 grep
+  -rwxr-xr-x 2 root root    2346 Apr 10  2022 gunzip
+  -rwxr-xr-x 1 root root    6447 Apr 10  2022 gzexe
+  -rwxr-xr-x 1 root root   98136 Apr 10  2022 gzip
+  -rwxr-xr-x 1 root root   22680 Dec 20  2022 hostname
+  -rwxr-xr-x 1 root root   72824 Sep 21  2022 ln
+  -rwxr-xr-x 1 root root   53024 Mar 24  2023 login
+  -rwxr-xr-x 1 root root  151344 Sep 21  2022 ls
+  -rwxr-xr-x 1 root root  207168 Mar 28  2024 lsblk
+  -rwxr-xr-x 1 root root   97552 Sep 21  2022 mkdir
+  -rwxr-xr-x 1 root root   72912 Sep 21  2022 mknod
+  -rwxr-xr-x 1 root root   43952 Sep 21  2022 mktemp
+  -rwxr-xr-x 1 root root   59712 Mar 28  2024 more
+  -rwsr-xr-x 1 root root   59704 Mar 28  2024 mount
+  -rwxr-xr-x 1 root root   18744 Mar 28  2024 mountpoint
+  -rwxr-xr-x 1 root root  142968 Sep 21  2022 mv
+  lrwxrwxrwx 1 root root       8 Dec 20  2022 nisdomainname -> hostname
+  lrwxrwxrwx 1 root root      14 Apr  3  2023 pidof -> /sbin/killall5
+  -rwxr-xr-x 1 root root   43952 Sep 21  2022 pwd
+  lrwxrwxrwx 1 root root       4 Mar 30  2024 rbash -> bash
+  -rwxr-xr-x 1 root root   52112 Sep 21  2022 readlink
+  -rwxr-xr-x 1 root root   72752 Sep 21  2022 rm
+  -rwxr-xr-x 1 root root   56240 Sep 21  2022 rmdir
+  -rwxr-xr-x 1 root root   27560 Jul 29  2023 run-parts
+  -rwxr-xr-x 1 root root  126424 Jan  6  2023 sed
+  lrwxrwxrwx 1 root root       9 Aug  6 17:36 sh -> /bin/bash
+  -rwxr-xr-x 1 root root   43888 Sep 21  2022 sleep
+  -rwxr-xr-x 1 root root   85008 Sep 21  2022 stty
+  -rwsr-xr-x 1 root root   72000 Mar 28  2024 su
+  -rwxr-xr-x 1 root root   39824 Sep 21  2022 sync
+  -rwxr-xr-x 1 root root  531984 Jan 20  2024 tar
+  -rwxr-xr-x 1 root root   14520 Jul 29  2023 tempfile
+  -rwxr-xr-x 1 root root  109616 Sep 21  2022 touch
+  -rwxr-xr-x 1 root root   35664 Sep 21  2022 true
+  -rwxr-xr-x 1 root root   14568 Mar 23  2023 ulockmgr_server
+  -rwsr-xr-x 1 root root   35128 Mar 28  2024 umount
+  -rwxr-xr-x 1 root root   43888 Sep 21  2022 uname
+  -rwxr-xr-x 2 root root    2346 Apr 10  2022 uncompress
+  -rwxr-xr-x 1 root root  151344 Sep 21  2022 vdir
+  -rwxr-xr-x 1 root root   72024 Mar 28  2024 wdctl
+  lrwxrwxrwx 1 root root       8 Dec 20  2022 ypdomainname -> hostname
+  -rwxr-xr-x 1 root root    1984 Apr 10  2022 zcat
+  -rwxr-xr-x 1 root root    1678 Apr 10  2022 zcmp
+  -rwxr-xr-x 1 root root    6460 Apr 10  2022 zdiff
+  -rwxr-xr-x 1 root root      29 Apr 10  2022 zegrep
+  -rwxr-xr-x 1 root root      29 Apr 10  2022 zfgrep
+  -rwxr-xr-x 1 root root    2081 Apr 10  2022 zforce
+  -rwxr-xr-x 1 root root    8103 Apr 10  2022 zgrep
+  -rwxr-xr-x 1 root root    2206 Apr 10  2022 zless
+  -rwxr-xr-x 1 root root    1842 Apr 10  2022 zmore
+  -rwxr-xr-x 1 root root    4577 Apr 10  2022 znew
+I: user script /srv/workspace/pbuilder/2295609/tmp/hooks/D02_print_environment finished
  -> Attempting to satisfy build-dependencies
  -> Creating pbuilder-satisfydepends-dummy package
 Package: pbuilder-satisfydepends-dummy
@@ -242,7 +274,7 @@
 Get: 35 http://deb.debian.org/debian bookworm/main amd64 musl amd64 1.2.3-1 [406 kB]
 Get: 36 http://deb.debian.org/debian bookworm/main amd64 musl-dev amd64 1.2.3-1 [587 kB]
 Get: 37 http://deb.debian.org/debian bookworm/main amd64 musl-tools amd64 1.2.3-1 [42.3 kB]
-Fetched 20.5 MB in 0s (66.0 MB/s)
+Fetched 20.5 MB in 1s (14.5 MB/s)
 debconf: delaying package configuration, since apt-utils is not installed
 Selecting previously unselected package sensible-utils.
 (Reading database ... 
(Reading database ... 5%
(Reading database ... 10%
(Reading database ... 15%
(Reading database ... 20%
(Reading database ... 25%
(Reading database ... 30%
(Reading database ... 35%
(Reading database ... 40%
(Reading database ... 45%
(Reading database ... 50%
(Reading database ... 55%
(Reading database ... 60%
(Reading database ... 65%
(Reading database ... 70%
(Reading database ... 75%
(Reading database ... 80%
(Reading database ... 85%
(Reading database ... 90%
(Reading database ... 95%
(Reading database ... 100%
(Reading database ... 19546 files and directories currently installed.)
@@ -407,7 +439,11 @@
 Building tag database...
  -> Finished parsing the build-deps
 I: Building the package
-I: Running cd /build/reproducible-path/mksh-59c/ && env PATH="/usr/sbin:/usr/bin:/sbin:/bin:/usr/games" HOME="/nonexistent/first-build" dpkg-buildpackage -us -uc -b && env PATH="/usr/sbin:/usr/bin:/sbin:/bin:/usr/games" HOME="/nonexistent/first-build" dpkg-genchanges -S  > ../mksh_59c-28+deb12u1_source.changes
+I: user script /srv/workspace/pbuilder/2295609/tmp/hooks/A99_set_merged_usr starting
+Not re-configuring usrmerge for bookworm
+I: user script /srv/workspace/pbuilder/2295609/tmp/hooks/A99_set_merged_usr finished
+hostname: Name or service not known
+I: Running cd /build/reproducible-path/mksh-59c/ && env PATH="/usr/sbin:/usr/bin:/sbin:/bin:/usr/games:/i/capture/the/path" HOME="/nonexistent/second-build" dpkg-buildpackage -us -uc -b && env PATH="/usr/sbin:/usr/bin:/sbin:/bin:/usr/games:/i/capture/the/path" HOME="/nonexistent/second-build" dpkg-genchanges -S  > ../mksh_59c-28+deb12u1_source.changes
 dpkg-buildpackage: info: source package mksh
 dpkg-buildpackage: info: source version 59c-28+deb12u1
 dpkg-buildpackage: info: source distribution bookworm
@@ -482,10 +518,10 @@
 Attempting compilation of mksh in full with CC='gcc'
 CFLAGS='-g -O2 -ffile-prefix-map=/build/reproducible-path/mksh-59c=. -fstack-protector-strong -Wformat -Werror=format-security -Wall -Wextra' CPPFLAGS='-Wdate-time -D_FORTIFY_SOURCE=2 -DMKSH_EARLY_LOCALE_TRACKING -DKSH_VERSIONNAME_VENDOR_EXT=\"\ +Debian\" -DMKSH_BUILDMEAT'
 LDFLAGS='-Wl,-z,relro -Wl,-z,now -Wl,--as-needed' LDSTATIC='' LIBS=''
-+ env CC=gcc CFLAGS=-g -O2 -ffile-prefix-map=/build/reproducible-path/mksh-59c=. -fstack-protector-strong -Wformat -Werror=format-security -Wall -Wextra CPPFLAGS=-Wdate-time -D_FORTIFY_SOURCE=2 -DMKSH_EARLY_LOCALE_TRACKING -DKSH_VERSIONNAME_VENDOR_EXT=\"\ +Debian\" -DMKSH_BUILDMEAT LDFLAGS=-Wl,-z,relro -Wl,-z,now -Wl,--as-needed LDSTATIC= LIBS= sh ../../Build.sh -r
++ env CC=gcc 'CFLAGS=-g -O2 -ffile-prefix-map=/build/reproducible-path/mksh-59c=. -fstack-protector-strong -Wformat -Werror=format-security -Wall -Wextra' 'CPPFLAGS=-Wdate-time -D_FORTIFY_SOURCE=2 -DMKSH_EARLY_LOCALE_TRACKING -DKSH_VERSIONNAME_VENDOR_EXT=\"\ +Debian\" -DMKSH_BUILDMEAT' 'LDFLAGS=-Wl,-z,relro -Wl,-z,now -Wl,--as-needed' LDSTATIC= LIBS= sh ../../Build.sh -r
 For the build logs, demonstrate that /dev/null and /dev/tty exist:
-crw-rw-rw- 1 root root 1, 3 Jun  6 22:24 /dev/null
-crw-rw-rw- 1 root root 5, 0 Jun  6 22:24 /dev/tty
+crw-rw-rw- 1 root root 1, 3 Jul 11 06:46 /dev/null
+crw-rw-rw- 1 root root 5, 0 Jul 11 06:46 /dev/tty
 Flags on entry (plus HAVE_* which are not shown here):
 - CC        <gcc>
 - CFLAGS    <-g -O2 -ffile-prefix-map=/build/reproducible-path/mksh-59c=. -fstack-protector-strong -Wformat -Werror=format-security -Wall -Wextra>
@@ -497,11 +533,11 @@
 
 Hi from $MirOS: src/bin/mksh/Build.sh,v 1.835 2023/01/26 04:32:50 tg Exp $ on:
 $ uname -a >&2
-| Linux infom01-amd64 6.1.0-22-cloud-amd64 #1 SMP PREEMPT_DYNAMIC Debian 6.1.94-1 (2024-06-21) x86_64 GNU/Linux
-Build.sh: Building The MirBSD Korn Shell (mksh) R59 2023/04/29 on Linux 6.1.0-22-cloud-amd64...
+| Linux i-capture-the-hostname 6.7.12+bpo-amd64 #1 SMP PREEMPT_DYNAMIC Debian 6.7.12-1~bpo12+1 (2024-05-06) x86_64 GNU/Linux
+Build.sh: Building The MirBSD Korn Shell (mksh) R59 2023/04/29 on Linux 6.7.12+bpo-amd64...
 Build.sh: Scanning for functions... please ignore any errors.
 ... which compiler type seems to be used
-$ gcc -E -g -O2 -ffile-prefix-map=/build/reproducible-path/mksh-59c=. -fstack-protector-strong -Wformat -Werror=format-security -Wall -Wextra -I. -I'../..' -Wdate-time -D_FORTIFY_SOURCE=2 -DMKSH_EARLY_LOCALE_TRACKING -DKSH_VERSIONNAME_VENDOR_EXT=\"\ +Debian\" -DMKSH_BUILDMEAT -DMKSH_BUILDSH=1 -D_GNU_SOURCE -DSETUID_CAN_FAIL_WITH_EAGAIN=1   conftest.c |     sed -n '/^ *[ce]t *= */s/^ *\([ce]t\) *= */=/p' | tr -d \015 >x
+$ gcc -E -g -O2 -ffile-prefix-map=/build/reproducible-path/mksh-59c=. -fstack-protector-strong -Wformat -Werror=format-security -Wall -Wextra -I. -I'../..' -Wdate-time -D_FORTIFY_SOURCE=2 -DMKSH_EARLY_LOCALE_TRACKING -DKSH_VERSIONNAME_VENDOR_EXT=\"\ +Debian\" -DMKSH_BUILDMEAT -DMKSH_BUILDSH=1 -D_GNU_SOURCE -DSETUID_CAN_FAIL_WITH_EAGAIN=1   conftest.c |     sed -n '/^ *[ce]t *= */s/^ *\([ce]t\) *= */\1=/p' | tr -d \\015 >x
 [ ct="gcc"
 [ et="unknown"
 $ gcc -g -O2 -ffile-prefix-map=/build/reproducible-path/mksh-59c=. -fstack-protector-strong -Wformat -Werror=format-security -Wall -Wextra  -I. -I'../..' -Wdate-time -D_FORTIFY_SOURCE=2 -DMKSH_EARLY_LOCALE_TRACKING -DKSH_VERSIONNAME_VENDOR_EXT=\"\ +Debian\" -DMKSH_BUILDMEAT -DMKSH_BUILDSH=1 -D_GNU_SOURCE -DSETUID_CAN_FAIL_WITH_EAGAIN=1 -Wl,-z,relro -Wl,-z,now -Wl,--as-needed  -v conftest.c 
@@ -516,7 +552,7 @@
 | Supported LTO compression algorithms: zlib zstd
 | gcc version 12.2.0 (Debian 12.2.0-14) 
 | COLLECT_GCC_OPTIONS='-g' '-O2' '-ffile-prefix-map=/build/reproducible-path/mksh-59c=.' '-fstack-protector-strong' '-Wformat=1' '-Werror=format-security' '-Wall' '-Wextra' '-I' '.' '-I' '../..' '-Wdate-time' '-D' '_FORTIFY_SOURCE=2' '-D' 'MKSH_EARLY_LOCALE_TRACKING' '-D' 'KSH_VERSIONNAME_VENDOR_EXT=" +Debian"' '-D' 'MKSH_BUILDMEAT' '-D' 'MKSH_BUILDSH=1' '-D' '_GNU_SOURCE' '-D' 'SETUID_CAN_FAIL_WITH_EAGAIN=1' '-v' '-mtune=generic' '-march=x86-64' '-dumpdir' 'a-'
-|  /usr/lib/gcc/x86_64-linux-gnu/12/cc1 -quiet -v -I . -I ../.. -imultiarch x86_64-linux-gnu -D _FORTIFY_SOURCE=2 -D MKSH_EARLY_LOCALE_TRACKING -D KSH_VERSIONNAME_VENDOR_EXT=" +Debian" -D MKSH_BUILDMEAT -D MKSH_BUILDSH=1 -D _GNU_SOURCE -D SETUID_CAN_FAIL_WITH_EAGAIN=1 conftest.c -quiet -dumpdir a- -dumpbase conftest.c -dumpbase-ext .c -mtune=generic -march=x86-64 -g -O2 -Wformat=1 -Werror=format-security -Wall -Wextra -Wdate-time -version -ffile-prefix-map=/build/reproducible-path/mksh-59c=. -fstack-protector-strong -fasynchronous-unwind-tables -o /tmp/ccD1DBbP.s
+|  /usr/lib/gcc/x86_64-linux-gnu/12/cc1 -quiet -v -I . -I ../.. -imultiarch x86_64-linux-gnu -D _FORTIFY_SOURCE=2 -D MKSH_EARLY_LOCALE_TRACKING -D KSH_VERSIONNAME_VENDOR_EXT=" +Debian" -D MKSH_BUILDMEAT -D MKSH_BUILDSH=1 -D _GNU_SOURCE -D SETUID_CAN_FAIL_WITH_EAGAIN=1 conftest.c -quiet -dumpdir a- -dumpbase conftest.c -dumpbase-ext .c -mtune=generic -march=x86-64 -g -O2 -Wformat=1 -Werror=format-security -Wall -Wextra -Wdate-time -version -ffile-prefix-map=/build/reproducible-path/mksh-59c=. -fstack-protector-strong -fasynchronous-unwind-tables -o /tmp/cc97Q9HO.s
 | GNU C17 (Debian 12.2.0-14) version 12.2.0 (x86_64-linux-gnu)
 | 	compiled by GNU C version 12.2.0, GMP version 6.2.1, MPFR version 4.1.1-p1, MPC version 1.3.1, isl version isl-0.25-GMP
 | 
@@ -541,12 +577,12 @@
 | GGC heuristics: --param ggc-min-expand=100 --param ggc-min-heapsize=131072
 | Compiler executable checksum: cc72d2b9b5048fedc2be9051c917b40b
 | COLLECT_GCC_OPTIONS='-g' '-O2' '-ffile-prefix-map=/build/reproducible-path/mksh-59c=.' '-fstack-protector-strong' '-Wformat=1' '-Werror=format-security' '-Wall' '-Wextra' '-I' '.' '-I' '../..' '-Wdate-time' '-D' '_FORTIFY_SOURCE=2' '-D' 'MKSH_EARLY_LOCALE_TRACKING' '-D' 'KSH_VERSIONNAME_VENDOR_EXT=" +Debian"' '-D' 'MKSH_BUILDMEAT' '-D' 'MKSH_BUILDSH=1' '-D' '_GNU_SOURCE' '-D' 'SETUID_CAN_FAIL_WITH_EAGAIN=1' '-v' '-mtune=generic' '-march=x86-64' '-dumpdir' 'a-'
-|  as -v -I . -I ../.. --gdwarf-5 --64 -o /tmp/cciJgDaF.o /tmp/ccD1DBbP.s
+|  as -v -I . -I ../.. --gdwarf-5 --64 -o /tmp/ccltPMTn.o /tmp/cc97Q9HO.s
 | GNU assembler version 2.40 (x86_64-linux-gnu) using BFD version (GNU Binutils for Debian) 2.40
 | COMPILER_PATH=/usr/lib/gcc/x86_64-linux-gnu/12/:/usr/lib/gcc/x86_64-linux-gnu/12/:/usr/lib/gcc/x86_64-linux-gnu/:/usr/lib/gcc/x86_64-linux-gnu/12/:/usr/lib/gcc/x86_64-linux-gnu/
 | LIBRARY_PATH=/usr/lib/gcc/x86_64-linux-gnu/12/:/usr/lib/gcc/x86_64-linux-gnu/12/../../../x86_64-linux-gnu/:/usr/lib/gcc/x86_64-linux-gnu/12/../../../../lib/:/lib/x86_64-linux-gnu/:/lib/../lib/:/usr/lib/x86_64-linux-gnu/:/usr/lib/../lib/:/usr/lib/gcc/x86_64-linux-gnu/12/../../../:/lib/:/usr/lib/
 | COLLECT_GCC_OPTIONS='-g' '-O2' '-ffile-prefix-map=/build/reproducible-path/mksh-59c=.' '-fstack-protector-strong' '-Wformat=1' '-Werror=format-security' '-Wall' '-Wextra' '-I' '.' '-I' '../..' '-Wdate-time' '-D' '_FORTIFY_SOURCE=2' '-D' 'MKSH_EARLY_LOCALE_TRACKING' '-D' 'KSH_VERSIONNAME_VENDOR_EXT=" +Debian"' '-D' 'MKSH_BUILDMEAT' '-D' 'MKSH_BUILDSH=1' '-D' '_GNU_SOURCE' '-D' 'SETUID_CAN_FAIL_WITH_EAGAIN=1' '-v' '-mtune=generic' '-march=x86-64' '-dumpdir' 'a.'
-|  /usr/lib/gcc/x86_64-linux-gnu/12/collect2 -plugin /usr/lib/gcc/x86_64-linux-gnu/12/liblto_plugin.so -plugin-opt=/usr/lib/gcc/x86_64-linux-gnu/12/lto-wrapper -plugin-opt=-fresolution=/tmp/ccHPM1zw.res -plugin-opt=-pass-through=-lgcc -plugin-opt=-pass-through=-lgcc_s -plugin-opt=-pass-through=-lc -plugin-opt=-pass-through=-lgcc -plugin-opt=-pass-through=-lgcc_s --build-id --eh-frame-hdr -m elf_x86_64 --hash-style=gnu --as-needed -dynamic-linker /lib64/ld-linux-x86-64.so.2 -pie /usr/lib/gcc/x86_64-linux-gnu/12/../../../x86_64-linux-gnu/Scrt1.o /usr/lib/gcc/x86_64-linux-gnu/12/../../../x86_64-linux-gnu/crti.o /usr/lib/gcc/x86_64-linux-gnu/12/crtbeginS.o -L/usr/lib/gcc/x86_64-linux-gnu/12 -L/usr/lib/gcc/x86_64-linux-gnu/12/../../../x86_64-linux-gnu -L/usr/lib/gcc/x86_64-linux-gnu/12/../../../../lib -L/lib/x86_64-linux-gnu -L/lib/../lib -L/usr/lib/x86_64-linux-gnu -L/usr/lib/../lib -L/usr/lib/gcc/x86_64-linux-gnu/12/../../.. -z relro -z now --as-needed /tmp/cciJgDaF.o -lgcc --push-state --as-needed -lgcc_s --pop-state -lc -lgcc --push-state --as-needed -lgcc_s --pop-state /usr/lib/gcc/x86_64-linux-gnu/12/crtendS.o /usr/lib/gcc/x86_64-linux-gnu/12/../../../x86_64-linux-gnu/crtn.o
+|  /usr/lib/gcc/x86_64-linux-gnu/12/collect2 -plugin /usr/lib/gcc/x86_64-linux-gnu/12/liblto_plugin.so -plugin-opt=/usr/lib/gcc/x86_64-linux-gnu/12/lto-wrapper -plugin-opt=-fresolution=/tmp/cc7fsAOZ.res -plugin-opt=-pass-through=-lgcc -plugin-opt=-pass-through=-lgcc_s -plugin-opt=-pass-through=-lc -plugin-opt=-pass-through=-lgcc -plugin-opt=-pass-through=-lgcc_s --build-id --eh-frame-hdr -m elf_x86_64 --hash-style=gnu --as-needed -dynamic-linker /lib64/ld-linux-x86-64.so.2 -pie /usr/lib/gcc/x86_64-linux-gnu/12/../../../x86_64-linux-gnu/Scrt1.o /usr/lib/gcc/x86_64-linux-gnu/12/../../../x86_64-linux-gnu/crti.o /usr/lib/gcc/x86_64-linux-gnu/12/crtbeginS.o -L/usr/lib/gcc/x86_64-linux-gnu/12 -L/usr/lib/gcc/x86_64-linux-gnu/12/../../../x86_64-linux-gnu -L/usr/lib/gcc/x86_64-linux-gnu/12/../../../../lib -L/lib/x86_64-linux-gnu -L/lib/../lib -L/usr/lib/x86_64-linux-gnu -L/usr/lib/../lib -L/usr/lib/gcc/x86_64-linux-gnu/12/../../.. -z relro -z now --as-needed /tmp/ccltPMTn.o -lgcc --push-state --as-needed -lgcc_s --pop-state -lc -lgcc --push-state --as-needed -lgcc_s --pop-state /usr/lib/gcc/x86_64-linux-gnu/12/crtendS.o /usr/lib/gcc/x86_64-linux-gnu/12/../../../x86_64-linux-gnu/crtn.o
 | COLLECT_GCC_OPTIONS='-g' '-O2' '-ffile-prefix-map=/build/reproducible-path/mksh-59c=.' '-fstack-protector-strong' '-Wformat=1' '-Werror=format-security' '-Wall' '-Wextra' '-I' '.' '-I' '../..' '-Wdate-time' '-D' '_FORTIFY_SOURCE=2' '-D' 'MKSH_EARLY_LOCALE_TRACKING' '-D' 'KSH_VERSIONNAME_VENDOR_EXT=" +Debian"' '-D' 'MKSH_BUILDMEAT' '-D' 'MKSH_BUILDSH=1' '-D' '_GNU_SOURCE' '-D' 'SETUID_CAN_FAIL_WITH_EAGAIN=1' '-v' '-mtune=generic' '-march=x86-64' '-dumpdir' 'a.'
 $ eval echo "\`$CC $CFLAGS $Cg $CPPFLAGS $LDFLAGS $NOWARN $LIBS -dumpmachine\`" \
 		 "gcc\`$CC $CFLAGS $Cg $CPPFLAGS $LDFLAGS $NOWARN $LIBS -dumpversion\`"
@@ -557,7 +593,7 @@
 ==> if the compiler works... yes
 ... if the compiler does not fail correctly
 $ gcc -g -O2 -ffile-prefix-map=/build/reproducible-path/mksh-59c=. -fstack-protector-strong -Wformat -Werror=format-security -Wall -Wextra  -I. -I'../..' -Wdate-time -D_FORTIFY_SOURCE=2 -DMKSH_EARLY_LOCALE_TRACKING -DKSH_VERSIONNAME_VENDOR_EXT=\"\ +Debian\" -DMKSH_BUILDMEAT -DMKSH_BUILDSH=1 -D_GNU_SOURCE -DSETUID_CAN_FAIL_WITH_EAGAIN=1 -Wl,-z,relro -Wl,-z,now -Wl,--as-needed  conftest.c  || for _f in ${tcfn}*; do case $_f in lksh.1|mksh.1|mksh.faq|mksh.ico) ;; *) rm -f "$_f" ;; esac; done
-] /usr/bin/ld: /tmp/cc5q9oUi.o: in function `main':
+] /usr/bin/ld: /tmp/ccgGaxGn.o: in function `main':
 ] ./builddir/full/./builddir/full/conftest.c:15: undefined reference to `thiswillneverbedefinedIhope'
 ] collect2: error: ld returned 1 exit status
 ==> if the compiler does not fail correctly... no
@@ -613,38 +649,38 @@
 ==> for __attribute__((__used__))... yes
 ... if a reduced-feature mksh is requested
 $ gcc -g -O2 -ffile-prefix-map=/build/reproducible-path/mksh-59c=. -fstack-protector-strong -Wformat -Werror=format-security -Wall -Wextra -fno-lto -Wno-deprecated-declarations -fno-asynchronous-unwind-tables -fno-strict-aliasing -fstack-protector-strong -malign-data=abi -fwrapv  -I. -I'../..' -Wdate-time -D_FORTIFY_SOURCE=2 -DMKSH_EARLY_LOCALE_TRACKING -DKSH_VERSIONNAME_VENDOR_EXT=\"\ +Debian\" -DMKSH_BUILDMEAT -DMKSH_BUILDSH=1 -D_GNU_SOURCE -DSETUID_CAN_FAIL_WITH_EAGAIN=1 -DHAVE_STRING_POOLING=2 -DHAVE_ATTRIBUTE_BOUNDED=0 -DHAVE_ATTRIBUTE_FORMAT=1 -DHAVE_ATTRIBUTE_NORETURN=1 -DHAVE_ATTRIBUTE_UNUSED=1 -DHAVE_ATTRIBUTE_USED=1 -Wl,-z,relro -Wl,-z,now -Wl,--as-needed -fno-lto -Wno-error conftest.c  || for _f in ${tcfn}*; do case $_f in lksh.1|mksh.1|mksh.faq|mksh.ico) ;; *) rm -f "$_f" ;; esac; done
-] /usr/bin/ld: /tmp/ccun281T.o: in function `main':
+] /usr/bin/ld: /tmp/ccukS99y.o: in function `main':
 ] ./builddir/full/./builddir/full/conftest.c:15: undefined reference to `thiswillneverbedefinedIhope'
 ] collect2: error: ld returned 1 exit status
 ==> if a reduced-feature mksh is requested... no
 ... if invoking as sh should be handled specially
 $ gcc -g -O2 -ffile-prefix-map=/build/reproducible-path/mksh-59c=. -fstack-protector-strong -Wformat -Werror=format-security -Wall -Wextra -fno-lto -Wno-deprecated-declarations -fno-asynchronous-unwind-tables -fno-strict-aliasing -fstack-protector-strong -malign-data=abi -fwrapv  -I. -I'../..' -Wdate-time -D_FORTIFY_SOURCE=2 -DMKSH_EARLY_LOCALE_TRACKING -DKSH_VERSIONNAME_VENDOR_EXT=\"\ +Debian\" -DMKSH_BUILDMEAT -DMKSH_BUILDSH=1 -D_GNU_SOURCE -DSETUID_CAN_FAIL_WITH_EAGAIN=1 -DHAVE_STRING_POOLING=2 -DHAVE_ATTRIBUTE_BOUNDED=0 -DHAVE_ATTRIBUTE_FORMAT=1 -DHAVE_ATTRIBUTE_NORETURN=1 -DHAVE_ATTRIBUTE_UNUSED=1 -DHAVE_ATTRIBUTE_USED=1 -Wl,-z,relro -Wl,-z,now -Wl,--as-needed -fno-lto -Wno-error conftest.c  || for _f in ${tcfn}*; do case $_f in lksh.1|mksh.1|mksh.faq|mksh.ico) ;; *) rm -f "$_f" ;; esac; done
-] /usr/bin/ld: /tmp/ccv0VA5U.o: in function `main':
+] /usr/bin/ld: /tmp/cc2jRLxM.o: in function `main':
 ] ./builddir/full/./builddir/full/conftest.c:15: undefined reference to `thiswillneverbedefinedIhope'
 ] collect2: error: ld returned 1 exit status
 ==> if invoking as sh should be handled specially... no
 ... if mksh will be built without job control
 $ gcc -g -O2 -ffile-prefix-map=/build/reproducible-path/mksh-59c=. -fstack-protector-strong -Wformat -Werror=format-security -Wall -Wextra -fno-lto -Wno-deprecated-declarations -fno-asynchronous-unwind-tables -fno-strict-aliasing -fstack-protector-strong -malign-data=abi -fwrapv  -I. -I'../..' -Wdate-time -D_FORTIFY_SOURCE=2 -DMKSH_EARLY_LOCALE_TRACKING -DKSH_VERSIONNAME_VENDOR_EXT=\"\ +Debian\" -DMKSH_BUILDMEAT -DMKSH_BUILDSH=1 -D_GNU_SOURCE -DSETUID_CAN_FAIL_WITH_EAGAIN=1 -DHAVE_STRING_POOLING=2 -DHAVE_ATTRIBUTE_BOUNDED=0 -DHAVE_ATTRIBUTE_FORMAT=1 -DHAVE_ATTRIBUTE_NORETURN=1 -DHAVE_ATTRIBUTE_UNUSED=1 -DHAVE_ATTRIBUTE_USED=1 -Wl,-z,relro -Wl,-z,now -Wl,--as-needed -fno-lto -Wno-error conftest.c  || for _f in ${tcfn}*; do case $_f in lksh.1|mksh.1|mksh.faq|mksh.ico) ;; *) rm -f "$_f" ;; esac; done
-] /usr/bin/ld: /tmp/cctcLpx0.o: in function `main':
+] /usr/bin/ld: /tmp/ccJc1qES.o: in function `main':
 ] ./builddir/full/./builddir/full/conftest.c:15: undefined reference to `thiswillneverbedefinedIhope'
 ] collect2: error: ld returned 1 exit status
 ==> if mksh will be built without job control... no
 ... if mksh will be built without job signals
 $ gcc -g -O2 -ffile-prefix-map=/build/reproducible-path/mksh-59c=. -fstack-protector-strong -Wformat -Werror=format-security -Wall -Wextra -fno-lto -Wno-deprecated-declarations -fno-asynchronous-unwind-tables -fno-strict-aliasing -fstack-protector-strong -malign-data=abi -fwrapv  -I. -I'../..' -Wdate-time -D_FORTIFY_SOURCE=2 -DMKSH_EARLY_LOCALE_TRACKING -DKSH_VERSIONNAME_VENDOR_EXT=\"\ +Debian\" -DMKSH_BUILDMEAT -DMKSH_BUILDSH=1 -D_GNU_SOURCE -DSETUID_CAN_FAIL_WITH_EAGAIN=1 -DHAVE_STRING_POOLING=2 -DHAVE_ATTRIBUTE_BOUNDED=0 -DHAVE_ATTRIBUTE_FORMAT=1 -DHAVE_ATTRIBUTE_NORETURN=1 -DHAVE_ATTRIBUTE_UNUSED=1 -DHAVE_ATTRIBUTE_USED=1 -Wl,-z,relro -Wl,-z,now -Wl,--as-needed -fno-lto -Wno-error conftest.c  || for _f in ${tcfn}*; do case $_f in lksh.1|mksh.1|mksh.faq|mksh.ico) ;; *) rm -f "$_f" ;; esac; done
-] /usr/bin/ld: /tmp/ccaIpbh5.o: in function `main':
+] /usr/bin/ld: /tmp/cc8Svown.o: in function `main':
 ] ./builddir/full/./builddir/full/conftest.c:15: undefined reference to `thiswillneverbedefinedIhope'
 ] collect2: error: ld returned 1 exit status
 ==> if mksh will be built without job signals... no
 ... if the default UTF-8 mode is specified
 $ gcc -g -O2 -ffile-prefix-map=/build/reproducible-path/mksh-59c=. -fstack-protector-strong -Wformat -Werror=format-security -Wall -Wextra -fno-lto -Wno-deprecated-declarations -fno-asynchronous-unwind-tables -fno-strict-aliasing -fstack-protector-strong -malign-data=abi -fwrapv  -I. -I'../..' -Wdate-time -D_FORTIFY_SOURCE=2 -DMKSH_EARLY_LOCALE_TRACKING -DKSH_VERSIONNAME_VENDOR_EXT=\"\ +Debian\" -DMKSH_BUILDMEAT -DMKSH_BUILDSH=1 -D_GNU_SOURCE -DSETUID_CAN_FAIL_WITH_EAGAIN=1 -DHAVE_STRING_POOLING=2 -DHAVE_ATTRIBUTE_BOUNDED=0 -DHAVE_ATTRIBUTE_FORMAT=1 -DHAVE_ATTRIBUTE_NORETURN=1 -DHAVE_ATTRIBUTE_UNUSED=1 -DHAVE_ATTRIBUTE_USED=1 -Wl,-z,relro -Wl,-z,now -Wl,--as-needed -fno-lto -Wno-error conftest.c  || for _f in ${tcfn}*; do case $_f in lksh.1|mksh.1|mksh.faq|mksh.ico) ;; *) rm -f "$_f" ;; esac; done
-] /usr/bin/ld: /tmp/cc8WExs2.o: in function `main':
+] /usr/bin/ld: /tmp/ccnxIOlq.o: in function `main':
 ] ./builddir/full/./builddir/full/conftest.c:15: undefined reference to `thiswillneverbedefinedIhope'
 ] collect2: error: ld returned 1 exit status
 ==> if the default UTF-8 mode is specified... no
 ==> if the default UTF-8 mode is disabled... no (implied)
 ... if the MidnightBSD 0.1 ash compatibility mode is requested
 $ gcc -g -O2 -ffile-prefix-map=/build/reproducible-path/mksh-59c=. -fstack-protector-strong -Wformat -Werror=format-security -Wall -Wextra -fno-lto -Wno-deprecated-declarations -fno-asynchronous-unwind-tables -fno-strict-aliasing -fstack-protector-strong -malign-data=abi -fwrapv  -I. -I'../..' -Wdate-time -D_FORTIFY_SOURCE=2 -DMKSH_EARLY_LOCALE_TRACKING -DKSH_VERSIONNAME_VENDOR_EXT=\"\ +Debian\" -DMKSH_BUILDMEAT -DMKSH_BUILDSH=1 -D_GNU_SOURCE -DSETUID_CAN_FAIL_WITH_EAGAIN=1 -DHAVE_STRING_POOLING=2 -DHAVE_ATTRIBUTE_BOUNDED=0 -DHAVE_ATTRIBUTE_FORMAT=1 -DHAVE_ATTRIBUTE_NORETURN=1 -DHAVE_ATTRIBUTE_UNUSED=1 -DHAVE_ATTRIBUTE_USED=1 -Wl,-z,relro -Wl,-z,now -Wl,--as-needed -fno-lto -Wno-error conftest.c  || for _f in ${tcfn}*; do case $_f in lksh.1|mksh.1|mksh.faq|mksh.ico) ;; *) rm -f "$_f" ;; esac; done
-] /usr/bin/ld: /tmp/cci4iaS4.o: in function `main':
+] /usr/bin/ld: /tmp/cc0PgHmZ.o: in function `main':
 ] ./builddir/full/./builddir/full/conftest.c:15: undefined reference to `thiswillneverbedefinedIhope'
 ] collect2: error: ld returned 1 exit status
 ==> if the MidnightBSD 0.1 ash compatibility mode is requested... no
@@ -839,7 +875,7 @@
 ]     9 | int main(int ac, char *av[]) { return (strlcpy(*av, av[1],
 ]       |                                        ^~~~~~~
 ]       |                                        strncpy
-] /usr/bin/ld: /tmp/cc2jtmKs.o: in function `main':
+] /usr/bin/ld: /tmp/ccSgOQaV.o: in function `main':
 ] ./builddir/full/./builddir/full/conftest.c:9: undefined reference to `strlcpy'
 ] collect2: error: ld returned 1 exit status
 ==> strlcpy... no
@@ -1556,10 +1592,10 @@
 Attempting compilation of mksh in static-klibc with CC='klcc'
 CFLAGS='-Os -fomit-frame-pointer -mno-sse -falign-functions=1 -falign-jumps=1 -falign-loops=1 -fno-asynchronous-unwind-tables -g -ffile-prefix-map=/build/reproducible-path/mksh-59c=. -Wformat -Werror=format-security -Wall -Wextra' CPPFLAGS='-Wdate-time -D_FORTIFY_SOURCE=2 -DMKSH_EARLY_LOCALE_TRACKING -DKSH_VERSIONNAME_VENDOR_EXT=\"\ +Debian\" -DMKSH_BUILDMEAT -DMKSH_BINSHPOSIX -DMKSH_BINSHREDUCED -DMKSH_SMALL -DMKSH_SMALL_BUT_FAST'
 LDFLAGS='-Wl,-z,relro -Wl,-z,now -Wl,--as-needed' LDSTATIC='-static' LIBS=''
-+ env CC=klcc CFLAGS=-Os -fomit-frame-pointer -mno-sse -falign-functions=1 -falign-jumps=1 -falign-loops=1 -fno-asynchronous-unwind-tables -g -ffile-prefix-map=/build/reproducible-path/mksh-59c=. -Wformat -Werror=format-security -Wall -Wextra CPPFLAGS=-Wdate-time -D_FORTIFY_SOURCE=2 -DMKSH_EARLY_LOCALE_TRACKING -DKSH_VERSIONNAME_VENDOR_EXT=\"\ +Debian\" -DMKSH_BUILDMEAT -DMKSH_BINSHPOSIX -DMKSH_BINSHREDUCED -DMKSH_SMALL -DMKSH_SMALL_BUT_FAST LDFLAGS=-Wl,-z,relro -Wl,-z,now -Wl,--as-needed LDSTATIC=-static LIBS= sh ../../Build.sh -r
++ env CC=klcc 'CFLAGS=-Os -fomit-frame-pointer -mno-sse -falign-functions=1 -falign-jumps=1 -falign-loops=1 -fno-asynchronous-unwind-tables -g -ffile-prefix-map=/build/reproducible-path/mksh-59c=. -Wformat -Werror=format-security -Wall -Wextra' 'CPPFLAGS=-Wdate-time -D_FORTIFY_SOURCE=2 -DMKSH_EARLY_LOCALE_TRACKING -DKSH_VERSIONNAME_VENDOR_EXT=\"\ +Debian\" -DMKSH_BUILDMEAT -DMKSH_BINSHPOSIX -DMKSH_BINSHREDUCED -DMKSH_SMALL -DMKSH_SMALL_BUT_FAST' 'LDFLAGS=-Wl,-z,relro -Wl,-z,now -Wl,--as-needed' LDSTATIC=-static LIBS= sh ../../Build.sh -r
 For the build logs, demonstrate that /dev/null and /dev/tty exist:
-crw-rw-rw- 1 root root 1, 3 Jun  6 22:24 /dev/null
-crw-rw-rw- 1 root root 5, 0 Jun  6 22:24 /dev/tty
+crw-rw-rw- 1 root root 1, 3 Jul 11 06:46 /dev/null
+crw-rw-rw- 1 root root 5, 0 Aug  6 17:38 /dev/tty
 Flags on entry (plus HAVE_* which are not shown here):
 - CC        <klcc>
 - CFLAGS    <-Os -fomit-frame-pointer -mno-sse -falign-functions=1 -falign-jumps=1 -falign-loops=1 -fno-asynchronous-unwind-tables -g -ffile-prefix-map=/build/reproducible-path/mksh-59c=. -Wformat -Werror=format-security -Wall -Wextra>
@@ -1571,11 +1607,11 @@
 
 Hi from $MirOS: src/bin/mksh/Build.sh,v 1.835 2023/01/26 04:32:50 tg Exp $ on:
 $ uname -a >&2
-| Linux infom01-amd64 6.1.0-22-cloud-amd64 #1 SMP PREEMPT_DYNAMIC Debian 6.1.94-1 (2024-06-21) x86_64 GNU/Linux
-Build.sh: Building The MirBSD Korn Shell (mksh) R59 2023/04/29 on Linux 6.1.0-22-cloud-amd64...
+| Linux i-capture-the-hostname 6.7.12+bpo-amd64 #1 SMP PREEMPT_DYNAMIC Debian 6.7.12-1~bpo12+1 (2024-05-06) x86_64 GNU/Linux
+Build.sh: Building The MirBSD Korn Shell (mksh) R59 2023/04/29 on Linux 6.7.12+bpo-amd64...
 Build.sh: Scanning for functions... please ignore any errors.
 ... which compiler type seems to be used
-$ klcc -E -Os -fomit-frame-pointer -mno-sse -falign-functions=1 -falign-jumps=1 -falign-loops=1 -fno-asynchronous-unwind-tables -g -ffile-prefix-map=/build/reproducible-path/mksh-59c=. -Wformat -Werror=format-security -Wall -Wextra -I. -I'../..' -Wdate-time -D_FORTIFY_SOURCE=2 -DMKSH_EARLY_LOCALE_TRACKING -DKSH_VERSIONNAME_VENDOR_EXT=\"\ +Debian\" -DMKSH_BUILDMEAT -DMKSH_BINSHPOSIX -DMKSH_BINSHREDUCED -DMKSH_SMALL -DMKSH_SMALL_BUT_FAST -DMKSH_BUILDSH=1 -D_GNU_SOURCE -DSETUID_CAN_FAIL_WITH_EAGAIN=1   conftest.c |     sed -n '/^ *[ce]t *= */s/^ *\([ce]t\) *= */=/p' | tr -d \015 >x
+$ klcc -E -Os -fomit-frame-pointer -mno-sse -falign-functions=1 -falign-jumps=1 -falign-loops=1 -fno-asynchronous-unwind-tables -g -ffile-prefix-map=/build/reproducible-path/mksh-59c=. -Wformat -Werror=format-security -Wall -Wextra -I. -I'../..' -Wdate-time -D_FORTIFY_SOURCE=2 -DMKSH_EARLY_LOCALE_TRACKING -DKSH_VERSIONNAME_VENDOR_EXT=\"\ +Debian\" -DMKSH_BUILDMEAT -DMKSH_BINSHPOSIX -DMKSH_BINSHREDUCED -DMKSH_SMALL -DMKSH_SMALL_BUT_FAST -DMKSH_BUILDSH=1 -D_GNU_SOURCE -DSETUID_CAN_FAIL_WITH_EAGAIN=1   conftest.c |     sed -n '/^ *[ce]t *= */s/^ *\([ce]t\) *= */\1=/p' | tr -d \\015 >x
 [ ct="gcc"
 [ et="klibc"
 $ klcc -Os -fomit-frame-pointer -mno-sse -falign-functions=1 -falign-jumps=1 -falign-loops=1 -fno-asynchronous-unwind-tables -g -ffile-prefix-map=/build/reproducible-path/mksh-59c=. -Wformat -Werror=format-security -Wall -Wextra  -I. -I'../..' -Wdate-time -D_FORTIFY_SOURCE=2 -DMKSH_EARLY_LOCALE_TRACKING -DKSH_VERSIONNAME_VENDOR_EXT=\"\ +Debian\" -DMKSH_BUILDMEAT -DMKSH_BINSHPOSIX -DMKSH_BINSHREDUCED -DMKSH_SMALL -DMKSH_SMALL_BUT_FAST -DMKSH_BUILDSH=1 -D_GNU_SOURCE -DSETUID_CAN_FAIL_WITH_EAGAIN=1 -Wl,-z,relro -Wl,-z,now -Wl,--as-needed -static  -v conftest.c 
@@ -1590,7 +1626,7 @@
 | Supported LTO compression algorithms: zlib zstd
 | gcc version 12.2.0 (Debian 12.2.0-14) 
 | COLLECT_GCC_OPTIONS='-D' '__KLIBC__=2' '-D' '__KLIBC_MINOR__=0' '-D' '_BITSIZE=64' '-fno-stack-protector' '-fwrapv' '-fno-PIE' '-fno-builtin-bcmp' '-fcommon' '-ggdb' '-m64' '-nostdinc' '-iwithprefix' 'include' '-D' '__KLIBC__=2' '-D' '__KLIBC_MINOR__=0' '-D' '_BITSIZE=64' '-I' '/usr/lib/klibc/include/arch/x86_64' '-I' '/usr/lib/klibc/include/bits64' '-I' '/usr/lib/klibc/include' '-O' '-Os' '-fomit-frame-pointer' '-mno-sse' '-falign-functions=1' '-falign-jumps=1' '-falign-loops=1' '-fno-asynchronous-unwind-tables' '-g' '-ffile-prefix-map=/build/reproducible-path/mksh-59c=.' '-Wformat=1' '-Werror=format-security' '-Wall' '-Wextra' '-I' '.' '-I' '../..' '-Wdate-time' '-D' '_FORTIFY_SOURCE=2' '-D' 'MKSH_EARLY_LOCALE_TRACKING' '-D' 'KSH_VERSIONNAME_VENDOR_EXT=" +Debian"' '-D' 'MKSH_BUILDMEAT' '-D' 'MKSH_BINSHPOSIX' '-D' 'MKSH_BINSHREDUCED' '-D' 'MKSH_SMALL' '-D' 'MKSH_SMALL_BUT_FAST' '-D' 'MKSH_BUILDSH=1' '-D' '_GNU_SOURCE' '-D' 'SETUID_CAN_FAIL_WITH_EAGAIN=1' '-v' '-mtune=generic' '-march=x86-64' '-dumpdir' 'a-'
-|  /usr/lib/gcc/x86_64-linux-gnu/12/cc1 -quiet -nostdinc -v -I /usr/lib/klibc/include/arch/x86_64 -I /usr/lib/klibc/include/bits64 -I /usr/lib/klibc/include -I . -I ../.. -imultiarch x86_64-linux-gnu -D __KLIBC__=2 -D __KLIBC_MINOR__=0 -D _BITSIZE=64 -D __KLIBC__=2 -D __KLIBC_MINOR__=0 -D _BITSIZE=64 -D _FORTIFY_SOURCE=2 -D MKSH_EARLY_LOCALE_TRACKING -D KSH_VERSIONNAME_VENDOR_EXT=" +Debian" -D MKSH_BUILDMEAT -D MKSH_BINSHPOSIX -D MKSH_BINSHREDUCED -D MKSH_SMALL -D MKSH_SMALL_BUT_FAST -D MKSH_BUILDSH=1 -D _GNU_SOURCE -D SETUID_CAN_FAIL_WITH_EAGAIN=1 -iwithprefix include conftest.c -quiet -dumpdir a- -dumpbase conftest.c -dumpbase-ext .c -m64 -mno-sse -mtune=generic -march=x86-64 -ggdb -g -O -Os -Wformat=1 -Werror=format-security -Wall -Wextra -Wdate-time -version -fno-stack-protector -fwrapv -fno-PIE -fno-builtin-bcmp -fcommon -fomit-frame-pointer -falign-functions=1 -falign-jumps=1 -falign-loops=1 -fno-asynchronous-unwind-tables -ffile-prefix-map=/build/reproducible-path/mksh-59c=. -o /tmp/cceCmocr.s
+|  /usr/lib/gcc/x86_64-linux-gnu/12/cc1 -quiet -nostdinc -v -I /usr/lib/klibc/include/arch/x86_64 -I /usr/lib/klibc/include/bits64 -I /usr/lib/klibc/include -I . -I ../.. -imultiarch x86_64-linux-gnu -D __KLIBC__=2 -D __KLIBC_MINOR__=0 -D _BITSIZE=64 -D __KLIBC__=2 -D __KLIBC_MINOR__=0 -D _BITSIZE=64 -D _FORTIFY_SOURCE=2 -D MKSH_EARLY_LOCALE_TRACKING -D KSH_VERSIONNAME_VENDOR_EXT=" +Debian" -D MKSH_BUILDMEAT -D MKSH_BINSHPOSIX -D MKSH_BINSHREDUCED -D MKSH_SMALL -D MKSH_SMALL_BUT_FAST -D MKSH_BUILDSH=1 -D _GNU_SOURCE -D SETUID_CAN_FAIL_WITH_EAGAIN=1 -iwithprefix include conftest.c -quiet -dumpdir a- -dumpbase conftest.c -dumpbase-ext .c -m64 -mno-sse -mtune=generic -march=x86-64 -ggdb -g -O -Os -Wformat=1 -Werror=format-security -Wall -Wextra -Wdate-time -version -fno-stack-protector -fwrapv -fno-PIE -fno-builtin-bcmp -fcommon -fomit-frame-pointer -falign-functions=1 -falign-jumps=1 -falign-loops=1 -fno-asynchronous-unwind-tables -ffile-prefix-map=/build/reproducible-path/mksh-59c=. -o /tmp/ccaWbSqO.s
 | GNU C17 (Debian 12.2.0-14) version 12.2.0 (x86_64-linux-gnu)
 | 	compiled by GNU C version 12.2.0, GMP version 6.2.1, MPFR version 4.1.1-p1, MPC version 1.3.1, isl version isl-0.25-GMP
 | 
@@ -1612,12 +1648,12 @@
 | GGC heuristics: --param ggc-min-expand=100 --param ggc-min-heapsize=131072
 | Compiler executable checksum: cc72d2b9b5048fedc2be9051c917b40b
 | COLLECT_GCC_OPTIONS='-D' '__KLIBC__=2' '-D' '__KLIBC_MINOR__=0' '-D' '_BITSIZE=64' '-fno-stack-protector' '-fwrapv' '-fno-PIE' '-fno-builtin-bcmp' '-fcommon' '-ggdb' '-m64' '-nostdinc' '-iwithprefix' 'include' '-D' '__KLIBC__=2' '-D' '__KLIBC_MINOR__=0' '-D' '_BITSIZE=64' '-I' '/usr/lib/klibc/include/arch/x86_64' '-I' '/usr/lib/klibc/include/bits64' '-I' '/usr/lib/klibc/include' '-O' '-Os' '-fomit-frame-pointer' '-mno-sse' '-falign-functions=1' '-falign-jumps=1' '-falign-loops=1' '-fno-asynchronous-unwind-tables' '-g' '-ffile-prefix-map=/build/reproducible-path/mksh-59c=.' '-Wformat=1' '-Werror=format-security' '-Wall' '-Wextra' '-I' '.' '-I' '../..' '-Wdate-time' '-D' '_FORTIFY_SOURCE=2' '-D' 'MKSH_EARLY_LOCALE_TRACKING' '-D' 'KSH_VERSIONNAME_VENDOR_EXT=" +Debian"' '-D' 'MKSH_BUILDMEAT' '-D' 'MKSH_BINSHPOSIX' '-D' 'MKSH_BINSHREDUCED' '-D' 'MKSH_SMALL' '-D' 'MKSH_SMALL_BUT_FAST' '-D' 'MKSH_BUILDSH=1' '-D' '_GNU_SOURCE' '-D' 'SETUID_CAN_FAIL_WITH_EAGAIN=1' '-v' '-mtune=generic' '-march=x86-64' '-dumpdir' 'a-'
-|  as -v -I /usr/lib/klibc/include/arch/x86_64 -I /usr/lib/klibc/include/bits64 -I /usr/lib/klibc/include -I . -I ../.. --gdwarf-5 --64 -o /tmp/ccgFPIGJ.o /tmp/cceCmocr.s
+|  as -v -I /usr/lib/klibc/include/arch/x86_64 -I /usr/lib/klibc/include/bits64 -I /usr/lib/klibc/include -I . -I ../.. --gdwarf-5 --64 -o /tmp/ccCVFWQg.o /tmp/ccaWbSqO.s
 | GNU assembler version 2.40 (x86_64-linux-gnu) using BFD version (GNU Binutils for Debian) 2.40
 | COMPILER_PATH=/usr/lib/gcc/x86_64-linux-gnu/12/:/usr/lib/gcc/x86_64-linux-gnu/12/:/usr/lib/gcc/x86_64-linux-gnu/:/usr/lib/gcc/x86_64-linux-gnu/12/:/usr/lib/gcc/x86_64-linux-gnu/
 | LIBRARY_PATH=/usr/lib/gcc/x86_64-linux-gnu/12/:/usr/lib/gcc/x86_64-linux-gnu/12/../../../x86_64-linux-gnu/:/usr/lib/gcc/x86_64-linux-gnu/12/../../../../lib/:/lib/x86_64-linux-gnu/:/lib/../lib/:/usr/lib/x86_64-linux-gnu/:/usr/lib/../lib/:/usr/lib/gcc/x86_64-linux-gnu/12/../../../:/lib/:/usr/lib/
 | COLLECT_GCC_OPTIONS='-D' '__KLIBC__=2' '-D' '__KLIBC_MINOR__=0' '-D' '_BITSIZE=64' '-fno-stack-protector' '-fwrapv' '-fno-PIE' '-fno-builtin-bcmp' '-fcommon' '-ggdb' '-m64' '-nostdinc' '-iwithprefix' 'include' '-D' '__KLIBC__=2' '-D' '__KLIBC_MINOR__=0' '-D' '_BITSIZE=64' '-I' '/usr/lib/klibc/include/arch/x86_64' '-I' '/usr/lib/klibc/include/bits64' '-I' '/usr/lib/klibc/include' '-O' '-Os' '-fomit-frame-pointer' '-mno-sse' '-falign-functions=1' '-falign-jumps=1' '-falign-loops=1' '-fno-asynchronous-unwind-tables' '-g' '-ffile-prefix-map=/build/reproducible-path/mksh-59c=.' '-Wformat=1' '-Werror=format-security' '-Wall' '-Wextra' '-I' '.' '-I' '../..' '-Wdate-time' '-D' '_FORTIFY_SOURCE=2' '-D' 'MKSH_EARLY_LOCALE_TRACKING' '-D' 'KSH_VERSIONNAME_VENDOR_EXT=" +Debian"' '-D' 'MKSH_BUILDMEAT' '-D' 'MKSH_BINSHPOSIX' '-D' 'MKSH_BINSHREDUCED' '-D' 'MKSH_SMALL' '-D' 'MKSH_SMALL_BUT_FAST' '-D' 'MKSH_BUILDSH=1' '-D' '_GNU_SOURCE' '-D' 'SETUID_CAN_FAIL_WITH_EAGAIN=1' '-v' '-mtune=generic' '-march=x86-64' '-dumpdir' 'a.'
-|  /usr/lib/gcc/x86_64-linux-gnu/12/collect2 -plugin /usr/lib/gcc/x86_64-linux-gnu/12/liblto_plugin.so -plugin-opt=/usr/lib/gcc/x86_64-linux-gnu/12/lto-wrapper -plugin-opt=-fresolution=/tmp/ccZBuQIK.res -plugin-opt=-pass-through=-lgcc -plugin-opt=-pass-through=-lgcc_s -plugin-opt=-pass-through=-lc -plugin-opt=-pass-through=-lgcc -plugin-opt=-pass-through=-lgcc_s --build-id --eh-frame-hdr -m elf_x86_64 --hash-style=gnu --as-needed -dynamic-linker /lib64/ld-linux-x86-64.so.2 -pie /usr/lib/gcc/x86_64-linux-gnu/12/../../../x86_64-linux-gnu/Scrt1.o /usr/lib/gcc/x86_64-linux-gnu/12/../../../x86_64-linux-gnu/crti.o /usr/lib/gcc/x86_64-linux-gnu/12/crtbeginS.o -L/usr/lib/gcc/x86_64-linux-gnu/12 -L/usr/lib/gcc/x86_64-linux-gnu/12/../../../x86_64-linux-gnu -L/usr/lib/gcc/x86_64-linux-gnu/12/../../../../lib -L/lib/x86_64-linux-gnu -L/lib/../lib -L/usr/lib/x86_64-linux-gnu -L/usr/lib/../lib -L/usr/lib/gcc/x86_64-linux-gnu/12/../../.. /tmp/ccgFPIGJ.o -lgcc --push-state --as-needed -lgcc_s --pop-state -lc -lgcc --push-state --as-needed -lgcc_s --pop-state /usr/lib/gcc/x86_64-linux-gnu/12/crtendS.o /usr/lib/gcc/x86_64-linux-gnu/12/../../../x86_64-linux-gnu/crtn.o
+|  /usr/lib/gcc/x86_64-linux-gnu/12/collect2 -plugin /usr/lib/gcc/x86_64-linux-gnu/12/liblto_plugin.so -plugin-opt=/usr/lib/gcc/x86_64-linux-gnu/12/lto-wrapper -plugin-opt=-fresolution=/tmp/ccZTBmA9.res -plugin-opt=-pass-through=-lgcc -plugin-opt=-pass-through=-lgcc_s -plugin-opt=-pass-through=-lc -plugin-opt=-pass-through=-lgcc -plugin-opt=-pass-through=-lgcc_s --build-id --eh-frame-hdr -m elf_x86_64 --hash-style=gnu --as-needed -dynamic-linker /lib64/ld-linux-x86-64.so.2 -pie /usr/lib/gcc/x86_64-linux-gnu/12/../../../x86_64-linux-gnu/Scrt1.o /usr/lib/gcc/x86_64-linux-gnu/12/../../../x86_64-linux-gnu/crti.o /usr/lib/gcc/x86_64-linux-gnu/12/crtbeginS.o -L/usr/lib/gcc/x86_64-linux-gnu/12 -L/usr/lib/gcc/x86_64-linux-gnu/12/../../../x86_64-linux-gnu -L/usr/lib/gcc/x86_64-linux-gnu/12/../../../../lib -L/lib/x86_64-linux-gnu -L/lib/../lib -L/usr/lib/x86_64-linux-gnu -L/usr/lib/../lib -L/usr/lib/gcc/x86_64-linux-gnu/12/../../.. /tmp/ccCVFWQg.o -lgcc --push-state --as-needed -lgcc_s --pop-state -lc -lgcc --push-state --as-needed -lgcc_s --pop-state /usr/lib/gcc/x86_64-linux-gnu/12/crtendS.o /usr/lib/gcc/x86_64-linux-gnu/12/../../../x86_64-linux-gnu/crtn.o
 | COLLECT_GCC_OPTIONS='-D' '__KLIBC__=2' '-D' '__KLIBC_MINOR__=0' '-D' '_BITSIZE=64' '-fno-stack-protector' '-fwrapv' '-fno-PIE' '-fno-builtin-bcmp' '-fcommon' '-ggdb' '-m64' '-nostdinc' '-iwithprefix' 'include' '-D' '__KLIBC__=2' '-D' '__KLIBC_MINOR__=0' '-D' '_BITSIZE=64' '-I' '/usr/lib/klibc/include/arch/x86_64' '-I' '/usr/lib/klibc/include/bits64' '-I' '/usr/lib/klibc/include' '-O' '-Os' '-fomit-frame-pointer' '-mno-sse' '-falign-functions=1' '-falign-jumps=1' '-falign-loops=1' '-fno-asynchronous-unwind-tables' '-g' '-ffile-prefix-map=/build/reproducible-path/mksh-59c=.' '-Wformat=1' '-Werror=format-security' '-Wall' '-Wextra' '-I' '.' '-I' '../..' '-Wdate-time' '-D' '_FORTIFY_SOURCE=2' '-D' 'MKSH_EARLY_LOCALE_TRACKING' '-D' 'KSH_VERSIONNAME_VENDOR_EXT=" +Debian"' '-D' 'MKSH_BUILDMEAT' '-D' 'MKSH_BINSHPOSIX' '-D' 'MKSH_BINSHREDUCED' '-D' 'MKSH_SMALL' '-D' 'MKSH_SMALL_BUT_FAST' '-D' 'MKSH_BUILDSH=1' '-D' '_GNU_SOURCE' '-D' 'SETUID_CAN_FAIL_WITH_EAGAIN=1' '-v' '-mtune=generic' '-march=x86-64' '-dumpdir' 'a.'
 $ eval echo "\`$CC $CFLAGS $Cg $CPPFLAGS $LDFLAGS $NOWARN $LIBS -dumpmachine\`" \
 		 "gcc\`$CC $CFLAGS $Cg $CPPFLAGS $LDFLAGS $NOWARN $LIBS -dumpversion\`"
@@ -2722,10 +2758,10 @@
 Attempting compilation of mksh in static-musl with CC='musl-gcc'
 CFLAGS='-Os -g -ffile-prefix-map=/build/reproducible-path/mksh-59c=. -Wformat -Werror=format-security -Wall -Wextra' CPPFLAGS='-Wdate-time -D_FORTIFY_SOURCE=2 -DMKSH_EARLY_LOCALE_TRACKING -DKSH_VERSIONNAME_VENDOR_EXT=\"\ +Debian\" -DMKSH_BUILDMEAT -DMKSH_BINSHPOSIX -DMKSH_BINSHREDUCED -DMKSH_SMALL -DMKSH_SMALL_BUT_FAST'
 LDFLAGS='-Wl,-z,relro -Wl,-z,now -Wl,--as-needed' LDSTATIC='-static' LIBS=''
-+ env CC=musl-gcc CFLAGS=-Os -g -ffile-prefix-map=/build/reproducible-path/mksh-59c=. -Wformat -Werror=format-security -Wall -Wextra CPPFLAGS=-Wdate-time -D_FORTIFY_SOURCE=2 -DMKSH_EARLY_LOCALE_TRACKING -DKSH_VERSIONNAME_VENDOR_EXT=\"\ +Debian\" -DMKSH_BUILDMEAT -DMKSH_BINSHPOSIX -DMKSH_BINSHREDUCED -DMKSH_SMALL -DMKSH_SMALL_BUT_FAST LDFLAGS=-Wl,-z,relro -Wl,-z,now -Wl,--as-needed LDSTATIC=-static LIBS= sh ../../Build.sh -r
++ env CC=musl-gcc 'CFLAGS=-Os -g -ffile-prefix-map=/build/reproducible-path/mksh-59c=. -Wformat -Werror=format-security -Wall -Wextra' 'CPPFLAGS=-Wdate-time -D_FORTIFY_SOURCE=2 -DMKSH_EARLY_LOCALE_TRACKING -DKSH_VERSIONNAME_VENDOR_EXT=\"\ +Debian\" -DMKSH_BUILDMEAT -DMKSH_BINSHPOSIX -DMKSH_BINSHREDUCED -DMKSH_SMALL -DMKSH_SMALL_BUT_FAST' 'LDFLAGS=-Wl,-z,relro -Wl,-z,now -Wl,--as-needed' LDSTATIC=-static LIBS= sh ../../Build.sh -r
 For the build logs, demonstrate that /dev/null and /dev/tty exist:
-crw-rw-rw- 1 root root 1, 3 Jun  6 22:24 /dev/null
-crw-rw-rw- 1 root root 5, 0 Jun  6 22:24 /dev/tty
+crw-rw-rw- 1 root root 1, 3 Jul 11 06:46 /dev/null
+crw-rw-rw- 1 root root 5, 0 Aug  6 17:40 /dev/tty
 Flags on entry (plus HAVE_* which are not shown here):
 - CC        <musl-gcc>
 - CFLAGS    <-Os -g -ffile-prefix-map=/build/reproducible-path/mksh-59c=. -Wformat -Werror=format-security -Wall -Wextra>
@@ -2737,11 +2773,11 @@
 
 Hi from $MirOS: src/bin/mksh/Build.sh,v 1.835 2023/01/26 04:32:50 tg Exp $ on:
 $ uname -a >&2
-| Linux infom01-amd64 6.1.0-22-cloud-amd64 #1 SMP PREEMPT_DYNAMIC Debian 6.1.94-1 (2024-06-21) x86_64 GNU/Linux
-Build.sh: Building The MirBSD Korn Shell (mksh) R59 2023/04/29 on Linux 6.1.0-22-cloud-amd64...
+| Linux i-capture-the-hostname 6.7.12+bpo-amd64 #1 SMP PREEMPT_DYNAMIC Debian 6.7.12-1~bpo12+1 (2024-05-06) x86_64 GNU/Linux
+Build.sh: Building The MirBSD Korn Shell (mksh) R59 2023/04/29 on Linux 6.7.12+bpo-amd64...
 Build.sh: Scanning for functions... please ignore any errors.
 ... which compiler type seems to be used
-$ musl-gcc -E -Os -g -ffile-prefix-map=/build/reproducible-path/mksh-59c=. -Wformat -Werror=format-security -Wall -Wextra -I. -I'../..' -Wdate-time -D_FORTIFY_SOURCE=2 -DMKSH_EARLY_LOCALE_TRACKING -DKSH_VERSIONNAME_VENDOR_EXT=\"\ +Debian\" -DMKSH_BUILDMEAT -DMKSH_BINSHPOSIX -DMKSH_BINSHREDUCED -DMKSH_SMALL -DMKSH_SMALL_BUT_FAST -DMKSH_BUILDSH=1 -D_GNU_SOURCE -DSETUID_CAN_FAIL_WITH_EAGAIN=1   conftest.c |     sed -n '/^ *[ce]t *= */s/^ *\([ce]t\) *= */=/p' | tr -d \015 >x
+$ musl-gcc -E -Os -g -ffile-prefix-map=/build/reproducible-path/mksh-59c=. -Wformat -Werror=format-security -Wall -Wextra -I. -I'../..' -Wdate-time -D_FORTIFY_SOURCE=2 -DMKSH_EARLY_LOCALE_TRACKING -DKSH_VERSIONNAME_VENDOR_EXT=\"\ +Debian\" -DMKSH_BUILDMEAT -DMKSH_BINSHPOSIX -DMKSH_BINSHREDUCED -DMKSH_SMALL -DMKSH_SMALL_BUT_FAST -DMKSH_BUILDSH=1 -D_GNU_SOURCE -DSETUID_CAN_FAIL_WITH_EAGAIN=1   conftest.c |     sed -n '/^ *[ce]t *= */s/^ *\([ce]t\) *= */\1=/p' | tr -d \\015 >x
 [ ct="gcc"
 [ et="unknown"
 $ musl-gcc -Os -g -ffile-prefix-map=/build/reproducible-path/mksh-59c=. -Wformat -Werror=format-security -Wall -Wextra  -I. -I'../..' -Wdate-time -D_FORTIFY_SOURCE=2 -DMKSH_EARLY_LOCALE_TRACKING -DKSH_VERSIONNAME_VENDOR_EXT=\"\ +Debian\" -DMKSH_BUILDMEAT -DMKSH_BINSHPOSIX -DMKSH_BINSHREDUCED -DMKSH_SMALL -DMKSH_SMALL_BUT_FAST -DMKSH_BUILDSH=1 -D_GNU_SOURCE -DSETUID_CAN_FAIL_WITH_EAGAIN=1 -Wl,-z,relro -Wl,-z,now -Wl,--as-needed -static  -v conftest.c 
@@ -2758,7 +2794,7 @@
 | Supported LTO compression algorithms: zlib zstd
 | gcc version 12.2.0 (Debian 12.2.0-14) 
 | COLLECT_GCC_OPTIONS='-Os' '-g' '-ffile-prefix-map=/build/reproducible-path/mksh-59c=.' '-Wformat=1' '-Werror=format-security' '-Wall' '-Wextra' '-I' '.' '-I' '../..' '-Wdate-time' '-D' '_FORTIFY_SOURCE=2' '-D' 'MKSH_EARLY_LOCALE_TRACKING' '-D' 'KSH_VERSIONNAME_VENDOR_EXT=" +Debian"' '-D' 'MKSH_BUILDMEAT' '-D' 'MKSH_BINSHPOSIX' '-D' 'MKSH_BINSHREDUCED' '-D' 'MKSH_SMALL' '-D' 'MKSH_SMALL_BUT_FAST' '-D' 'MKSH_BUILDSH=1' '-D' '_GNU_SOURCE' '-D' 'SETUID_CAN_FAIL_WITH_EAGAIN=1' '-static' '-v' '-specs=/usr/lib/x86_64-linux-musl/musl-gcc.specs' '-mtune=generic' '-march=x86-64' '-dumpdir' 'a-'
-|  /usr/lib/gcc/x86_64-linux-gnu/12/cc1 -quiet -v -I . -I ../.. -imultiarch x86_64-linux-gnu -D _FORTIFY_SOURCE=2 -D MKSH_EARLY_LOCALE_TRACKING -D KSH_VERSIONNAME_VENDOR_EXT=" +Debian" -D MKSH_BUILDMEAT -D MKSH_BINSHPOSIX -D MKSH_BINSHREDUCED -D MKSH_SMALL -D MKSH_SMALL_BUT_FAST -D MKSH_BUILDSH=1 -D _GNU_SOURCE -D SETUID_CAN_FAIL_WITH_EAGAIN=1 conftest.c -nostdinc -isystem /usr/include/x86_64-linux-musl -isystem /usr/lib/gcc/x86_64-linux-gnu/12/include -quiet -dumpdir a- -dumpbase conftest.c -dumpbase-ext .c -mtune=generic -march=x86-64 -g -Os -Wformat=1 -Werror=format-security -Wall -Wextra -Wdate-time -version -ffile-prefix-map=/build/reproducible-path/mksh-59c=. -fasynchronous-unwind-tables -o /tmp/cc3iUBEV.s
+|  /usr/lib/gcc/x86_64-linux-gnu/12/cc1 -quiet -v -I . -I ../.. -imultiarch x86_64-linux-gnu -D _FORTIFY_SOURCE=2 -D MKSH_EARLY_LOCALE_TRACKING -D KSH_VERSIONNAME_VENDOR_EXT=" +Debian" -D MKSH_BUILDMEAT -D MKSH_BINSHPOSIX -D MKSH_BINSHREDUCED -D MKSH_SMALL -D MKSH_SMALL_BUT_FAST -D MKSH_BUILDSH=1 -D _GNU_SOURCE -D SETUID_CAN_FAIL_WITH_EAGAIN=1 conftest.c -nostdinc -isystem /usr/include/x86_64-linux-musl -isystem /usr/lib/gcc/x86_64-linux-gnu/12/include -quiet -dumpdir a- -dumpbase conftest.c -dumpbase-ext .c -mtune=generic -march=x86-64 -g -Os -Wformat=1 -Werror=format-security -Wall -Wextra -Wdate-time -version -ffile-prefix-map=/build/reproducible-path/mksh-59c=. -fasynchronous-unwind-tables -o /tmp/ccFJwYeF.s
 | GNU C17 (Debian 12.2.0-14) version 12.2.0 (x86_64-linux-gnu)
 | 	compiled by GNU C version 12.2.0, GMP version 6.2.1, MPFR version 4.1.1-p1, MPC version 1.3.1, isl version isl-0.25-GMP
 | 
@@ -2778,12 +2814,12 @@
 | GGC heuristics: --param ggc-min-expand=100 --param ggc-min-heapsize=131072
 | Compiler executable checksum: cc72d2b9b5048fedc2be9051c917b40b
 | COLLECT_GCC_OPTIONS='-Os' '-g' '-ffile-prefix-map=/build/reproducible-path/mksh-59c=.' '-Wformat=1' '-Werror=format-security' '-Wall' '-Wextra' '-I' '.' '-I' '../..' '-Wdate-time' '-D' '_FORTIFY_SOURCE=2' '-D' 'MKSH_EARLY_LOCALE_TRACKING' '-D' 'KSH_VERSIONNAME_VENDOR_EXT=" +Debian"' '-D' 'MKSH_BUILDMEAT' '-D' 'MKSH_BINSHPOSIX' '-D' 'MKSH_BINSHREDUCED' '-D' 'MKSH_SMALL' '-D' 'MKSH_SMALL_BUT_FAST' '-D' 'MKSH_BUILDSH=1' '-D' '_GNU_SOURCE' '-D' 'SETUID_CAN_FAIL_WITH_EAGAIN=1' '-static' '-v' '-specs=/usr/lib/x86_64-linux-musl/musl-gcc.specs' '-mtune=generic' '-march=x86-64' '-dumpdir' 'a-'
-|  as -v -I . -I ../.. --gdwarf-5 --64 -o /tmp/ccJV7dfN.o /tmp/cc3iUBEV.s
+|  as -v -I . -I ../.. --gdwarf-5 --64 -o /tmp/ccN64qZy.o /tmp/ccFJwYeF.s
 | GNU assembler version 2.40 (x86_64-linux-gnu) using BFD version (GNU Binutils for Debian) 2.40
 | COMPILER_PATH=/usr/lib/gcc/x86_64-linux-gnu/12/:/usr/lib/gcc/x86_64-linux-gnu/12/:/usr/lib/gcc/x86_64-linux-gnu/:/usr/lib/gcc/x86_64-linux-gnu/12/:/usr/lib/gcc/x86_64-linux-gnu/
 | LIBRARY_PATH=/usr/lib/gcc/x86_64-linux-gnu/12/:/usr/lib/gcc/x86_64-linux-gnu/12/../../../x86_64-linux-gnu/:/usr/lib/gcc/x86_64-linux-gnu/12/../../../../lib/:/lib/x86_64-linux-gnu/:/lib/../lib/:/usr/lib/x86_64-linux-gnu/:/usr/lib/../lib/:/usr/lib/gcc/x86_64-linux-gnu/12/../../../:/lib/:/usr/lib/
 | COLLECT_GCC_OPTIONS='-Os' '-g' '-ffile-prefix-map=/build/reproducible-path/mksh-59c=.' '-Wformat=1' '-Werror=format-security' '-Wall' '-Wextra' '-I' '.' '-I' '../..' '-Wdate-time' '-D' '_FORTIFY_SOURCE=2' '-D' 'MKSH_EARLY_LOCALE_TRACKING' '-D' 'KSH_VERSIONNAME_VENDOR_EXT=" +Debian"' '-D' 'MKSH_BUILDMEAT' '-D' 'MKSH_BINSHPOSIX' '-D' 'MKSH_BINSHREDUCED' '-D' 'MKSH_SMALL' '-D' 'MKSH_SMALL_BUT_FAST' '-D' 'MKSH_BUILDSH=1' '-D' '_GNU_SOURCE' '-D' 'SETUID_CAN_FAIL_WITH_EAGAIN=1' '-static' '-v' '-specs=/usr/lib/x86_64-linux-musl/musl-gcc.specs' '-mtune=generic' '-march=x86-64' '-dumpdir' 'a.'
-|  /usr/lib/gcc/x86_64-linux-gnu/12/collect2 -plugin /usr/lib/gcc/x86_64-linux-gnu/12/liblto_plugin.so -plugin-opt=/usr/lib/gcc/x86_64-linux-gnu/12/lto-wrapper -plugin-opt=-fresolution=/tmp/ccAfGeFw.res -plugin-opt=-pass-through=/usr/lib/gcc/x86_64-linux-gnu/12/libgcc.a -plugin-opt=-pass-through=/usr/lib/gcc/x86_64-linux-gnu/12/libgcc_eh.a -plugin-opt=-pass-through=-lc -dynamic-linker /lib/ld-musl-x86_64.so.1 -nostdlib -static /usr/lib/x86_64-linux-musl/Scrt1.o /usr/lib/x86_64-linux-musl/crti.o /usr/lib/gcc/x86_64-linux-gnu/12/crtbeginS.o -L/usr/lib/x86_64-linux-musl -L /usr/lib/gcc/x86_64-linux-gnu/12/. -z relro -z now --as-needed /tmp/ccJV7dfN.o --start-group /usr/lib/gcc/x86_64-linux-gnu/12/libgcc.a /usr/lib/gcc/x86_64-linux-gnu/12/libgcc_eh.a -lc --end-group /usr/lib/gcc/x86_64-linux-gnu/12/crtendS.o /usr/lib/x86_64-linux-musl/crtn.o
+|  /usr/lib/gcc/x86_64-linux-gnu/12/collect2 -plugin /usr/lib/gcc/x86_64-linux-gnu/12/liblto_plugin.so -plugin-opt=/usr/lib/gcc/x86_64-linux-gnu/12/lto-wrapper -plugin-opt=-fresolution=/tmp/ccA0OhVH.res -plugin-opt=-pass-through=/usr/lib/gcc/x86_64-linux-gnu/12/libgcc.a -plugin-opt=-pass-through=/usr/lib/gcc/x86_64-linux-gnu/12/libgcc_eh.a -plugin-opt=-pass-through=-lc -dynamic-linker /lib/ld-musl-x86_64.so.1 -nostdlib -static /usr/lib/x86_64-linux-musl/Scrt1.o /usr/lib/x86_64-linux-musl/crti.o /usr/lib/gcc/x86_64-linux-gnu/12/crtbeginS.o -L/usr/lib/x86_64-linux-musl -L /usr/lib/gcc/x86_64-linux-gnu/12/. -z relro -z now --as-needed /tmp/ccN64qZy.o --start-group /usr/lib/gcc/x86_64-linux-gnu/12/libgcc.a /usr/lib/gcc/x86_64-linux-gnu/12/libgcc_eh.a -lc --end-group /usr/lib/gcc/x86_64-linux-gnu/12/crtendS.o /usr/lib/x86_64-linux-musl/crtn.o
 | COLLECT_GCC_OPTIONS='-Os' '-g' '-ffile-prefix-map=/build/reproducible-path/mksh-59c=.' '-Wformat=1' '-Werror=format-security' '-Wall' '-Wextra' '-I' '.' '-I' '../..' '-Wdate-time' '-D' '_FORTIFY_SOURCE=2' '-D' 'MKSH_EARLY_LOCALE_TRACKING' '-D' 'KSH_VERSIONNAME_VENDOR_EXT=" +Debian"' '-D' 'MKSH_BUILDMEAT' '-D' 'MKSH_BINSHPOSIX' '-D' 'MKSH_BINSHREDUCED' '-D' 'MKSH_SMALL' '-D' 'MKSH_SMALL_BUT_FAST' '-D' 'MKSH_BUILDSH=1' '-D' '_GNU_SOURCE' '-D' 'SETUID_CAN_FAIL_WITH_EAGAIN=1' '-static' '-v' '-specs=/usr/lib/x86_64-linux-musl/musl-gcc.specs' '-mtune=generic' '-march=x86-64' '-dumpdir' 'a.'
 $ eval echo "\`$CC $CFLAGS $Cg $CPPFLAGS $LDFLAGS $NOWARN $LIBS -dumpmachine\`" \
 		 "gcc\`$CC $CFLAGS $Cg $CPPFLAGS $LDFLAGS $NOWARN $LIBS -dumpversion\`"
@@ -2794,7 +2830,7 @@
 ==> if the compiler works... yes
 ... if the compiler does not fail correctly
 $ musl-gcc -Os -g -ffile-prefix-map=/build/reproducible-path/mksh-59c=. -Wformat -Werror=format-security -Wall -Wextra  -I. -I'../..' -Wdate-time -D_FORTIFY_SOURCE=2 -DMKSH_EARLY_LOCALE_TRACKING -DKSH_VERSIONNAME_VENDOR_EXT=\"\ +Debian\" -DMKSH_BUILDMEAT -DMKSH_BINSHPOSIX -DMKSH_BINSHREDUCED -DMKSH_SMALL -DMKSH_SMALL_BUT_FAST -DMKSH_BUILDSH=1 -D_GNU_SOURCE -DSETUID_CAN_FAIL_WITH_EAGAIN=1 -Wl,-z,relro -Wl,-z,now -Wl,--as-needed -static  conftest.c  || for _f in ${tcfn}*; do case $_f in lksh.1|mksh.1|mksh.faq|mksh.ico) ;; *) rm -f "$_f" ;; esac; done
-] /usr/bin/ld: /tmp/ccVLm43I.o: in function `main':
+] /usr/bin/ld: /tmp/ccv77WqV.o: in function `main':
 ] ./builddir/static-musl/./builddir/static-musl/conftest.c:15: undefined reference to `thiswillneverbedefinedIhope'
 ] collect2: error: ld returned 1 exit status
 ==> if the compiler does not fail correctly... no
@@ -2856,26 +2892,26 @@
 ==> if invoking as sh should be handled specially... yes
 ... if mksh will be built without job control
 $ musl-gcc -Os -g -ffile-prefix-map=/build/reproducible-path/mksh-59c=. -Wformat -Werror=format-security -Wall -Wextra -fno-lto -Wno-deprecated-declarations -fno-asynchronous-unwind-tables -fno-strict-aliasing -fstack-protector-strong -malign-data=abi -fwrapv  -I. -I'../..' -Wdate-time -D_FORTIFY_SOURCE=2 -DMKSH_EARLY_LOCALE_TRACKING -DKSH_VERSIONNAME_VENDOR_EXT=\"\ +Debian\" -DMKSH_BUILDMEAT -DMKSH_BINSHPOSIX -DMKSH_BINSHREDUCED -DMKSH_SMALL -DMKSH_SMALL_BUT_FAST -DMKSH_BUILDSH=1 -D_GNU_SOURCE -DSETUID_CAN_FAIL_WITH_EAGAIN=1 -DHAVE_STRING_POOLING=2 -DHAVE_ATTRIBUTE_BOUNDED=0 -DHAVE_ATTRIBUTE_FORMAT=1 -DHAVE_ATTRIBUTE_NORETURN=1 -DHAVE_ATTRIBUTE_UNUSED=1 -DHAVE_ATTRIBUTE_USED=1 -Wl,-z,relro -Wl,-z,now -Wl,--as-needed -static -fno-lto -Wno-error conftest.c  || for _f in ${tcfn}*; do case $_f in lksh.1|mksh.1|mksh.faq|mksh.ico) ;; *) rm -f "$_f" ;; esac; done
-] /usr/bin/ld: /tmp/cc8BycaE.o: in function `main':
+] /usr/bin/ld: /tmp/cc6BUO9v.o: in function `main':
 ] ./builddir/static-musl/./builddir/static-musl/conftest.c:15: undefined reference to `thiswillneverbedefinedIhope'
 ] collect2: error: ld returned 1 exit status
 ==> if mksh will be built without job control... no
 ... if mksh will be built without job signals
 $ musl-gcc -Os -g -ffile-prefix-map=/build/reproducible-path/mksh-59c=. -Wformat -Werror=format-security -Wall -Wextra -fno-lto -Wno-deprecated-declarations -fno-asynchronous-unwind-tables -fno-strict-aliasing -fstack-protector-strong -malign-data=abi -fwrapv  -I. -I'../..' -Wdate-time -D_FORTIFY_SOURCE=2 -DMKSH_EARLY_LOCALE_TRACKING -DKSH_VERSIONNAME_VENDOR_EXT=\"\ +Debian\" -DMKSH_BUILDMEAT -DMKSH_BINSHPOSIX -DMKSH_BINSHREDUCED -DMKSH_SMALL -DMKSH_SMALL_BUT_FAST -DMKSH_BUILDSH=1 -D_GNU_SOURCE -DSETUID_CAN_FAIL_WITH_EAGAIN=1 -DHAVE_STRING_POOLING=2 -DHAVE_ATTRIBUTE_BOUNDED=0 -DHAVE_ATTRIBUTE_FORMAT=1 -DHAVE_ATTRIBUTE_NORETURN=1 -DHAVE_ATTRIBUTE_UNUSED=1 -DHAVE_ATTRIBUTE_USED=1 -Wl,-z,relro -Wl,-z,now -Wl,--as-needed -static -fno-lto -Wno-error conftest.c  || for _f in ${tcfn}*; do case $_f in lksh.1|mksh.1|mksh.faq|mksh.ico) ;; *) rm -f "$_f" ;; esac; done
-] /usr/bin/ld: /tmp/cctxZrkf.o: in function `main':
+] /usr/bin/ld: /tmp/ccoWt92f.o: in function `main':
 ] ./builddir/static-musl/./builddir/static-musl/conftest.c:15: undefined reference to `thiswillneverbedefinedIhope'
 ] collect2: error: ld returned 1 exit status
 ==> if mksh will be built without job signals... no
 ... if the default UTF-8 mode is specified
 $ musl-gcc -Os -g -ffile-prefix-map=/build/reproducible-path/mksh-59c=. -Wformat -Werror=format-security -Wall -Wextra -fno-lto -Wno-deprecated-declarations -fno-asynchronous-unwind-tables -fno-strict-aliasing -fstack-protector-strong -malign-data=abi -fwrapv  -I. -I'../..' -Wdate-time -D_FORTIFY_SOURCE=2 -DMKSH_EARLY_LOCALE_TRACKING -DKSH_VERSIONNAME_VENDOR_EXT=\"\ +Debian\" -DMKSH_BUILDMEAT -DMKSH_BINSHPOSIX -DMKSH_BINSHREDUCED -DMKSH_SMALL -DMKSH_SMALL_BUT_FAST -DMKSH_BUILDSH=1 -D_GNU_SOURCE -DSETUID_CAN_FAIL_WITH_EAGAIN=1 -DHAVE_STRING_POOLING=2 -DHAVE_ATTRIBUTE_BOUNDED=0 -DHAVE_ATTRIBUTE_FORMAT=1 -DHAVE_ATTRIBUTE_NORETURN=1 -DHAVE_ATTRIBUTE_UNUSED=1 -DHAVE_ATTRIBUTE_USED=1 -Wl,-z,relro -Wl,-z,now -Wl,--as-needed -static -fno-lto -Wno-error conftest.c  || for _f in ${tcfn}*; do case $_f in lksh.1|mksh.1|mksh.faq|mksh.ico) ;; *) rm -f "$_f" ;; esac; done
-] /usr/bin/ld: /tmp/cc0T77sv.o: in function `main':
+] /usr/bin/ld: /tmp/ccIZrfWD.o: in function `main':
 ] ./builddir/static-musl/./builddir/static-musl/conftest.c:15: undefined reference to `thiswillneverbedefinedIhope'
 ] collect2: error: ld returned 1 exit status
 ==> if the default UTF-8 mode is specified... no
 ==> if the default UTF-8 mode is disabled... no (implied)
 ... if the MidnightBSD 0.1 ash compatibility mode is requested
 $ musl-gcc -Os -g -ffile-prefix-map=/build/reproducible-path/mksh-59c=. -Wformat -Werror=format-security -Wall -Wextra -fno-lto -Wno-deprecated-declarations -fno-asynchronous-unwind-tables -fno-strict-aliasing -fstack-protector-strong -malign-data=abi -fwrapv  -I. -I'../..' -Wdate-time -D_FORTIFY_SOURCE=2 -DMKSH_EARLY_LOCALE_TRACKING -DKSH_VERSIONNAME_VENDOR_EXT=\"\ +Debian\" -DMKSH_BUILDMEAT -DMKSH_BINSHPOSIX -DMKSH_BINSHREDUCED -DMKSH_SMALL -DMKSH_SMALL_BUT_FAST -DMKSH_BUILDSH=1 -D_GNU_SOURCE -DSETUID_CAN_FAIL_WITH_EAGAIN=1 -DHAVE_STRING_POOLING=2 -DHAVE_ATTRIBUTE_BOUNDED=0 -DHAVE_ATTRIBUTE_FORMAT=1 -DHAVE_ATTRIBUTE_NORETURN=1 -DHAVE_ATTRIBUTE_UNUSED=1 -DHAVE_ATTRIBUTE_USED=1 -Wl,-z,relro -Wl,-z,now -Wl,--as-needed -static -fno-lto -Wno-error conftest.c  || for _f in ${tcfn}*; do case $_f in lksh.1|mksh.1|mksh.faq|mksh.ico) ;; *) rm -f "$_f" ;; esac; done
-] /usr/bin/ld: /tmp/ccSkyqXK.o: in function `main':
+] /usr/bin/ld: /tmp/cc3zOVqr.o: in function `main':
 ] ./builddir/static-musl/./builddir/static-musl/conftest.c:15: undefined reference to `thiswillneverbedefinedIhope'
 ] collect2: error: ld returned 1 exit status
 ==> if the MidnightBSD 0.1 ash compatibility mode is requested... no
@@ -2991,57 +3027,57 @@
 ==> if the final link command may succeed... yes
 ... GNU strerrordesc_np()
 $ musl-gcc -Os -g -ffile-prefix-map=/build/reproducible-path/mksh-59c=. -Wformat -Werror=format-security -Wall -Wextra -fno-lto -Wno-deprecated-declarations -fno-asynchronous-unwind-tables -fno-strict-aliasing -fstack-protector-strong -malign-data=abi -fwrapv  -I. -I'../..' -Wdate-time -D_FORTIFY_SOURCE=2 -DMKSH_EARLY_LOCALE_TRACKING -DKSH_VERSIONNAME_VENDOR_EXT=\"\ +Debian\" -DMKSH_BUILDMEAT -DMKSH_BINSHPOSIX -DMKSH_BINSHREDUCED -DMKSH_SMALL -DMKSH_SMALL_BUT_FAST -DMKSH_BUILDSH=1 -D_GNU_SOURCE -DSETUID_CAN_FAIL_WITH_EAGAIN=1 -DHAVE_STRING_POOLING=2 -DHAVE_ATTRIBUTE_BOUNDED=0 -DHAVE_ATTRIBUTE_FORMAT=1 -DHAVE_ATTRIBUTE_NORETURN=1 -DHAVE_ATTRIBUTE_UNUSED=1 -DHAVE_ATTRIBUTE_USED=1 -DHAVE_SYS_TIME_H=1 -DHAVE_TIME_H=1 -DHAVE_BOTH_TIME_H=1 -DHAVE_SYS_SELECT_H=1 -DHAVE_SELECT_TIME_H=1 -DHAVE_SYS_BSDTYPES_H=0 -DHAVE_SYS_FILE_H=1 -DHAVE_SYS_MKDEV_H=0 -DHAVE_SYS_MMAN_H=1 -DHAVE_SYS_PARAM_H=1 -DHAVE_SYS_PTEM_H=0 -DHAVE_SYS_RESOURCE_H=1 -DHAVE_SYS_SYSMACROS_H=1 -DHAVE_BSTRING_H=0 -DHAVE_GRP_H=1 -DHAVE_IO_H=0 -DHAVE_LIBGEN_H=1 -DHAVE_LIBUTIL_H=0 -DHAVE_PATHS_H=1 -DHAVE_STDINT_H=1 -DHAVE_STRINGS_H=1 -DHAVE_TERMIOS_H=1 -DHAVE_ULIMIT_H=1 -DHAVE_VALUES_H=1 -DHAVE_CAN_INTTYPES=1 -DHAVE_SIG_T=1 -Wl,-z,relro -Wl,-z,now -Wl,--as-needed -static -fno-lto -Wno-error conftest.c  || for _f in ${tcfn}*; do case $_f in lksh.1|mksh.1|mksh.faq|mksh.ico) ;; *) rm -f "$_f" ;; esac; done
-] /usr/bin/ld: /tmp/ccRcgBWT.o: in function `main':
+] /usr/bin/ld: /tmp/cchspQmP.o: in function `main':
 ] ./builddir/static-musl/./builddir/static-musl/conftest.c:9: undefined reference to `strerrordesc_np'
 ] collect2: error: ld returned 1 exit status
 ==> GNU strerrordesc_np()... no
 ... the sys_errlist[] array and sys_nerr
 $ musl-gcc -Os -g -ffile-prefix-map=/build/reproducible-path/mksh-59c=. -Wformat -Werror=format-security -Wall -Wextra -fno-lto -Wno-deprecated-declarations -fno-asynchronous-unwind-tables -fno-strict-aliasing -fstack-protector-strong -malign-data=abi -fwrapv  -I. -I'../..' -Wdate-time -D_FORTIFY_SOURCE=2 -DMKSH_EARLY_LOCALE_TRACKING -DKSH_VERSIONNAME_VENDOR_EXT=\"\ +Debian\" -DMKSH_BUILDMEAT -DMKSH_BINSHPOSIX -DMKSH_BINSHREDUCED -DMKSH_SMALL -DMKSH_SMALL_BUT_FAST -DMKSH_BUILDSH=1 -D_GNU_SOURCE -DSETUID_CAN_FAIL_WITH_EAGAIN=1 -DHAVE_STRING_POOLING=2 -DHAVE_ATTRIBUTE_BOUNDED=0 -DHAVE_ATTRIBUTE_FORMAT=1 -DHAVE_ATTRIBUTE_NORETURN=1 -DHAVE_ATTRIBUTE_UNUSED=1 -DHAVE_ATTRIBUTE_USED=1 -DHAVE_SYS_TIME_H=1 -DHAVE_TIME_H=1 -DHAVE_BOTH_TIME_H=1 -DHAVE_SYS_SELECT_H=1 -DHAVE_SELECT_TIME_H=1 -DHAVE_SYS_BSDTYPES_H=0 -DHAVE_SYS_FILE_H=1 -DHAVE_SYS_MKDEV_H=0 -DHAVE_SYS_MMAN_H=1 -DHAVE_SYS_PARAM_H=1 -DHAVE_SYS_PTEM_H=0 -DHAVE_SYS_RESOURCE_H=1 -DHAVE_SYS_SYSMACROS_H=1 -DHAVE_BSTRING_H=0 -DHAVE_GRP_H=1 -DHAVE_IO_H=0 -DHAVE_LIBGEN_H=1 -DHAVE_LIBUTIL_H=0 -DHAVE_PATHS_H=1 -DHAVE_STDINT_H=1 -DHAVE_STRINGS_H=1 -DHAVE_TERMIOS_H=1 -DHAVE_ULIMIT_H=1 -DHAVE_VALUES_H=1 -DHAVE_CAN_INTTYPES=1 -DHAVE_SIG_T=1 -DHAVE_STRERRORDESC_NP=0 -Wl,-z,relro -Wl,-z,now -Wl,--as-needed -static -fno-lto -Wno-error conftest.c  || for _f in ${tcfn}*; do case $_f in lksh.1|mksh.1|mksh.faq|mksh.ico) ;; *) rm -f "$_f" ;; esac; done
-] /usr/bin/ld: /tmp/cc6UXGRG.o: in function `main':
+] /usr/bin/ld: /tmp/cc6fNQi7.o: in function `main':
 ] ./builddir/static-musl/./builddir/static-musl/conftest.c:11: undefined reference to `sys_nerr'
 ] /usr/bin/ld: ./builddir/static-musl/./builddir/static-musl/conftest.c:11: undefined reference to `sys_errlist'
 ] collect2: error: ld returned 1 exit status
 ==> the sys_errlist[] array and sys_nerr... no
 ... the _sys_errlist[] array and _sys_nerr
 $ musl-gcc -Os -g -ffile-prefix-map=/build/reproducible-path/mksh-59c=. -Wformat -Werror=format-security -Wall -Wextra -fno-lto -Wno-deprecated-declarations -fno-asynchronous-unwind-tables -fno-strict-aliasing -fstack-protector-strong -malign-data=abi -fwrapv  -I. -I'../..' -Wdate-time -D_FORTIFY_SOURCE=2 -DMKSH_EARLY_LOCALE_TRACKING -DKSH_VERSIONNAME_VENDOR_EXT=\"\ +Debian\" -DMKSH_BUILDMEAT -DMKSH_BINSHPOSIX -DMKSH_BINSHREDUCED -DMKSH_SMALL -DMKSH_SMALL_BUT_FAST -DMKSH_BUILDSH=1 -D_GNU_SOURCE -DSETUID_CAN_FAIL_WITH_EAGAIN=1 -DHAVE_STRING_POOLING=2 -DHAVE_ATTRIBUTE_BOUNDED=0 -DHAVE_ATTRIBUTE_FORMAT=1 -DHAVE_ATTRIBUTE_NORETURN=1 -DHAVE_ATTRIBUTE_UNUSED=1 -DHAVE_ATTRIBUTE_USED=1 -DHAVE_SYS_TIME_H=1 -DHAVE_TIME_H=1 -DHAVE_BOTH_TIME_H=1 -DHAVE_SYS_SELECT_H=1 -DHAVE_SELECT_TIME_H=1 -DHAVE_SYS_BSDTYPES_H=0 -DHAVE_SYS_FILE_H=1 -DHAVE_SYS_MKDEV_H=0 -DHAVE_SYS_MMAN_H=1 -DHAVE_SYS_PARAM_H=1 -DHAVE_SYS_PTEM_H=0 -DHAVE_SYS_RESOURCE_H=1 -DHAVE_SYS_SYSMACROS_H=1 -DHAVE_BSTRING_H=0 -DHAVE_GRP_H=1 -DHAVE_IO_H=0 -DHAVE_LIBGEN_H=1 -DHAVE_LIBUTIL_H=0 -DHAVE_PATHS_H=1 -DHAVE_STDINT_H=1 -DHAVE_STRINGS_H=1 -DHAVE_TERMIOS_H=1 -DHAVE_ULIMIT_H=1 -DHAVE_VALUES_H=1 -DHAVE_CAN_INTTYPES=1 -DHAVE_SIG_T=1 -DHAVE_STRERRORDESC_NP=0 -Wl,-z,relro -Wl,-z,now -Wl,--as-needed -static -fno-lto -Wno-error conftest.c  || for _f in ${tcfn}*; do case $_f in lksh.1|mksh.1|mksh.faq|mksh.ico) ;; *) rm -f "$_f" ;; esac; done
-] /usr/bin/ld: /tmp/cc4UMfCP.o: in function `main':
+] /usr/bin/ld: /tmp/ccMhj1zm.o: in function `main':
 ] ./builddir/static-musl/./builddir/static-musl/conftest.c:11: undefined reference to `_sys_nerr'
 ] /usr/bin/ld: ./builddir/static-musl/./builddir/static-musl/conftest.c:11: undefined reference to `_sys_errlist'
 ] collect2: error: ld returned 1 exit status
 ==> the _sys_errlist[] array and _sys_nerr... no
 ... GNU sigabbrev_np()
 $ musl-gcc -Os -g -ffile-prefix-map=/build/reproducible-path/mksh-59c=. -Wformat -Werror=format-security -Wall -Wextra -fno-lto -Wno-deprecated-declarations -fno-asynchronous-unwind-tables -fno-strict-aliasing -fstack-protector-strong -malign-data=abi -fwrapv  -I. -I'../..' -Wdate-time -D_FORTIFY_SOURCE=2 -DMKSH_EARLY_LOCALE_TRACKING -DKSH_VERSIONNAME_VENDOR_EXT=\"\ +Debian\" -DMKSH_BUILDMEAT -DMKSH_BINSHPOSIX -DMKSH_BINSHREDUCED -DMKSH_SMALL -DMKSH_SMALL_BUT_FAST -DMKSH_BUILDSH=1 -D_GNU_SOURCE -DSETUID_CAN_FAIL_WITH_EAGAIN=1 -DHAVE_STRING_POOLING=2 -DHAVE_ATTRIBUTE_BOUNDED=0 -DHAVE_ATTRIBUTE_FORMAT=1 -DHAVE_ATTRIBUTE_NORETURN=1 -DHAVE_ATTRIBUTE_UNUSED=1 -DHAVE_ATTRIBUTE_USED=1 -DHAVE_SYS_TIME_H=1 -DHAVE_TIME_H=1 -DHAVE_BOTH_TIME_H=1 -DHAVE_SYS_SELECT_H=1 -DHAVE_SELECT_TIME_H=1 -DHAVE_SYS_BSDTYPES_H=0 -DHAVE_SYS_FILE_H=1 -DHAVE_SYS_MKDEV_H=0 -DHAVE_SYS_MMAN_H=1 -DHAVE_SYS_PARAM_H=1 -DHAVE_SYS_PTEM_H=0 -DHAVE_SYS_RESOURCE_H=1 -DHAVE_SYS_SYSMACROS_H=1 -DHAVE_BSTRING_H=0 -DHAVE_GRP_H=1 -DHAVE_IO_H=0 -DHAVE_LIBGEN_H=1 -DHAVE_LIBUTIL_H=0 -DHAVE_PATHS_H=1 -DHAVE_STDINT_H=1 -DHAVE_STRINGS_H=1 -DHAVE_TERMIOS_H=1 -DHAVE_ULIMIT_H=1 -DHAVE_VALUES_H=1 -DHAVE_CAN_INTTYPES=1 -DHAVE_SIG_T=1 -DHAVE_STRERRORDESC_NP=0 -DHAVE_SYS_ERRLIST=0 -Wl,-z,relro -Wl,-z,now -Wl,--as-needed -static -fno-lto -Wno-error conftest.c  || for _f in ${tcfn}*; do case $_f in lksh.1|mksh.1|mksh.faq|mksh.ico) ;; *) rm -f "$_f" ;; esac; done
-] /usr/bin/ld: /tmp/ccwKV1yJ.o: in function `main':
+] /usr/bin/ld: /tmp/ccSjBaIr.o: in function `main':
 ] ./builddir/static-musl/./builddir/static-musl/conftest.c:9: undefined reference to `sigabbrev_np'
 ] collect2: error: ld returned 1 exit status
 ==> GNU sigabbrev_np()... no
 ... the sys_signame[] array
 $ musl-gcc -Os -g -ffile-prefix-map=/build/reproducible-path/mksh-59c=. -Wformat -Werror=format-security -Wall -Wextra -fno-lto -Wno-deprecated-declarations -fno-asynchronous-unwind-tables -fno-strict-aliasing -fstack-protector-strong -malign-data=abi -fwrapv  -I. -I'../..' -Wdate-time -D_FORTIFY_SOURCE=2 -DMKSH_EARLY_LOCALE_TRACKING -DKSH_VERSIONNAME_VENDOR_EXT=\"\ +Debian\" -DMKSH_BUILDMEAT -DMKSH_BINSHPOSIX -DMKSH_BINSHREDUCED -DMKSH_SMALL -DMKSH_SMALL_BUT_FAST -DMKSH_BUILDSH=1 -D_GNU_SOURCE -DSETUID_CAN_FAIL_WITH_EAGAIN=1 -DHAVE_STRING_POOLING=2 -DHAVE_ATTRIBUTE_BOUNDED=0 -DHAVE_ATTRIBUTE_FORMAT=1 -DHAVE_ATTRIBUTE_NORETURN=1 -DHAVE_ATTRIBUTE_UNUSED=1 -DHAVE_ATTRIBUTE_USED=1 -DHAVE_SYS_TIME_H=1 -DHAVE_TIME_H=1 -DHAVE_BOTH_TIME_H=1 -DHAVE_SYS_SELECT_H=1 -DHAVE_SELECT_TIME_H=1 -DHAVE_SYS_BSDTYPES_H=0 -DHAVE_SYS_FILE_H=1 -DHAVE_SYS_MKDEV_H=0 -DHAVE_SYS_MMAN_H=1 -DHAVE_SYS_PARAM_H=1 -DHAVE_SYS_PTEM_H=0 -DHAVE_SYS_RESOURCE_H=1 -DHAVE_SYS_SYSMACROS_H=1 -DHAVE_BSTRING_H=0 -DHAVE_GRP_H=1 -DHAVE_IO_H=0 -DHAVE_LIBGEN_H=1 -DHAVE_LIBUTIL_H=0 -DHAVE_PATHS_H=1 -DHAVE_STDINT_H=1 -DHAVE_STRINGS_H=1 -DHAVE_TERMIOS_H=1 -DHAVE_ULIMIT_H=1 -DHAVE_VALUES_H=1 -DHAVE_CAN_INTTYPES=1 -DHAVE_SIG_T=1 -DHAVE_STRERRORDESC_NP=0 -DHAVE_SYS_ERRLIST=0 -DHAVE_SIGABBREV_NP=0 -Wl,-z,relro -Wl,-z,now -Wl,--as-needed -static -fno-lto -Wno-error conftest.c  || for _f in ${tcfn}*; do case $_f in lksh.1|mksh.1|mksh.faq|mksh.ico) ;; *) rm -f "$_f" ;; esac; done
-] /usr/bin/ld: /tmp/ccibCHgG.o: in function `main':
+] /usr/bin/ld: /tmp/ccvSFobd.o: in function `main':
 ] ./builddir/static-musl/./builddir/static-musl/conftest.c:10: undefined reference to `sys_signame'
 ] collect2: error: ld returned 1 exit status
 ==> the sys_signame[] array... no
 ... the _sys_signame[] array
 $ musl-gcc -Os -g -ffile-prefix-map=/build/reproducible-path/mksh-59c=. -Wformat -Werror=format-security -Wall -Wextra -fno-lto -Wno-deprecated-declarations -fno-asynchronous-unwind-tables -fno-strict-aliasing -fstack-protector-strong -malign-data=abi -fwrapv  -I. -I'../..' -Wdate-time -D_FORTIFY_SOURCE=2 -DMKSH_EARLY_LOCALE_TRACKING -DKSH_VERSIONNAME_VENDOR_EXT=\"\ +Debian\" -DMKSH_BUILDMEAT -DMKSH_BINSHPOSIX -DMKSH_BINSHREDUCED -DMKSH_SMALL -DMKSH_SMALL_BUT_FAST -DMKSH_BUILDSH=1 -D_GNU_SOURCE -DSETUID_CAN_FAIL_WITH_EAGAIN=1 -DHAVE_STRING_POOLING=2 -DHAVE_ATTRIBUTE_BOUNDED=0 -DHAVE_ATTRIBUTE_FORMAT=1 -DHAVE_ATTRIBUTE_NORETURN=1 -DHAVE_ATTRIBUTE_UNUSED=1 -DHAVE_ATTRIBUTE_USED=1 -DHAVE_SYS_TIME_H=1 -DHAVE_TIME_H=1 -DHAVE_BOTH_TIME_H=1 -DHAVE_SYS_SELECT_H=1 -DHAVE_SELECT_TIME_H=1 -DHAVE_SYS_BSDTYPES_H=0 -DHAVE_SYS_FILE_H=1 -DHAVE_SYS_MKDEV_H=0 -DHAVE_SYS_MMAN_H=1 -DHAVE_SYS_PARAM_H=1 -DHAVE_SYS_PTEM_H=0 -DHAVE_SYS_RESOURCE_H=1 -DHAVE_SYS_SYSMACROS_H=1 -DHAVE_BSTRING_H=0 -DHAVE_GRP_H=1 -DHAVE_IO_H=0 -DHAVE_LIBGEN_H=1 -DHAVE_LIBUTIL_H=0 -DHAVE_PATHS_H=1 -DHAVE_STDINT_H=1 -DHAVE_STRINGS_H=1 -DHAVE_TERMIOS_H=1 -DHAVE_ULIMIT_H=1 -DHAVE_VALUES_H=1 -DHAVE_CAN_INTTYPES=1 -DHAVE_SIG_T=1 -DHAVE_STRERRORDESC_NP=0 -DHAVE_SYS_ERRLIST=0 -DHAVE_SIGABBREV_NP=0 -Wl,-z,relro -Wl,-z,now -Wl,--as-needed -static -fno-lto -Wno-error conftest.c  || for _f in ${tcfn}*; do case $_f in lksh.1|mksh.1|mksh.faq|mksh.ico) ;; *) rm -f "$_f" ;; esac; done
-] /usr/bin/ld: /tmp/ccaaYriG.o: in function `main':
+] /usr/bin/ld: /tmp/cc6HuSXV.o: in function `main':
 ] ./builddir/static-musl/./builddir/static-musl/conftest.c:10: undefined reference to `_sys_signame'
 ] collect2: error: ld returned 1 exit status
 ==> the _sys_signame[] array... no
 ... GNU sigdescr_np()
 $ musl-gcc -Os -g -ffile-prefix-map=/build/reproducible-path/mksh-59c=. -Wformat -Werror=format-security -Wall -Wextra -fno-lto -Wno-deprecated-declarations -fno-asynchronous-unwind-tables -fno-strict-aliasing -fstack-protector-strong -malign-data=abi -fwrapv  -I. -I'../..' -Wdate-time -D_FORTIFY_SOURCE=2 -DMKSH_EARLY_LOCALE_TRACKING -DKSH_VERSIONNAME_VENDOR_EXT=\"\ +Debian\" -DMKSH_BUILDMEAT -DMKSH_BINSHPOSIX -DMKSH_BINSHREDUCED -DMKSH_SMALL -DMKSH_SMALL_BUT_FAST -DMKSH_BUILDSH=1 -D_GNU_SOURCE -DSETUID_CAN_FAIL_WITH_EAGAIN=1 -DHAVE_STRING_POOLING=2 -DHAVE_ATTRIBUTE_BOUNDED=0 -DHAVE_ATTRIBUTE_FORMAT=1 -DHAVE_ATTRIBUTE_NORETURN=1 -DHAVE_ATTRIBUTE_UNUSED=1 -DHAVE_ATTRIBUTE_USED=1 -DHAVE_SYS_TIME_H=1 -DHAVE_TIME_H=1 -DHAVE_BOTH_TIME_H=1 -DHAVE_SYS_SELECT_H=1 -DHAVE_SELECT_TIME_H=1 -DHAVE_SYS_BSDTYPES_H=0 -DHAVE_SYS_FILE_H=1 -DHAVE_SYS_MKDEV_H=0 -DHAVE_SYS_MMAN_H=1 -DHAVE_SYS_PARAM_H=1 -DHAVE_SYS_PTEM_H=0 -DHAVE_SYS_RESOURCE_H=1 -DHAVE_SYS_SYSMACROS_H=1 -DHAVE_BSTRING_H=0 -DHAVE_GRP_H=1 -DHAVE_IO_H=0 -DHAVE_LIBGEN_H=1 -DHAVE_LIBUTIL_H=0 -DHAVE_PATHS_H=1 -DHAVE_STDINT_H=1 -DHAVE_STRINGS_H=1 -DHAVE_TERMIOS_H=1 -DHAVE_ULIMIT_H=1 -DHAVE_VALUES_H=1 -DHAVE_CAN_INTTYPES=1 -DHAVE_SIG_T=1 -DHAVE_STRERRORDESC_NP=0 -DHAVE_SYS_ERRLIST=0 -DHAVE_SIGABBREV_NP=0 -DHAVE_SYS_SIGNAME=0 -Wl,-z,relro -Wl,-z,now -Wl,--as-needed -static -fno-lto -Wno-error conftest.c  || for _f in ${tcfn}*; do case $_f in lksh.1|mksh.1|mksh.faq|mksh.ico) ;; *) rm -f "$_f" ;; esac; done
-] /usr/bin/ld: /tmp/cc7PS4nW.o: in function `main':
+] /usr/bin/ld: /tmp/ccvPqWQ7.o: in function `main':
 ] ./builddir/static-musl/./builddir/static-musl/conftest.c:9: undefined reference to `sigdescr_np'
 ] collect2: error: ld returned 1 exit status
 ==> GNU sigdescr_np()... no
 ... the sys_siglist[] array
 $ musl-gcc -Os -g -ffile-prefix-map=/build/reproducible-path/mksh-59c=. -Wformat -Werror=format-security -Wall -Wextra -fno-lto -Wno-deprecated-declarations -fno-asynchronous-unwind-tables -fno-strict-aliasing -fstack-protector-strong -malign-data=abi -fwrapv  -I. -I'../..' -Wdate-time -D_FORTIFY_SOURCE=2 -DMKSH_EARLY_LOCALE_TRACKING -DKSH_VERSIONNAME_VENDOR_EXT=\"\ +Debian\" -DMKSH_BUILDMEAT -DMKSH_BINSHPOSIX -DMKSH_BINSHREDUCED -DMKSH_SMALL -DMKSH_SMALL_BUT_FAST -DMKSH_BUILDSH=1 -D_GNU_SOURCE -DSETUID_CAN_FAIL_WITH_EAGAIN=1 -DHAVE_STRING_POOLING=2 -DHAVE_ATTRIBUTE_BOUNDED=0 -DHAVE_ATTRIBUTE_FORMAT=1 -DHAVE_ATTRIBUTE_NORETURN=1 -DHAVE_ATTRIBUTE_UNUSED=1 -DHAVE_ATTRIBUTE_USED=1 -DHAVE_SYS_TIME_H=1 -DHAVE_TIME_H=1 -DHAVE_BOTH_TIME_H=1 -DHAVE_SYS_SELECT_H=1 -DHAVE_SELECT_TIME_H=1 -DHAVE_SYS_BSDTYPES_H=0 -DHAVE_SYS_FILE_H=1 -DHAVE_SYS_MKDEV_H=0 -DHAVE_SYS_MMAN_H=1 -DHAVE_SYS_PARAM_H=1 -DHAVE_SYS_PTEM_H=0 -DHAVE_SYS_RESOURCE_H=1 -DHAVE_SYS_SYSMACROS_H=1 -DHAVE_BSTRING_H=0 -DHAVE_GRP_H=1 -DHAVE_IO_H=0 -DHAVE_LIBGEN_H=1 -DHAVE_LIBUTIL_H=0 -DHAVE_PATHS_H=1 -DHAVE_STDINT_H=1 -DHAVE_STRINGS_H=1 -DHAVE_TERMIOS_H=1 -DHAVE_ULIMIT_H=1 -DHAVE_VALUES_H=1 -DHAVE_CAN_INTTYPES=1 -DHAVE_SIG_T=1 -DHAVE_STRERRORDESC_NP=0 -DHAVE_SYS_ERRLIST=0 -DHAVE_SIGABBREV_NP=0 -DHAVE_SYS_SIGNAME=0 -DHAVE_SIGDESCR_NP=0 -Wl,-z,relro -Wl,-z,now -Wl,--as-needed -static -fno-lto -Wno-error conftest.c  || for _f in ${tcfn}*; do case $_f in lksh.1|mksh.1|mksh.faq|mksh.ico) ;; *) rm -f "$_f" ;; esac; done
-] /usr/bin/ld: /tmp/cc6YBqIN.o: in function `main':
+] /usr/bin/ld: /tmp/ccYPUZsx.o: in function `main':
 ] ./builddir/static-musl/./builddir/static-musl/conftest.c:10: undefined reference to `sys_siglist'
 ] collect2: error: ld returned 1 exit status
 ==> the sys_siglist[] array... no
 ... the _sys_siglist[] array
 $ musl-gcc -Os -g -ffile-prefix-map=/build/reproducible-path/mksh-59c=. -Wformat -Werror=format-security -Wall -Wextra -fno-lto -Wno-deprecated-declarations -fno-asynchronous-unwind-tables -fno-strict-aliasing -fstack-protector-strong -malign-data=abi -fwrapv  -I. -I'../..' -Wdate-time -D_FORTIFY_SOURCE=2 -DMKSH_EARLY_LOCALE_TRACKING -DKSH_VERSIONNAME_VENDOR_EXT=\"\ +Debian\" -DMKSH_BUILDMEAT -DMKSH_BINSHPOSIX -DMKSH_BINSHREDUCED -DMKSH_SMALL -DMKSH_SMALL_BUT_FAST -DMKSH_BUILDSH=1 -D_GNU_SOURCE -DSETUID_CAN_FAIL_WITH_EAGAIN=1 -DHAVE_STRING_POOLING=2 -DHAVE_ATTRIBUTE_BOUNDED=0 -DHAVE_ATTRIBUTE_FORMAT=1 -DHAVE_ATTRIBUTE_NORETURN=1 -DHAVE_ATTRIBUTE_UNUSED=1 -DHAVE_ATTRIBUTE_USED=1 -DHAVE_SYS_TIME_H=1 -DHAVE_TIME_H=1 -DHAVE_BOTH_TIME_H=1 -DHAVE_SYS_SELECT_H=1 -DHAVE_SELECT_TIME_H=1 -DHAVE_SYS_BSDTYPES_H=0 -DHAVE_SYS_FILE_H=1 -DHAVE_SYS_MKDEV_H=0 -DHAVE_SYS_MMAN_H=1 -DHAVE_SYS_PARAM_H=1 -DHAVE_SYS_PTEM_H=0 -DHAVE_SYS_RESOURCE_H=1 -DHAVE_SYS_SYSMACROS_H=1 -DHAVE_BSTRING_H=0 -DHAVE_GRP_H=1 -DHAVE_IO_H=0 -DHAVE_LIBGEN_H=1 -DHAVE_LIBUTIL_H=0 -DHAVE_PATHS_H=1 -DHAVE_STDINT_H=1 -DHAVE_STRINGS_H=1 -DHAVE_TERMIOS_H=1 -DHAVE_ULIMIT_H=1 -DHAVE_VALUES_H=1 -DHAVE_CAN_INTTYPES=1 -DHAVE_SIG_T=1 -DHAVE_STRERRORDESC_NP=0 -DHAVE_SYS_ERRLIST=0 -DHAVE_SIGABBREV_NP=0 -DHAVE_SYS_SIGNAME=0 -DHAVE_SIGDESCR_NP=0 -Wl,-z,relro -Wl,-z,now -Wl,--as-needed -static -fno-lto -Wno-error conftest.c  || for _f in ${tcfn}*; do case $_f in lksh.1|mksh.1|mksh.faq|mksh.ico) ;; *) rm -f "$_f" ;; esac; done
-] /usr/bin/ld: /tmp/ccms8p3P.o: in function `main':
+] /usr/bin/ld: /tmp/cc0nqAPk.o: in function `main':
 ] ./builddir/static-musl/./builddir/static-musl/conftest.c:10: undefined reference to `_sys_siglist'
 ] collect2: error: ld returned 1 exit status
 ==> the _sys_siglist[] array... no
@@ -3822,10 +3858,10 @@
 Attempting compilation of mksh in static-dietlibc with CC='diet -v -Os gcc'
 CFLAGS='-g -ffile-prefix-map=/build/reproducible-path/mksh-59c=. -Wformat -Werror=format-security -Wall -Wextra' CPPFLAGS='-Wdate-time -D_FORTIFY_SOURCE=2 -DMKSH_EARLY_LOCALE_TRACKING -DKSH_VERSIONNAME_VENDOR_EXT=\"\ +Debian\" -DMKSH_BUILDMEAT -DMKSH_BINSHPOSIX -DMKSH_BINSHREDUCED -DMKSH_SMALL -DMKSH_SMALL_BUT_FAST'
 LDFLAGS='-Wl,-z,relro -Wl,-z,now -Wl,--as-needed' LDSTATIC=' ' LIBS=''
-+ env CC=diet -v -Os gcc CFLAGS=-g -ffile-prefix-map=/build/reproducible-path/mksh-59c=. -Wformat -Werror=format-security -Wall -Wextra CPPFLAGS=-Wdate-time -D_FORTIFY_SOURCE=2 -DMKSH_EARLY_LOCALE_TRACKING -DKSH_VERSIONNAME_VENDOR_EXT=\"\ +Debian\" -DMKSH_BUILDMEAT -DMKSH_BINSHPOSIX -DMKSH_BINSHREDUCED -DMKSH_SMALL -DMKSH_SMALL_BUT_FAST LDFLAGS=-Wl,-z,relro -Wl,-z,now -Wl,--as-needed LDSTATIC=  LIBS= sh ../../Build.sh -r
++ env 'CC=diet -v -Os gcc' 'CFLAGS=-g -ffile-prefix-map=/build/reproducible-path/mksh-59c=. -Wformat -Werror=format-security -Wall -Wextra' 'CPPFLAGS=-Wdate-time -D_FORTIFY_SOURCE=2 -DMKSH_EARLY_LOCALE_TRACKING -DKSH_VERSIONNAME_VENDOR_EXT=\"\ +Debian\" -DMKSH_BUILDMEAT -DMKSH_BINSHPOSIX -DMKSH_BINSHREDUCED -DMKSH_SMALL -DMKSH_SMALL_BUT_FAST' 'LDFLAGS=-Wl,-z,relro -Wl,-z,now -Wl,--as-needed' 'LDSTATIC= ' LIBS= sh ../../Build.sh -r
 For the build logs, demonstrate that /dev/null and /dev/tty exist:
-crw-rw-rw- 1 root root 1, 3 Jun  6 22:24 /dev/null
-crw-rw-rw- 1 root root 5, 0 Jun  6 22:24 /dev/tty
+crw-rw-rw- 1 root root 1, 3 Jul 11 06:46 /dev/null
+crw-rw-rw- 1 root root 5, 0 Aug  6 17:41 /dev/tty
 Flags on entry (plus HAVE_* which are not shown here):
 - CC        <diet -v -Os gcc>
 - CFLAGS    <-g -ffile-prefix-map=/build/reproducible-path/mksh-59c=. -Wformat -Werror=format-security -Wall -Wextra>
@@ -3837,11 +3873,11 @@
 
 Hi from $MirOS: src/bin/mksh/Build.sh,v 1.835 2023/01/26 04:32:50 tg Exp $ on:
 $ uname -a >&2
-| Linux infom01-amd64 6.1.0-22-cloud-amd64 #1 SMP PREEMPT_DYNAMIC Debian 6.1.94-1 (2024-06-21) x86_64 GNU/Linux
-Build.sh: Building The MirBSD Korn Shell (mksh) R59 2023/04/29 on Linux 6.1.0-22-cloud-amd64...
+| Linux i-capture-the-hostname 6.7.12+bpo-amd64 #1 SMP PREEMPT_DYNAMIC Debian 6.7.12-1~bpo12+1 (2024-05-06) x86_64 GNU/Linux
+Build.sh: Building The MirBSD Korn Shell (mksh) R59 2023/04/29 on Linux 6.7.12+bpo-amd64...
 Build.sh: Scanning for functions... please ignore any errors.
 ... which compiler type seems to be used
-$ diet -v -Os gcc -E -g -ffile-prefix-map=/build/reproducible-path/mksh-59c=. -Wformat -Werror=format-security -Wall -Wextra -I. -I'../..' -Wdate-time -D_FORTIFY_SOURCE=2 -DMKSH_EARLY_LOCALE_TRACKING -DKSH_VERSIONNAME_VENDOR_EXT=\"\ +Debian\" -DMKSH_BUILDMEAT -DMKSH_BINSHPOSIX -DMKSH_BINSHREDUCED -DMKSH_SMALL -DMKSH_SMALL_BUT_FAST -DMKSH_BUILDSH=1 -D_GNU_SOURCE -DSETUID_CAN_FAIL_WITH_EAGAIN=1   conftest.c |     sed -n '/^ *[ce]t *= */s/^ *\([ce]t\) *= */=/p' | tr -d \015 >x
+$ diet -v -Os gcc -E -g -ffile-prefix-map=/build/reproducible-path/mksh-59c=. -Wformat -Werror=format-security -Wall -Wextra -I. -I'../..' -Wdate-time -D_FORTIFY_SOURCE=2 -DMKSH_EARLY_LOCALE_TRACKING -DKSH_VERSIONNAME_VENDOR_EXT=\"\ +Debian\" -DMKSH_BUILDMEAT -DMKSH_BINSHPOSIX -DMKSH_BINSHREDUCED -DMKSH_SMALL -DMKSH_SMALL_BUT_FAST -DMKSH_BUILDSH=1 -D_GNU_SOURCE -DSETUID_CAN_FAIL_WITH_EAGAIN=1   conftest.c |     sed -n '/^ *[ce]t *= */s/^ *\([ce]t\) *= */\1=/p' | tr -d \\015 >x
 ] gcc -E -g -ffile-prefix-map=/build/reproducible-path/mksh-59c=. -Wformat -Werror=format-security -Wall -Wextra -I. -I../.. -Wdate-time -D_FORTIFY_SOURCE=2 -DMKSH_EARLY_LOCALE_TRACKING -DKSH_VERSIONNAME_VENDOR_EXT=" +Debian" -DMKSH_BUILDMEAT -DMKSH_BINSHPOSIX -DMKSH_BINSHREDUCED -DMKSH_SMALL -DMKSH_SMALL_BUT_FAST -DMKSH_BUILDSH=1 -D_GNU_SOURCE -DSETUID_CAN_FAIL_WITH_EAGAIN=1 conftest.c -isystem /usr/lib/x86_64-linux-gnu/diet/include -D__dietlibc__ -Os 
 [ ct="gcc"
 [ et="dietlibc"
@@ -3858,7 +3894,7 @@
 | Supported LTO compression algorithms: zlib zstd
 | gcc version 12.2.0 (Debian 12.2.0-14) 
 | COLLECT_GCC_OPTIONS='-nostdlib' '-static' '-L/usr/lib/x86_64-linux-gnu/diet/lib-x86_64' '-L/usr/lib/diet/lib' '-g' '-ffile-prefix-map=/build/reproducible-path/mksh-59c=.' '-Wformat=1' '-Werror=format-security' '-Wall' '-Wextra' '-I' '.' '-I' '../..' '-Wdate-time' '-D' '_FORTIFY_SOURCE=2' '-D' 'MKSH_EARLY_LOCALE_TRACKING' '-D' 'KSH_VERSIONNAME_VENDOR_EXT=" +Debian"' '-D' 'MKSH_BUILDMEAT' '-D' 'MKSH_BINSHPOSIX' '-D' 'MKSH_BINSHREDUCED' '-D' 'MKSH_SMALL' '-D' 'MKSH_SMALL_BUT_FAST' '-D' 'MKSH_BUILDSH=1' '-D' '_GNU_SOURCE' '-D' 'SETUID_CAN_FAIL_WITH_EAGAIN=1' '-v' '-isystem' '/usr/lib/x86_64-linux-gnu/diet/include' '-D' '__dietlibc__' '-Os' '-mtune=generic' '-march=x86-64' '-dumpdir' 'a-'
-|  /usr/lib/gcc/x86_64-linux-gnu/12/cc1 -quiet -v -I . -I ../.. -imultiarch x86_64-linux-gnu -D _FORTIFY_SOURCE=2 -D MKSH_EARLY_LOCALE_TRACKING -D KSH_VERSIONNAME_VENDOR_EXT=" +Debian" -D MKSH_BUILDMEAT -D MKSH_BINSHPOSIX -D MKSH_BINSHREDUCED -D MKSH_SMALL -D MKSH_SMALL_BUT_FAST -D MKSH_BUILDSH=1 -D _GNU_SOURCE -D SETUID_CAN_FAIL_WITH_EAGAIN=1 -D __dietlibc__ -isystem /usr/lib/x86_64-linux-gnu/diet/include conftest.c -quiet -dumpdir a- -dumpbase conftest.c -dumpbase-ext .c -mtune=generic -march=x86-64 -g -Os -Wformat=1 -Werror=format-security -Wall -Wextra -Wdate-time -version -ffile-prefix-map=/build/reproducible-path/mksh-59c=. -fasynchronous-unwind-tables -o /tmp/cceNtRxQ.s
+|  /usr/lib/gcc/x86_64-linux-gnu/12/cc1 -quiet -v -I . -I ../.. -imultiarch x86_64-linux-gnu -D _FORTIFY_SOURCE=2 -D MKSH_EARLY_LOCALE_TRACKING -D KSH_VERSIONNAME_VENDOR_EXT=" +Debian" -D MKSH_BUILDMEAT -D MKSH_BINSHPOSIX -D MKSH_BINSHREDUCED -D MKSH_SMALL -D MKSH_SMALL_BUT_FAST -D MKSH_BUILDSH=1 -D _GNU_SOURCE -D SETUID_CAN_FAIL_WITH_EAGAIN=1 -D __dietlibc__ -isystem /usr/lib/x86_64-linux-gnu/diet/include conftest.c -quiet -dumpdir a- -dumpbase conftest.c -dumpbase-ext .c -mtune=generic -march=x86-64 -g -Os -Wformat=1 -Werror=format-security -Wall -Wextra -Wdate-time -version -ffile-prefix-map=/build/reproducible-path/mksh-59c=. -fasynchronous-unwind-tables -o /tmp/ccNufm1V.s
 | GNU C17 (Debian 12.2.0-14) version 12.2.0 (x86_64-linux-gnu)
 | 	compiled by GNU C version 12.2.0, GMP version 6.2.1, MPFR version 4.1.1-p1, MPC version 1.3.1, isl version isl-0.25-GMP
 | 
@@ -3884,12 +3920,12 @@
 | GGC heuristics: --param ggc-min-expand=100 --param ggc-min-heapsize=131072
 | Compiler executable checksum: cc72d2b9b5048fedc2be9051c917b40b
 | COLLECT_GCC_OPTIONS='-nostdlib' '-static' '-L/usr/lib/x86_64-linux-gnu/diet/lib-x86_64' '-L/usr/lib/diet/lib' '-g' '-ffile-prefix-map=/build/reproducible-path/mksh-59c=.' '-Wformat=1' '-Werror=format-security' '-Wall' '-Wextra' '-I' '.' '-I' '../..' '-Wdate-time' '-D' '_FORTIFY_SOURCE=2' '-D' 'MKSH_EARLY_LOCALE_TRACKING' '-D' 'KSH_VERSIONNAME_VENDOR_EXT=" +Debian"' '-D' 'MKSH_BUILDMEAT' '-D' 'MKSH_BINSHPOSIX' '-D' 'MKSH_BINSHREDUCED' '-D' 'MKSH_SMALL' '-D' 'MKSH_SMALL_BUT_FAST' '-D' 'MKSH_BUILDSH=1' '-D' '_GNU_SOURCE' '-D' 'SETUID_CAN_FAIL_WITH_EAGAIN=1' '-v' '-isystem' '/usr/lib/x86_64-linux-gnu/diet/include' '-D' '__dietlibc__' '-Os' '-mtune=generic' '-march=x86-64' '-dumpdir' 'a-'
-|  as -v -I . -I ../.. --gdwarf-5 --64 -o /tmp/ccu5FZW5.o /tmp/cceNtRxQ.s
+|  as -v -I . -I ../.. --gdwarf-5 --64 -o /tmp/cclwZAQW.o /tmp/ccNufm1V.s
 | GNU assembler version 2.40 (x86_64-linux-gnu) using BFD version (GNU Binutils for Debian) 2.40
 | COMPILER_PATH=/usr/lib/gcc/x86_64-linux-gnu/12/:/usr/lib/gcc/x86_64-linux-gnu/12/:/usr/lib/gcc/x86_64-linux-gnu/:/usr/lib/gcc/x86_64-linux-gnu/12/:/usr/lib/gcc/x86_64-linux-gnu/
 | LIBRARY_PATH=/usr/lib/gcc/x86_64-linux-gnu/12/:/usr/lib/gcc/x86_64-linux-gnu/12/../../../x86_64-linux-gnu/:/usr/lib/gcc/x86_64-linux-gnu/12/../../../../lib/:/lib/x86_64-linux-gnu/:/lib/../lib/:/usr/lib/x86_64-linux-gnu/:/usr/lib/../lib/:/usr/lib/gcc/x86_64-linux-gnu/12/../../../:/lib/:/usr/lib/
 | COLLECT_GCC_OPTIONS='-nostdlib' '-static' '-L/usr/lib/x86_64-linux-gnu/diet/lib-x86_64' '-L/usr/lib/diet/lib' '-g' '-ffile-prefix-map=/build/reproducible-path/mksh-59c=.' '-Wformat=1' '-Werror=format-security' '-Wall' '-Wextra' '-I' '.' '-I' '../..' '-Wdate-time' '-D' '_FORTIFY_SOURCE=2' '-D' 'MKSH_EARLY_LOCALE_TRACKING' '-D' 'KSH_VERSIONNAME_VENDOR_EXT=" +Debian"' '-D' 'MKSH_BUILDMEAT' '-D' 'MKSH_BINSHPOSIX' '-D' 'MKSH_BINSHREDUCED' '-D' 'MKSH_SMALL' '-D' 'MKSH_SMALL_BUT_FAST' '-D' 'MKSH_BUILDSH=1' '-D' '_GNU_SOURCE' '-D' 'SETUID_CAN_FAIL_WITH_EAGAIN=1' '-v' '-isystem' '/usr/lib/x86_64-linux-gnu/diet/include' '-D' '__dietlibc__' '-Os' '-mtune=generic' '-march=x86-64' '-dumpdir' 'a.'
-|  /usr/lib/gcc/x86_64-linux-gnu/12/collect2 -plugin /usr/lib/gcc/x86_64-linux-gnu/12/liblto_plugin.so -plugin-opt=/usr/lib/gcc/x86_64-linux-gnu/12/lto-wrapper -plugin-opt=-fresolution=/tmp/cce7qTaF.res --build-id -m elf_x86_64 --hash-style=gnu --as-needed -static -L/usr/lib/x86_64-linux-gnu/diet/lib-x86_64 -L/usr/lib/diet/lib -L/usr/lib/gcc/x86_64-linux-gnu/12 -L/usr/lib/gcc/x86_64-linux-gnu/12/../../../x86_64-linux-gnu -L/usr/lib/gcc/x86_64-linux-gnu/12/../../../../lib -L/lib/x86_64-linux-gnu -L/lib/../lib -L/usr/lib/x86_64-linux-gnu -L/usr/lib/../lib -L/usr/lib/gcc/x86_64-linux-gnu/12/../../.. /usr/lib/x86_64-linux-gnu/diet/lib-x86_64/start.o -z relro -z now --as-needed /tmp/ccu5FZW5.o /usr/lib/x86_64-linux-gnu/diet/lib-x86_64/libc.a -lgcc
+|  /usr/lib/gcc/x86_64-linux-gnu/12/collect2 -plugin /usr/lib/gcc/x86_64-linux-gnu/12/liblto_plugin.so -plugin-opt=/usr/lib/gcc/x86_64-linux-gnu/12/lto-wrapper -plugin-opt=-fresolution=/tmp/cc6SBEte.res --build-id -m elf_x86_64 --hash-style=gnu --as-needed -static -L/usr/lib/x86_64-linux-gnu/diet/lib-x86_64 -L/usr/lib/diet/lib -L/usr/lib/gcc/x86_64-linux-gnu/12 -L/usr/lib/gcc/x86_64-linux-gnu/12/../../../x86_64-linux-gnu -L/usr/lib/gcc/x86_64-linux-gnu/12/../../../../lib -L/lib/x86_64-linux-gnu -L/lib/../lib -L/usr/lib/x86_64-linux-gnu -L/usr/lib/../lib -L/usr/lib/gcc/x86_64-linux-gnu/12/../../.. /usr/lib/x86_64-linux-gnu/diet/lib-x86_64/start.o -z relro -z now --as-needed /tmp/cclwZAQW.o /usr/lib/x86_64-linux-gnu/diet/lib-x86_64/libc.a -lgcc
 | COLLECT_GCC_OPTIONS='-nostdlib' '-static' '-L/usr/lib/x86_64-linux-gnu/diet/lib-x86_64' '-L/usr/lib/diet/lib' '-g' '-ffile-prefix-map=/build/reproducible-path/mksh-59c=.' '-Wformat=1' '-Werror=format-security' '-Wall' '-Wextra' '-I' '.' '-I' '../..' '-Wdate-time' '-D' '_FORTIFY_SOURCE=2' '-D' 'MKSH_EARLY_LOCALE_TRACKING' '-D' 'KSH_VERSIONNAME_VENDOR_EXT=" +Debian"' '-D' 'MKSH_BUILDMEAT' '-D' 'MKSH_BINSHPOSIX' '-D' 'MKSH_BINSHREDUCED' '-D' 'MKSH_SMALL' '-D' 'MKSH_SMALL_BUT_FAST' '-D' 'MKSH_BUILDSH=1' '-D' '_GNU_SOURCE' '-D' 'SETUID_CAN_FAIL_WITH_EAGAIN=1' '-v' '-isystem' '/usr/lib/x86_64-linux-gnu/diet/include' '-D' '__dietlibc__' '-Os' '-mtune=generic' '-march=x86-64' '-dumpdir' 'a.'
 $ eval echo "\`$CC $CFLAGS $Cg $CPPFLAGS $LDFLAGS $NOWARN $LIBS -dumpmachine\`" \
 		 "gcc\`$CC $CFLAGS $Cg $CPPFLAGS $LDFLAGS $NOWARN $LIBS -dumpversion\`"
@@ -3904,7 +3940,7 @@
 ... if the compiler does not fail correctly
 $ diet -v -Os gcc -g -ffile-prefix-map=/build/reproducible-path/mksh-59c=. -Wformat -Werror=format-security -Wall -Wextra  -I. -I'../..' -Wdate-time -D_FORTIFY_SOURCE=2 -DMKSH_EARLY_LOCALE_TRACKING -DKSH_VERSIONNAME_VENDOR_EXT=\"\ +Debian\" -DMKSH_BUILDMEAT -DMKSH_BINSHPOSIX -DMKSH_BINSHREDUCED -DMKSH_SMALL -DMKSH_SMALL_BUT_FAST -DMKSH_BUILDSH=1 -D_GNU_SOURCE -DSETUID_CAN_FAIL_WITH_EAGAIN=1 -D_BSD_SOURCE -Wl,-z,relro -Wl,-z,now -Wl,--as-needed    conftest.c  || for _f in ${tcfn}*; do case $_f in lksh.1|mksh.1|mksh.faq|mksh.ico) ;; *) rm -f "$_f" ;; esac; done
 ] gcc -nostdlib -static -L/usr/lib/x86_64-linux-gnu/diet/lib-x86_64 -L/usr/lib/diet/lib /usr/lib/x86_64-linux-gnu/diet/lib-x86_64/start.o -g -ffile-prefix-map=/build/reproducible-path/mksh-59c=. -Wformat -Werror=format-security -Wall -Wextra -I. -I../.. -Wdate-time -D_FORTIFY_SOURCE=2 -DMKSH_EARLY_LOCALE_TRACKING -DKSH_VERSIONNAME_VENDOR_EXT=" +Debian" -DMKSH_BUILDMEAT -DMKSH_BINSHPOSIX -DMKSH_BINSHREDUCED -DMKSH_SMALL -DMKSH_SMALL_BUT_FAST -DMKSH_BUILDSH=1 -D_GNU_SOURCE -DSETUID_CAN_FAIL_WITH_EAGAIN=1 -D_BSD_SOURCE -Wl,-z,relro -Wl,-z,now -Wl,--as-needed conftest.c -isystem /usr/lib/x86_64-linux-gnu/diet/include -D__dietlibc__ -Os /usr/lib/x86_64-linux-gnu/diet/lib-x86_64/libc.a -lgcc 
-] /usr/bin/ld: /tmp/ccsFSb3d.o: in function `main':
+] /usr/bin/ld: /tmp/ccci2cig.o: in function `main':
 ] ./builddir/static-dietlibc/./builddir/static-dietlibc/conftest.c:15: undefined reference to `thiswillneverbedefinedIhope'
 ] collect2: error: ld returned 1 exit status
 ==> if the compiler does not fail correctly... no
@@ -3987,21 +4023,21 @@
 ... if mksh will be built without job control
 $ diet -v -Os gcc -g -ffile-prefix-map=/build/reproducible-path/mksh-59c=. -Wformat -Werror=format-security -Wall -Wextra -fno-lto -Wno-deprecated-declarations -fno-asynchronous-unwind-tables -fno-strict-aliasing -fstack-protector-strong -malign-data=abi -fwrapv  -I. -I'../..' -Wdate-time -D_FORTIFY_SOURCE=2 -DMKSH_EARLY_LOCALE_TRACKING -DKSH_VERSIONNAME_VENDOR_EXT=\"\ +Debian\" -DMKSH_BUILDMEAT -DMKSH_BINSHPOSIX -DMKSH_BINSHREDUCED -DMKSH_SMALL -DMKSH_SMALL_BUT_FAST -DMKSH_BUILDSH=1 -D_GNU_SOURCE -DSETUID_CAN_FAIL_WITH_EAGAIN=1 -D_BSD_SOURCE -DHAVE_STRING_POOLING=2 -DHAVE_ATTRIBUTE_BOUNDED=0 -DHAVE_ATTRIBUTE_FORMAT=1 -DHAVE_ATTRIBUTE_NORETURN=1 -DHAVE_ATTRIBUTE_UNUSED=1 -DHAVE_ATTRIBUTE_USED=1 -Wl,-z,relro -Wl,-z,now -Wl,--as-needed   -fno-lto -Wno-error conftest.c  || for _f in ${tcfn}*; do case $_f in lksh.1|mksh.1|mksh.faq|mksh.ico) ;; *) rm -f "$_f" ;; esac; done
 ] gcc -nostdlib -static -L/usr/lib/x86_64-linux-gnu/diet/lib-x86_64 -L/usr/lib/diet/lib /usr/lib/x86_64-linux-gnu/diet/lib-x86_64/start.o -g -ffile-prefix-map=/build/reproducible-path/mksh-59c=. -Wformat -Werror=format-security -Wall -Wextra -fno-lto -Wno-deprecated-declarations -fno-asynchronous-unwind-tables -fno-strict-aliasing -fstack-protector-strong -malign-data=abi -fwrapv -I. -I../.. -Wdate-time -D_FORTIFY_SOURCE=2 -DMKSH_EARLY_LOCALE_TRACKING -DKSH_VERSIONNAME_VENDOR_EXT=" +Debian" -DMKSH_BUILDMEAT -DMKSH_BINSHPOSIX -DMKSH_BINSHREDUCED -DMKSH_SMALL -DMKSH_SMALL_BUT_FAST -DMKSH_BUILDSH=1 -D_GNU_SOURCE -DSETUID_CAN_FAIL_WITH_EAGAIN=1 -D_BSD_SOURCE -DHAVE_STRING_POOLING=2 -DHAVE_ATTRIBUTE_BOUNDED=0 -DHAVE_ATTRIBUTE_FORMAT=1 -DHAVE_ATTRIBUTE_NORETURN=1 -DHAVE_ATTRIBUTE_UNUSED=1 -DHAVE_ATTRIBUTE_USED=1 -Wl,-z,relro -Wl,-z,now -Wl,--as-needed -fno-lto -Wno-error conftest.c -isystem /usr/lib/x86_64-linux-gnu/diet/include -D__dietlibc__ -Os /usr/lib/x86_64-linux-gnu/diet/lib-x86_64/libc.a -lgcc 
-] /usr/bin/ld: /tmp/ccsyVfHs.o: in function `main':
+] /usr/bin/ld: /tmp/cczi6GBS.o: in function `main':
 ] ./builddir/static-dietlibc/./builddir/static-dietlibc/conftest.c:15: undefined reference to `thiswillneverbedefinedIhope'
 ] collect2: error: ld returned 1 exit status
 ==> if mksh will be built without job control... no
 ... if mksh will be built without job signals
 $ diet -v -Os gcc -g -ffile-prefix-map=/build/reproducible-path/mksh-59c=. -Wformat -Werror=format-security -Wall -Wextra -fno-lto -Wno-deprecated-declarations -fno-asynchronous-unwind-tables -fno-strict-aliasing -fstack-protector-strong -malign-data=abi -fwrapv  -I. -I'../..' -Wdate-time -D_FORTIFY_SOURCE=2 -DMKSH_EARLY_LOCALE_TRACKING -DKSH_VERSIONNAME_VENDOR_EXT=\"\ +Debian\" -DMKSH_BUILDMEAT -DMKSH_BINSHPOSIX -DMKSH_BINSHREDUCED -DMKSH_SMALL -DMKSH_SMALL_BUT_FAST -DMKSH_BUILDSH=1 -D_GNU_SOURCE -DSETUID_CAN_FAIL_WITH_EAGAIN=1 -D_BSD_SOURCE -DHAVE_STRING_POOLING=2 -DHAVE_ATTRIBUTE_BOUNDED=0 -DHAVE_ATTRIBUTE_FORMAT=1 -DHAVE_ATTRIBUTE_NORETURN=1 -DHAVE_ATTRIBUTE_UNUSED=1 -DHAVE_ATTRIBUTE_USED=1 -Wl,-z,relro -Wl,-z,now -Wl,--as-needed   -fno-lto -Wno-error conftest.c  || for _f in ${tcfn}*; do case $_f in lksh.1|mksh.1|mksh.faq|mksh.ico) ;; *) rm -f "$_f" ;; esac; done
 ] gcc -nostdlib -static -L/usr/lib/x86_64-linux-gnu/diet/lib-x86_64 -L/usr/lib/diet/lib /usr/lib/x86_64-linux-gnu/diet/lib-x86_64/start.o -g -ffile-prefix-map=/build/reproducible-path/mksh-59c=. -Wformat -Werror=format-security -Wall -Wextra -fno-lto -Wno-deprecated-declarations -fno-asynchronous-unwind-tables -fno-strict-aliasing -fstack-protector-strong -malign-data=abi -fwrapv -I. -I../.. -Wdate-time -D_FORTIFY_SOURCE=2 -DMKSH_EARLY_LOCALE_TRACKING -DKSH_VERSIONNAME_VENDOR_EXT=" +Debian" -DMKSH_BUILDMEAT -DMKSH_BINSHPOSIX -DMKSH_BINSHREDUCED -DMKSH_SMALL -DMKSH_SMALL_BUT_FAST -DMKSH_BUILDSH=1 -D_GNU_SOURCE -DSETUID_CAN_FAIL_WITH_EAGAIN=1 -D_BSD_SOURCE -DHAVE_STRING_POOLING=2 -DHAVE_ATTRIBUTE_BOUNDED=0 -DHAVE_ATTRIBUTE_FORMAT=1 -DHAVE_ATTRIBUTE_NORETURN=1 -DHAVE_ATTRIBUTE_UNUSED=1 -DHAVE_ATTRIBUTE_USED=1 -Wl,-z,relro -Wl,-z,now -Wl,--as-needed -fno-lto -Wno-error conftest.c -isystem /usr/lib/x86_64-linux-gnu/diet/include -D__dietlibc__ -Os /usr/lib/x86_64-linux-gnu/diet/lib-x86_64/libc.a -lgcc 
-] /usr/bin/ld: /tmp/ccsxpOQG.o: in function `main':
+] /usr/bin/ld: /tmp/ccG0HZcu.o: in function `main':
 ] ./builddir/static-dietlibc/./builddir/static-dietlibc/conftest.c:15: undefined reference to `thiswillneverbedefinedIhope'
 ] collect2: error: ld returned 1 exit status
 ==> if mksh will be built without job signals... no
 ... if the default UTF-8 mode is specified
 $ diet -v -Os gcc -g -ffile-prefix-map=/build/reproducible-path/mksh-59c=. -Wformat -Werror=format-security -Wall -Wextra -fno-lto -Wno-deprecated-declarations -fno-asynchronous-unwind-tables -fno-strict-aliasing -fstack-protector-strong -malign-data=abi -fwrapv  -I. -I'../..' -Wdate-time -D_FORTIFY_SOURCE=2 -DMKSH_EARLY_LOCALE_TRACKING -DKSH_VERSIONNAME_VENDOR_EXT=\"\ +Debian\" -DMKSH_BUILDMEAT -DMKSH_BINSHPOSIX -DMKSH_BINSHREDUCED -DMKSH_SMALL -DMKSH_SMALL_BUT_FAST -DMKSH_BUILDSH=1 -D_GNU_SOURCE -DSETUID_CAN_FAIL_WITH_EAGAIN=1 -D_BSD_SOURCE -DHAVE_STRING_POOLING=2 -DHAVE_ATTRIBUTE_BOUNDED=0 -DHAVE_ATTRIBUTE_FORMAT=1 -DHAVE_ATTRIBUTE_NORETURN=1 -DHAVE_ATTRIBUTE_UNUSED=1 -DHAVE_ATTRIBUTE_USED=1 -Wl,-z,relro -Wl,-z,now -Wl,--as-needed   -fno-lto -Wno-error conftest.c  || for _f in ${tcfn}*; do case $_f in lksh.1|mksh.1|mksh.faq|mksh.ico) ;; *) rm -f "$_f" ;; esac; done
 ] gcc -nostdlib -static -L/usr/lib/x86_64-linux-gnu/diet/lib-x86_64 -L/usr/lib/diet/lib /usr/lib/x86_64-linux-gnu/diet/lib-x86_64/start.o -g -ffile-prefix-map=/build/reproducible-path/mksh-59c=. -Wformat -Werror=format-security -Wall -Wextra -fno-lto -Wno-deprecated-declarations -fno-asynchronous-unwind-tables -fno-strict-aliasing -fstack-protector-strong -malign-data=abi -fwrapv -I. -I../.. -Wdate-time -D_FORTIFY_SOURCE=2 -DMKSH_EARLY_LOCALE_TRACKING -DKSH_VERSIONNAME_VENDOR_EXT=" +Debian" -DMKSH_BUILDMEAT -DMKSH_BINSHPOSIX -DMKSH_BINSHREDUCED -DMKSH_SMALL -DMKSH_SMALL_BUT_FAST -DMKSH_BUILDSH=1 -D_GNU_SOURCE -DSETUID_CAN_FAIL_WITH_EAGAIN=1 -D_BSD_SOURCE -DHAVE_STRING_POOLING=2 -DHAVE_ATTRIBUTE_BOUNDED=0 -DHAVE_ATTRIBUTE_FORMAT=1 -DHAVE_ATTRIBUTE_NORETURN=1 -DHAVE_ATTRIBUTE_UNUSED=1 -DHAVE_ATTRIBUTE_USED=1 -Wl,-z,relro -Wl,-z,now -Wl,--as-needed -fno-lto -Wno-error conftest.c -isystem /usr/lib/x86_64-linux-gnu/diet/include -D__dietlibc__ -Os /usr/lib/x86_64-linux-gnu/diet/lib-x86_64/libc.a -lgcc 
-] /usr/bin/ld: /tmp/ccXVhVAd.o: in function `main':
+] /usr/bin/ld: /tmp/ccGL87fk.o: in function `main':
 ] ./builddir/static-dietlibc/./builddir/static-dietlibc/conftest.c:15: undefined reference to `thiswillneverbedefinedIhope'
 ] collect2: error: ld returned 1 exit status
 ==> if the default UTF-8 mode is specified... no
@@ -4009,7 +4045,7 @@
 ... if the MidnightBSD 0.1 ash compatibility mode is requested
 $ diet -v -Os gcc -g -ffile-prefix-map=/build/reproducible-path/mksh-59c=. -Wformat -Werror=format-security -Wall -Wextra -fno-lto -Wno-deprecated-declarations -fno-asynchronous-unwind-tables -fno-strict-aliasing -fstack-protector-strong -malign-data=abi -fwrapv  -I. -I'../..' -Wdate-time -D_FORTIFY_SOURCE=2 -DMKSH_EARLY_LOCALE_TRACKING -DKSH_VERSIONNAME_VENDOR_EXT=\"\ +Debian\" -DMKSH_BUILDMEAT -DMKSH_BINSHPOSIX -DMKSH_BINSHREDUCED -DMKSH_SMALL -DMKSH_SMALL_BUT_FAST -DMKSH_BUILDSH=1 -D_GNU_SOURCE -DSETUID_CAN_FAIL_WITH_EAGAIN=1 -D_BSD_SOURCE -DHAVE_STRING_POOLING=2 -DHAVE_ATTRIBUTE_BOUNDED=0 -DHAVE_ATTRIBUTE_FORMAT=1 -DHAVE_ATTRIBUTE_NORETURN=1 -DHAVE_ATTRIBUTE_UNUSED=1 -DHAVE_ATTRIBUTE_USED=1 -Wl,-z,relro -Wl,-z,now -Wl,--as-needed   -fno-lto -Wno-error conftest.c  || for _f in ${tcfn}*; do case $_f in lksh.1|mksh.1|mksh.faq|mksh.ico) ;; *) rm -f "$_f" ;; esac; done
 ] gcc -nostdlib -static -L/usr/lib/x86_64-linux-gnu/diet/lib-x86_64 -L/usr/lib/diet/lib /usr/lib/x86_64-linux-gnu/diet/lib-x86_64/start.o -g -ffile-prefix-map=/build/reproducible-path/mksh-59c=. -Wformat -Werror=format-security -Wall -Wextra -fno-lto -Wno-deprecated-declarations -fno-asynchronous-unwind-tables -fno-strict-aliasing -fstack-protector-strong -malign-data=abi -fwrapv -I. -I../.. -Wdate-time -D_FORTIFY_SOURCE=2 -DMKSH_EARLY_LOCALE_TRACKING -DKSH_VERSIONNAME_VENDOR_EXT=" +Debian" -DMKSH_BUILDMEAT -DMKSH_BINSHPOSIX -DMKSH_BINSHREDUCED -DMKSH_SMALL -DMKSH_SMALL_BUT_FAST -DMKSH_BUILDSH=1 -D_GNU_SOURCE -DSETUID_CAN_FAIL_WITH_EAGAIN=1 -D_BSD_SOURCE -DHAVE_STRING_POOLING=2 -DHAVE_ATTRIBUTE_BOUNDED=0 -DHAVE_ATTRIBUTE_FORMAT=1 -DHAVE_ATTRIBUTE_NORETURN=1 -DHAVE_ATTRIBUTE_UNUSED=1 -DHAVE_ATTRIBUTE_USED=1 -Wl,-z,relro -Wl,-z,now -Wl,--as-needed -fno-lto -Wno-error conftest.c -isystem /usr/lib/x86_64-linux-gnu/diet/include -D__dietlibc__ -Os /usr/lib/x86_64-linux-gnu/diet/lib-x86_64/libc.a -lgcc 
-] /usr/bin/ld: /tmp/ccJUgdRE.o: in function `main':
+] /usr/bin/ld: /tmp/ccTX4tmF.o: in function `main':
 ] ./builddir/static-dietlibc/./builddir/static-dietlibc/conftest.c:15: undefined reference to `thiswillneverbedefinedIhope'
 ] collect2: error: ld returned 1 exit status
 ==> if the MidnightBSD 0.1 ash compatibility mode is requested... no
@@ -4155,7 +4191,7 @@
 ... GNU strerrordesc_np()
 $ diet -v -Os gcc -g -ffile-prefix-map=/build/reproducible-path/mksh-59c=. -Wformat -Werror=format-security -Wall -Wextra -fno-lto -Wno-deprecated-declarations -fno-asynchronous-unwind-tables -fno-strict-aliasing -fstack-protector-strong -malign-data=abi -fwrapv  -I. -I'../..' -Wdate-time -D_FORTIFY_SOURCE=2 -DMKSH_EARLY_LOCALE_TRACKING -DKSH_VERSIONNAME_VENDOR_EXT=\"\ +Debian\" -DMKSH_BUILDMEAT -DMKSH_BINSHPOSIX -DMKSH_BINSHREDUCED -DMKSH_SMALL -DMKSH_SMALL_BUT_FAST -DMKSH_BUILDSH=1 -D_GNU_SOURCE -DSETUID_CAN_FAIL_WITH_EAGAIN=1 -D_BSD_SOURCE -DHAVE_STRING_POOLING=2 -DHAVE_ATTRIBUTE_BOUNDED=0 -DHAVE_ATTRIBUTE_FORMAT=1 -DHAVE_ATTRIBUTE_NORETURN=1 -DHAVE_ATTRIBUTE_UNUSED=1 -DHAVE_ATTRIBUTE_USED=1 -DHAVE_SYS_TIME_H=1 -DHAVE_TIME_H=1 -DHAVE_BOTH_TIME_H=1 -DHAVE_SYS_SELECT_H=1 -DHAVE_SELECT_TIME_H=1 -DHAVE_SYS_BSDTYPES_H=0 -DHAVE_SYS_FILE_H=1 -DHAVE_SYS_MKDEV_H=0 -DHAVE_SYS_MMAN_H=1 -DHAVE_SYS_PARAM_H=1 -DHAVE_SYS_PTEM_H=0 -DHAVE_SYS_RESOURCE_H=1 -DHAVE_SYS_SYSMACROS_H=1 -DHAVE_BSTRING_H=0 -DHAVE_GRP_H=1 -DHAVE_IO_H=0 -DHAVE_LIBGEN_H=1 -DHAVE_LIBUTIL_H=0 -DHAVE_PATHS_H=1 -DHAVE_STDINT_H=1 -DHAVE_STRINGS_H=1 -DHAVE_TERMIOS_H=1 -DHAVE_ULIMIT_H=1 -DHAVE_VALUES_H=1 -DHAVE_CAN_INTTYPES=1 -DHAVE_SIG_T=1 -Wl,-z,relro -Wl,-z,now -Wl,--as-needed   -fno-lto -Wno-error conftest.c  || for _f in ${tcfn}*; do case $_f in lksh.1|mksh.1|mksh.faq|mksh.ico) ;; *) rm -f "$_f" ;; esac; done
 ] gcc -nostdlib -static -L/usr/lib/x86_64-linux-gnu/diet/lib-x86_64 -L/usr/lib/diet/lib /usr/lib/x86_64-linux-gnu/diet/lib-x86_64/start.o -g -ffile-prefix-map=/build/reproducible-path/mksh-59c=. -Wformat -Werror=format-security -Wall -Wextra -fno-lto -Wno-deprecated-declarations -fno-asynchronous-unwind-tables -fno-strict-aliasing -fstack-protector-strong -malign-data=abi -fwrapv -I. -I../.. -Wdate-time -D_FORTIFY_SOURCE=2 -DMKSH_EARLY_LOCALE_TRACKING -DKSH_VERSIONNAME_VENDOR_EXT=" +Debian" -DMKSH_BUILDMEAT -DMKSH_BINSHPOSIX -DMKSH_BINSHREDUCED -DMKSH_SMALL -DMKSH_SMALL_BUT_FAST -DMKSH_BUILDSH=1 -D_GNU_SOURCE -DSETUID_CAN_FAIL_WITH_EAGAIN=1 -D_BSD_SOURCE -DHAVE_STRING_POOLING=2 -DHAVE_ATTRIBUTE_BOUNDED=0 -DHAVE_ATTRIBUTE_FORMAT=1 -DHAVE_ATTRIBUTE_NORETURN=1 -DHAVE_ATTRIBUTE_UNUSED=1 -DHAVE_ATTRIBUTE_USED=1 -DHAVE_SYS_TIME_H=1 -DHAVE_TIME_H=1 -DHAVE_BOTH_TIME_H=1 -DHAVE_SYS_SELECT_H=1 -DHAVE_SELECT_TIME_H=1 -DHAVE_SYS_BSDTYPES_H=0 -DHAVE_SYS_FILE_H=1 -DHAVE_SYS_MKDEV_H=0 -DHAVE_SYS_MMAN_H=1 -DHAVE_SYS_PARAM_H=1 -DHAVE_SYS_PTEM_H=0 -DHAVE_SYS_RESOURCE_H=1 -DHAVE_SYS_SYSMACROS_H=1 -DHAVE_BSTRING_H=0 -DHAVE_GRP_H=1 -DHAVE_IO_H=0 -DHAVE_LIBGEN_H=1 -DHAVE_LIBUTIL_H=0 -DHAVE_PATHS_H=1 -DHAVE_STDINT_H=1 -DHAVE_STRINGS_H=1 -DHAVE_TERMIOS_H=1 -DHAVE_ULIMIT_H=1 -DHAVE_VALUES_H=1 -DHAVE_CAN_INTTYPES=1 -DHAVE_SIG_T=1 -Wl,-z,relro -Wl,-z,now -Wl,--as-needed -fno-lto -Wno-error conftest.c -isystem /usr/lib/x86_64-linux-gnu/diet/include -D__dietlibc__ -Os /usr/lib/x86_64-linux-gnu/diet/lib-x86_64/libc.a -lgcc 
-] /usr/bin/ld: /tmp/ccdYIM0X.o: in function `main':
+] /usr/bin/ld: /tmp/cc7vgKvW.o: in function `main':
 ] ./builddir/static-dietlibc/./builddir/static-dietlibc/conftest.c:9: undefined reference to `strerrordesc_np'
 ] collect2: error: ld returned 1 exit status
 ==> GNU strerrordesc_np()... no
@@ -4167,28 +4203,28 @@
 ... GNU sigabbrev_np()
 $ diet -v -Os gcc -g -ffile-prefix-map=/build/reproducible-path/mksh-59c=. -Wformat -Werror=format-security -Wall -Wextra -fno-lto -Wno-deprecated-declarations -fno-asynchronous-unwind-tables -fno-strict-aliasing -fstack-protector-strong -malign-data=abi -fwrapv  -I. -I'../..' -Wdate-time -D_FORTIFY_SOURCE=2 -DMKSH_EARLY_LOCALE_TRACKING -DKSH_VERSIONNAME_VENDOR_EXT=\"\ +Debian\" -DMKSH_BUILDMEAT -DMKSH_BINSHPOSIX -DMKSH_BINSHREDUCED -DMKSH_SMALL -DMKSH_SMALL_BUT_FAST -DMKSH_BUILDSH=1 -D_GNU_SOURCE -DSETUID_CAN_FAIL_WITH_EAGAIN=1 -D_BSD_SOURCE -DHAVE_STRING_POOLING=2 -DHAVE_ATTRIBUTE_BOUNDED=0 -DHAVE_ATTRIBUTE_FORMAT=1 -DHAVE_ATTRIBUTE_NORETURN=1 -DHAVE_ATTRIBUTE_UNUSED=1 -DHAVE_ATTRIBUTE_USED=1 -DHAVE_SYS_TIME_H=1 -DHAVE_TIME_H=1 -DHAVE_BOTH_TIME_H=1 -DHAVE_SYS_SELECT_H=1 -DHAVE_SELECT_TIME_H=1 -DHAVE_SYS_BSDTYPES_H=0 -DHAVE_SYS_FILE_H=1 -DHAVE_SYS_MKDEV_H=0 -DHAVE_SYS_MMAN_H=1 -DHAVE_SYS_PARAM_H=1 -DHAVE_SYS_PTEM_H=0 -DHAVE_SYS_RESOURCE_H=1 -DHAVE_SYS_SYSMACROS_H=1 -DHAVE_BSTRING_H=0 -DHAVE_GRP_H=1 -DHAVE_IO_H=0 -DHAVE_LIBGEN_H=1 -DHAVE_LIBUTIL_H=0 -DHAVE_PATHS_H=1 -DHAVE_STDINT_H=1 -DHAVE_STRINGS_H=1 -DHAVE_TERMIOS_H=1 -DHAVE_ULIMIT_H=1 -DHAVE_VALUES_H=1 -DHAVE_CAN_INTTYPES=1 -DHAVE_SIG_T=1 -DHAVE_STRERRORDESC_NP=0 -DHAVE_SYS_ERRLIST=1 -Wl,-z,relro -Wl,-z,now -Wl,--as-needed   -fno-lto -Wno-error conftest.c  || for _f in ${tcfn}*; do case $_f in lksh.1|mksh.1|mksh.faq|mksh.ico) ;; *) rm -f "$_f" ;; esac; done
 ] gcc -nostdlib -static -L/usr/lib/x86_64-linux-gnu/diet/lib-x86_64 -L/usr/lib/diet/lib /usr/lib/x86_64-linux-gnu/diet/lib-x86_64/start.o -g -ffile-prefix-map=/build/reproducible-path/mksh-59c=. -Wformat -Werror=format-security -Wall -Wextra -fno-lto -Wno-deprecated-declarations -fno-asynchronous-unwind-tables -fno-strict-aliasing -fstack-protector-strong -malign-data=abi -fwrapv -I. -I../.. -Wdate-time -D_FORTIFY_SOURCE=2 -DMKSH_EARLY_LOCALE_TRACKING -DKSH_VERSIONNAME_VENDOR_EXT=" +Debian" -DMKSH_BUILDMEAT -DMKSH_BINSHPOSIX -DMKSH_BINSHREDUCED -DMKSH_SMALL -DMKSH_SMALL_BUT_FAST -DMKSH_BUILDSH=1 -D_GNU_SOURCE -DSETUID_CAN_FAIL_WITH_EAGAIN=1 -D_BSD_SOURCE -DHAVE_STRING_POOLING=2 -DHAVE_ATTRIBUTE_BOUNDED=0 -DHAVE_ATTRIBUTE_FORMAT=1 -DHAVE_ATTRIBUTE_NORETURN=1 -DHAVE_ATTRIBUTE_UNUSED=1 -DHAVE_ATTRIBUTE_USED=1 -DHAVE_SYS_TIME_H=1 -DHAVE_TIME_H=1 -DHAVE_BOTH_TIME_H=1 -DHAVE_SYS_SELECT_H=1 -DHAVE_SELECT_TIME_H=1 -DHAVE_SYS_BSDTYPES_H=0 -DHAVE_SYS_FILE_H=1 -DHAVE_SYS_MKDEV_H=0 -DHAVE_SYS_MMAN_H=1 -DHAVE_SYS_PARAM_H=1 -DHAVE_SYS_PTEM_H=0 -DHAVE_SYS_RESOURCE_H=1 -DHAVE_SYS_SYSMACROS_H=1 -DHAVE_BSTRING_H=0 -DHAVE_GRP_H=1 -DHAVE_IO_H=0 -DHAVE_LIBGEN_H=1 -DHAVE_LIBUTIL_H=0 -DHAVE_PATHS_H=1 -DHAVE_STDINT_H=1 -DHAVE_STRINGS_H=1 -DHAVE_TERMIOS_H=1 -DHAVE_ULIMIT_H=1 -DHAVE_VALUES_H=1 -DHAVE_CAN_INTTYPES=1 -DHAVE_SIG_T=1 -DHAVE_STRERRORDESC_NP=0 -DHAVE_SYS_ERRLIST=1 -Wl,-z,relro -Wl,-z,now -Wl,--as-needed -fno-lto -Wno-error conftest.c -isystem /usr/lib/x86_64-linux-gnu/diet/include -D__dietlibc__ -Os /usr/lib/x86_64-linux-gnu/diet/lib-x86_64/libc.a -lgcc 
-] /usr/bin/ld: /tmp/cc2P9D6X.o: in function `main':
+] /usr/bin/ld: /tmp/ccaFnuID.o: in function `main':
 ] ./builddir/static-dietlibc/./builddir/static-dietlibc/conftest.c:9: undefined reference to `sigabbrev_np'
 ] collect2: error: ld returned 1 exit status
 ==> GNU sigabbrev_np()... no
 ... the sys_signame[] array
 $ diet -v -Os gcc -g -ffile-prefix-map=/build/reproducible-path/mksh-59c=. -Wformat -Werror=format-security -Wall -Wextra -fno-lto -Wno-deprecated-declarations -fno-asynchronous-unwind-tables -fno-strict-aliasing -fstack-protector-strong -malign-data=abi -fwrapv  -I. -I'../..' -Wdate-time -D_FORTIFY_SOURCE=2 -DMKSH_EARLY_LOCALE_TRACKING -DKSH_VERSIONNAME_VENDOR_EXT=\"\ +Debian\" -DMKSH_BUILDMEAT -DMKSH_BINSHPOSIX -DMKSH_BINSHREDUCED -DMKSH_SMALL -DMKSH_SMALL_BUT_FAST -DMKSH_BUILDSH=1 -D_GNU_SOURCE -DSETUID_CAN_FAIL_WITH_EAGAIN=1 -D_BSD_SOURCE -DHAVE_STRING_POOLING=2 -DHAVE_ATTRIBUTE_BOUNDED=0 -DHAVE_ATTRIBUTE_FORMAT=1 -DHAVE_ATTRIBUTE_NORETURN=1 -DHAVE_ATTRIBUTE_UNUSED=1 -DHAVE_ATTRIBUTE_USED=1 -DHAVE_SYS_TIME_H=1 -DHAVE_TIME_H=1 -DHAVE_BOTH_TIME_H=1 -DHAVE_SYS_SELECT_H=1 -DHAVE_SELECT_TIME_H=1 -DHAVE_SYS_BSDTYPES_H=0 -DHAVE_SYS_FILE_H=1 -DHAVE_SYS_MKDEV_H=0 -DHAVE_SYS_MMAN_H=1 -DHAVE_SYS_PARAM_H=1 -DHAVE_SYS_PTEM_H=0 -DHAVE_SYS_RESOURCE_H=1 -DHAVE_SYS_SYSMACROS_H=1 -DHAVE_BSTRING_H=0 -DHAVE_GRP_H=1 -DHAVE_IO_H=0 -DHAVE_LIBGEN_H=1 -DHAVE_LIBUTIL_H=0 -DHAVE_PATHS_H=1 -DHAVE_STDINT_H=1 -DHAVE_STRINGS_H=1 -DHAVE_TERMIOS_H=1 -DHAVE_ULIMIT_H=1 -DHAVE_VALUES_H=1 -DHAVE_CAN_INTTYPES=1 -DHAVE_SIG_T=1 -DHAVE_STRERRORDESC_NP=0 -DHAVE_SYS_ERRLIST=1 -DHAVE_SIGABBREV_NP=0 -Wl,-z,relro -Wl,-z,now -Wl,--as-needed   -fno-lto -Wno-error conftest.c  || for _f in ${tcfn}*; do case $_f in lksh.1|mksh.1|mksh.faq|mksh.ico) ;; *) rm -f "$_f" ;; esac; done
 ] gcc -nostdlib -static -L/usr/lib/x86_64-linux-gnu/diet/lib-x86_64 -L/usr/lib/diet/lib /usr/lib/x86_64-linux-gnu/diet/lib-x86_64/start.o -g -ffile-prefix-map=/build/reproducible-path/mksh-59c=. -Wformat -Werror=format-security -Wall -Wextra -fno-lto -Wno-deprecated-declarations -fno-asynchronous-unwind-tables -fno-strict-aliasing -fstack-protector-strong -malign-data=abi -fwrapv -I. -I../.. -Wdate-time -D_FORTIFY_SOURCE=2 -DMKSH_EARLY_LOCALE_TRACKING -DKSH_VERSIONNAME_VENDOR_EXT=" +Debian" -DMKSH_BUILDMEAT -DMKSH_BINSHPOSIX -DMKSH_BINSHREDUCED -DMKSH_SMALL -DMKSH_SMALL_BUT_FAST -DMKSH_BUILDSH=1 -D_GNU_SOURCE -DSETUID_CAN_FAIL_WITH_EAGAIN=1 -D_BSD_SOURCE -DHAVE_STRING_POOLING=2 -DHAVE_ATTRIBUTE_BOUNDED=0 -DHAVE_ATTRIBUTE_FORMAT=1 -DHAVE_ATTRIBUTE_NORETURN=1 -DHAVE_ATTRIBUTE_UNUSED=1 -DHAVE_ATTRIBUTE_USED=1 -DHAVE_SYS_TIME_H=1 -DHAVE_TIME_H=1 -DHAVE_BOTH_TIME_H=1 -DHAVE_SYS_SELECT_H=1 -DHAVE_SELECT_TIME_H=1 -DHAVE_SYS_BSDTYPES_H=0 -DHAVE_SYS_FILE_H=1 -DHAVE_SYS_MKDEV_H=0 -DHAVE_SYS_MMAN_H=1 -DHAVE_SYS_PARAM_H=1 -DHAVE_SYS_PTEM_H=0 -DHAVE_SYS_RESOURCE_H=1 -DHAVE_SYS_SYSMACROS_H=1 -DHAVE_BSTRING_H=0 -DHAVE_GRP_H=1 -DHAVE_IO_H=0 -DHAVE_LIBGEN_H=1 -DHAVE_LIBUTIL_H=0 -DHAVE_PATHS_H=1 -DHAVE_STDINT_H=1 -DHAVE_STRINGS_H=1 -DHAVE_TERMIOS_H=1 -DHAVE_ULIMIT_H=1 -DHAVE_VALUES_H=1 -DHAVE_CAN_INTTYPES=1 -DHAVE_SIG_T=1 -DHAVE_STRERRORDESC_NP=0 -DHAVE_SYS_ERRLIST=1 -DHAVE_SIGABBREV_NP=0 -Wl,-z,relro -Wl,-z,now -Wl,--as-needed -fno-lto -Wno-error conftest.c -isystem /usr/lib/x86_64-linux-gnu/diet/include -D__dietlibc__ -Os /usr/lib/x86_64-linux-gnu/diet/lib-x86_64/libc.a -lgcc 
-] /usr/bin/ld: /tmp/ccdGgtjl.o: in function `main':
+] /usr/bin/ld: /tmp/ccviZHr2.o: in function `main':
 ] ./builddir/static-dietlibc/./builddir/static-dietlibc/conftest.c:10: undefined reference to `sys_signame'
 ] collect2: error: ld returned 1 exit status
 ==> the sys_signame[] array... no
 ... the _sys_signame[] array
 $ diet -v -Os gcc -g -ffile-prefix-map=/build/reproducible-path/mksh-59c=. -Wformat -Werror=format-security -Wall -Wextra -fno-lto -Wno-deprecated-declarations -fno-asynchronous-unwind-tables -fno-strict-aliasing -fstack-protector-strong -malign-data=abi -fwrapv  -I. -I'../..' -Wdate-time -D_FORTIFY_SOURCE=2 -DMKSH_EARLY_LOCALE_TRACKING -DKSH_VERSIONNAME_VENDOR_EXT=\"\ +Debian\" -DMKSH_BUILDMEAT -DMKSH_BINSHPOSIX -DMKSH_BINSHREDUCED -DMKSH_SMALL -DMKSH_SMALL_BUT_FAST -DMKSH_BUILDSH=1 -D_GNU_SOURCE -DSETUID_CAN_FAIL_WITH_EAGAIN=1 -D_BSD_SOURCE -DHAVE_STRING_POOLING=2 -DHAVE_ATTRIBUTE_BOUNDED=0 -DHAVE_ATTRIBUTE_FORMAT=1 -DHAVE_ATTRIBUTE_NORETURN=1 -DHAVE_ATTRIBUTE_UNUSED=1 -DHAVE_ATTRIBUTE_USED=1 -DHAVE_SYS_TIME_H=1 -DHAVE_TIME_H=1 -DHAVE_BOTH_TIME_H=1 -DHAVE_SYS_SELECT_H=1 -DHAVE_SELECT_TIME_H=1 -DHAVE_SYS_BSDTYPES_H=0 -DHAVE_SYS_FILE_H=1 -DHAVE_SYS_MKDEV_H=0 -DHAVE_SYS_MMAN_H=1 -DHAVE_SYS_PARAM_H=1 -DHAVE_SYS_PTEM_H=0 -DHAVE_SYS_RESOURCE_H=1 -DHAVE_SYS_SYSMACROS_H=1 -DHAVE_BSTRING_H=0 -DHAVE_GRP_H=1 -DHAVE_IO_H=0 -DHAVE_LIBGEN_H=1 -DHAVE_LIBUTIL_H=0 -DHAVE_PATHS_H=1 -DHAVE_STDINT_H=1 -DHAVE_STRINGS_H=1 -DHAVE_TERMIOS_H=1 -DHAVE_ULIMIT_H=1 -DHAVE_VALUES_H=1 -DHAVE_CAN_INTTYPES=1 -DHAVE_SIG_T=1 -DHAVE_STRERRORDESC_NP=0 -DHAVE_SYS_ERRLIST=1 -DHAVE_SIGABBREV_NP=0 -Wl,-z,relro -Wl,-z,now -Wl,--as-needed   -fno-lto -Wno-error conftest.c  || for _f in ${tcfn}*; do case $_f in lksh.1|mksh.1|mksh.faq|mksh.ico) ;; *) rm -f "$_f" ;; esac; done
 ] gcc -nostdlib -static -L/usr/lib/x86_64-linux-gnu/diet/lib-x86_64 -L/usr/lib/diet/lib /usr/lib/x86_64-linux-gnu/diet/lib-x86_64/start.o -g -ffile-prefix-map=/build/reproducible-path/mksh-59c=. -Wformat -Werror=format-security -Wall -Wextra -fno-lto -Wno-deprecated-declarations -fno-asynchronous-unwind-tables -fno-strict-aliasing -fstack-protector-strong -malign-data=abi -fwrapv -I. -I../.. -Wdate-time -D_FORTIFY_SOURCE=2 -DMKSH_EARLY_LOCALE_TRACKING -DKSH_VERSIONNAME_VENDOR_EXT=" +Debian" -DMKSH_BUILDMEAT -DMKSH_BINSHPOSIX -DMKSH_BINSHREDUCED -DMKSH_SMALL -DMKSH_SMALL_BUT_FAST -DMKSH_BUILDSH=1 -D_GNU_SOURCE -DSETUID_CAN_FAIL_WITH_EAGAIN=1 -D_BSD_SOURCE -DHAVE_STRING_POOLING=2 -DHAVE_ATTRIBUTE_BOUNDED=0 -DHAVE_ATTRIBUTE_FORMAT=1 -DHAVE_ATTRIBUTE_NORETURN=1 -DHAVE_ATTRIBUTE_UNUSED=1 -DHAVE_ATTRIBUTE_USED=1 -DHAVE_SYS_TIME_H=1 -DHAVE_TIME_H=1 -DHAVE_BOTH_TIME_H=1 -DHAVE_SYS_SELECT_H=1 -DHAVE_SELECT_TIME_H=1 -DHAVE_SYS_BSDTYPES_H=0 -DHAVE_SYS_FILE_H=1 -DHAVE_SYS_MKDEV_H=0 -DHAVE_SYS_MMAN_H=1 -DHAVE_SYS_PARAM_H=1 -DHAVE_SYS_PTEM_H=0 -DHAVE_SYS_RESOURCE_H=1 -DHAVE_SYS_SYSMACROS_H=1 -DHAVE_BSTRING_H=0 -DHAVE_GRP_H=1 -DHAVE_IO_H=0 -DHAVE_LIBGEN_H=1 -DHAVE_LIBUTIL_H=0 -DHAVE_PATHS_H=1 -DHAVE_STDINT_H=1 -DHAVE_STRINGS_H=1 -DHAVE_TERMIOS_H=1 -DHAVE_ULIMIT_H=1 -DHAVE_VALUES_H=1 -DHAVE_CAN_INTTYPES=1 -DHAVE_SIG_T=1 -DHAVE_STRERRORDESC_NP=0 -DHAVE_SYS_ERRLIST=1 -DHAVE_SIGABBREV_NP=0 -Wl,-z,relro -Wl,-z,now -Wl,--as-needed -fno-lto -Wno-error conftest.c -isystem /usr/lib/x86_64-linux-gnu/diet/include -D__dietlibc__ -Os /usr/lib/x86_64-linux-gnu/diet/lib-x86_64/libc.a -lgcc 
-] /usr/bin/ld: /tmp/ccMvMoXP.o: in function `main':
+] /usr/bin/ld: /tmp/ccyRLY6F.o: in function `main':
 ] ./builddir/static-dietlibc/./builddir/static-dietlibc/conftest.c:10: undefined reference to `_sys_signame'
 ] collect2: error: ld returned 1 exit status
 ==> the _sys_signame[] array... no
 ... GNU sigdescr_np()
 $ diet -v -Os gcc -g -ffile-prefix-map=/build/reproducible-path/mksh-59c=. -Wformat -Werror=format-security -Wall -Wextra -fno-lto -Wno-deprecated-declarations -fno-asynchronous-unwind-tables -fno-strict-aliasing -fstack-protector-strong -malign-data=abi -fwrapv  -I. -I'../..' -Wdate-time -D_FORTIFY_SOURCE=2 -DMKSH_EARLY_LOCALE_TRACKING -DKSH_VERSIONNAME_VENDOR_EXT=\"\ +Debian\" -DMKSH_BUILDMEAT -DMKSH_BINSHPOSIX -DMKSH_BINSHREDUCED -DMKSH_SMALL -DMKSH_SMALL_BUT_FAST -DMKSH_BUILDSH=1 -D_GNU_SOURCE -DSETUID_CAN_FAIL_WITH_EAGAIN=1 -D_BSD_SOURCE -DHAVE_STRING_POOLING=2 -DHAVE_ATTRIBUTE_BOUNDED=0 -DHAVE_ATTRIBUTE_FORMAT=1 -DHAVE_ATTRIBUTE_NORETURN=1 -DHAVE_ATTRIBUTE_UNUSED=1 -DHAVE_ATTRIBUTE_USED=1 -DHAVE_SYS_TIME_H=1 -DHAVE_TIME_H=1 -DHAVE_BOTH_TIME_H=1 -DHAVE_SYS_SELECT_H=1 -DHAVE_SELECT_TIME_H=1 -DHAVE_SYS_BSDTYPES_H=0 -DHAVE_SYS_FILE_H=1 -DHAVE_SYS_MKDEV_H=0 -DHAVE_SYS_MMAN_H=1 -DHAVE_SYS_PARAM_H=1 -DHAVE_SYS_PTEM_H=0 -DHAVE_SYS_RESOURCE_H=1 -DHAVE_SYS_SYSMACROS_H=1 -DHAVE_BSTRING_H=0 -DHAVE_GRP_H=1 -DHAVE_IO_H=0 -DHAVE_LIBGEN_H=1 -DHAVE_LIBUTIL_H=0 -DHAVE_PATHS_H=1 -DHAVE_STDINT_H=1 -DHAVE_STRINGS_H=1 -DHAVE_TERMIOS_H=1 -DHAVE_ULIMIT_H=1 -DHAVE_VALUES_H=1 -DHAVE_CAN_INTTYPES=1 -DHAVE_SIG_T=1 -DHAVE_STRERRORDESC_NP=0 -DHAVE_SYS_ERRLIST=1 -DHAVE_SIGABBREV_NP=0 -DHAVE_SYS_SIGNAME=0 -Wl,-z,relro -Wl,-z,now -Wl,--as-needed   -fno-lto -Wno-error conftest.c  || for _f in ${tcfn}*; do case $_f in lksh.1|mksh.1|mksh.faq|mksh.ico) ;; *) rm -f "$_f" ;; esac; done
 ] gcc -nostdlib -static -L/usr/lib/x86_64-linux-gnu/diet/lib-x86_64 -L/usr/lib/diet/lib /usr/lib/x86_64-linux-gnu/diet/lib-x86_64/start.o -g -ffile-prefix-map=/build/reproducible-path/mksh-59c=. -Wformat -Werror=format-security -Wall -Wextra -fno-lto -Wno-deprecated-declarations -fno-asynchronous-unwind-tables -fno-strict-aliasing -fstack-protector-strong -malign-data=abi -fwrapv -I. -I../.. -Wdate-time -D_FORTIFY_SOURCE=2 -DMKSH_EARLY_LOCALE_TRACKING -DKSH_VERSIONNAME_VENDOR_EXT=" +Debian" -DMKSH_BUILDMEAT -DMKSH_BINSHPOSIX -DMKSH_BINSHREDUCED -DMKSH_SMALL -DMKSH_SMALL_BUT_FAST -DMKSH_BUILDSH=1 -D_GNU_SOURCE -DSETUID_CAN_FAIL_WITH_EAGAIN=1 -D_BSD_SOURCE -DHAVE_STRING_POOLING=2 -DHAVE_ATTRIBUTE_BOUNDED=0 -DHAVE_ATTRIBUTE_FORMAT=1 -DHAVE_ATTRIBUTE_NORETURN=1 -DHAVE_ATTRIBUTE_UNUSED=1 -DHAVE_ATTRIBUTE_USED=1 -DHAVE_SYS_TIME_H=1 -DHAVE_TIME_H=1 -DHAVE_BOTH_TIME_H=1 -DHAVE_SYS_SELECT_H=1 -DHAVE_SELECT_TIME_H=1 -DHAVE_SYS_BSDTYPES_H=0 -DHAVE_SYS_FILE_H=1 -DHAVE_SYS_MKDEV_H=0 -DHAVE_SYS_MMAN_H=1 -DHAVE_SYS_PARAM_H=1 -DHAVE_SYS_PTEM_H=0 -DHAVE_SYS_RESOURCE_H=1 -DHAVE_SYS_SYSMACROS_H=1 -DHAVE_BSTRING_H=0 -DHAVE_GRP_H=1 -DHAVE_IO_H=0 -DHAVE_LIBGEN_H=1 -DHAVE_LIBUTIL_H=0 -DHAVE_PATHS_H=1 -DHAVE_STDINT_H=1 -DHAVE_STRINGS_H=1 -DHAVE_TERMIOS_H=1 -DHAVE_ULIMIT_H=1 -DHAVE_VALUES_H=1 -DHAVE_CAN_INTTYPES=1 -DHAVE_SIG_T=1 -DHAVE_STRERRORDESC_NP=0 -DHAVE_SYS_ERRLIST=1 -DHAVE_SIGABBREV_NP=0 -DHAVE_SYS_SIGNAME=0 -Wl,-z,relro -Wl,-z,now -Wl,--as-needed -fno-lto -Wno-error conftest.c -isystem /usr/lib/x86_64-linux-gnu/diet/include -D__dietlibc__ -Os /usr/lib/x86_64-linux-gnu/diet/lib-x86_64/libc.a -lgcc 
-] /usr/bin/ld: /tmp/ccQyN02O.o: in function `main':
+] /usr/bin/ld: /tmp/cckevdjc.o: in function `main':
 ] ./builddir/static-dietlibc/./builddir/static-dietlibc/conftest.c:9: undefined reference to `sigdescr_np'
 ] collect2: error: ld returned 1 exit status
 ==> GNU sigdescr_np()... no
@@ -5080,10 +5116,10 @@
 Attempting compilation of mksh in legacy with CC='klcc'
 CFLAGS='-Os -fomit-frame-pointer -mno-sse -falign-functions=1 -falign-jumps=1 -falign-loops=1 -fno-asynchronous-unwind-tables -g -ffile-prefix-map=/build/reproducible-path/mksh-59c=. -Wformat -Werror=format-security -Wall -Wextra' CPPFLAGS='-Wdate-time -D_FORTIFY_SOURCE=2 -DMKSH_EARLY_LOCALE_TRACKING -DKSH_VERSIONNAME_VENDOR_EXT=\"\ +Debian\" -DMKSH_BUILDMEAT -DMKSH_BINSHPOSIX -DMKSH_BINSHREDUCED'
 LDFLAGS='-Wl,-z,relro -Wl,-z,now -Wl,--as-needed' LDSTATIC='-static' LIBS=''
-+ env CC=klcc CFLAGS=-Os -fomit-frame-pointer -mno-sse -falign-functions=1 -falign-jumps=1 -falign-loops=1 -fno-asynchronous-unwind-tables -g -ffile-prefix-map=/build/reproducible-path/mksh-59c=. -Wformat -Werror=format-security -Wall -Wextra CPPFLAGS=-Wdate-time -D_FORTIFY_SOURCE=2 -DMKSH_EARLY_LOCALE_TRACKING -DKSH_VERSIONNAME_VENDOR_EXT=\"\ +Debian\" -DMKSH_BUILDMEAT -DMKSH_BINSHPOSIX -DMKSH_BINSHREDUCED LDFLAGS=-Wl,-z,relro -Wl,-z,now -Wl,--as-needed LDSTATIC=-static LIBS= sh ../../Build.sh -r -L
++ env CC=klcc 'CFLAGS=-Os -fomit-frame-pointer -mno-sse -falign-functions=1 -falign-jumps=1 -falign-loops=1 -fno-asynchronous-unwind-tables -g -ffile-prefix-map=/build/reproducible-path/mksh-59c=. -Wformat -Werror=format-security -Wall -Wextra' 'CPPFLAGS=-Wdate-time -D_FORTIFY_SOURCE=2 -DMKSH_EARLY_LOCALE_TRACKING -DKSH_VERSIONNAME_VENDOR_EXT=\"\ +Debian\" -DMKSH_BUILDMEAT -DMKSH_BINSHPOSIX -DMKSH_BINSHREDUCED' 'LDFLAGS=-Wl,-z,relro -Wl,-z,now -Wl,--as-needed' LDSTATIC=-static LIBS= sh ../../Build.sh -r -L
 For the build logs, demonstrate that /dev/null and /dev/tty exist:
-crw-rw-rw- 1 root root 1, 3 Jun  6 22:24 /dev/null
-crw-rw-rw- 1 root root 5, 0 Jun  6 22:24 /dev/tty
+crw-rw-rw- 1 root root 1, 3 Jul 11 06:46 /dev/null
+crw-rw-rw- 1 root root 5, 0 Aug  6 17:43 /dev/tty
 Flags on entry (plus HAVE_* which are not shown here):
 - CC        <klcc>
 - CFLAGS    <-Os -fomit-frame-pointer -mno-sse -falign-functions=1 -falign-jumps=1 -falign-loops=1 -fno-asynchronous-unwind-tables -g -ffile-prefix-map=/build/reproducible-path/mksh-59c=. -Wformat -Werror=format-security -Wall -Wextra>
@@ -5095,11 +5131,11 @@
 
 Hi from $MirOS: src/bin/mksh/Build.sh,v 1.835 2023/01/26 04:32:50 tg Exp $ on:
 $ uname -a >&2
-| Linux infom01-amd64 6.1.0-22-cloud-amd64 #1 SMP PREEMPT_DYNAMIC Debian 6.1.94-1 (2024-06-21) x86_64 GNU/Linux
-Build.sh: Building The MirBSD Korn Shell (mksh) R59 2023/04/29 on Linux 6.1.0-22-cloud-amd64...
+| Linux i-capture-the-hostname 6.7.12+bpo-amd64 #1 SMP PREEMPT_DYNAMIC Debian 6.7.12-1~bpo12+1 (2024-05-06) x86_64 GNU/Linux
+Build.sh: Building The MirBSD Korn Shell (mksh) R59 2023/04/29 on Linux 6.7.12+bpo-amd64...
 Build.sh: Scanning for functions... please ignore any errors.
 ... which compiler type seems to be used
-$ klcc -E -Os -fomit-frame-pointer -mno-sse -falign-functions=1 -falign-jumps=1 -falign-loops=1 -fno-asynchronous-unwind-tables -g -ffile-prefix-map=/build/reproducible-path/mksh-59c=. -Wformat -Werror=format-security -Wall -Wextra -I. -I'../..' -Wdate-time -D_FORTIFY_SOURCE=2 -DMKSH_EARLY_LOCALE_TRACKING -DKSH_VERSIONNAME_VENDOR_EXT=\"\ +Debian\" -DMKSH_BUILDMEAT -DMKSH_BINSHPOSIX -DMKSH_BINSHREDUCED -DMKSH_BUILDSH=1 -DMKSH_LEGACY_MODE=1 -D_GNU_SOURCE -DSETUID_CAN_FAIL_WITH_EAGAIN=1   conftest.c |     sed -n '/^ *[ce]t *= */s/^ *\([ce]t\) *= */=/p' | tr -d \015 >x
+$ klcc -E -Os -fomit-frame-pointer -mno-sse -falign-functions=1 -falign-jumps=1 -falign-loops=1 -fno-asynchronous-unwind-tables -g -ffile-prefix-map=/build/reproducible-path/mksh-59c=. -Wformat -Werror=format-security -Wall -Wextra -I. -I'../..' -Wdate-time -D_FORTIFY_SOURCE=2 -DMKSH_EARLY_LOCALE_TRACKING -DKSH_VERSIONNAME_VENDOR_EXT=\"\ +Debian\" -DMKSH_BUILDMEAT -DMKSH_BINSHPOSIX -DMKSH_BINSHREDUCED -DMKSH_BUILDSH=1 -DMKSH_LEGACY_MODE=1 -D_GNU_SOURCE -DSETUID_CAN_FAIL_WITH_EAGAIN=1   conftest.c |     sed -n '/^ *[ce]t *= */s/^ *\([ce]t\) *= */\1=/p' | tr -d \\015 >x
 [ ct="gcc"
 [ et="klibc"
 $ klcc -Os -fomit-frame-pointer -mno-sse -falign-functions=1 -falign-jumps=1 -falign-loops=1 -fno-asynchronous-unwind-tables -g -ffile-prefix-map=/build/reproducible-path/mksh-59c=. -Wformat -Werror=format-security -Wall -Wextra  -I. -I'../..' -Wdate-time -D_FORTIFY_SOURCE=2 -DMKSH_EARLY_LOCALE_TRACKING -DKSH_VERSIONNAME_VENDOR_EXT=\"\ +Debian\" -DMKSH_BUILDMEAT -DMKSH_BINSHPOSIX -DMKSH_BINSHREDUCED -DMKSH_BUILDSH=1 -DMKSH_LEGACY_MODE=1 -D_GNU_SOURCE -DSETUID_CAN_FAIL_WITH_EAGAIN=1 -Wl,-z,relro -Wl,-z,now -Wl,--as-needed -static  -v conftest.c 
@@ -5114,7 +5150,7 @@
 | Supported LTO compression algorithms: zlib zstd
 | gcc version 12.2.0 (Debian 12.2.0-14) 
 | COLLECT_GCC_OPTIONS='-D' '__KLIBC__=2' '-D' '__KLIBC_MINOR__=0' '-D' '_BITSIZE=64' '-fno-stack-protector' '-fwrapv' '-fno-PIE' '-fno-builtin-bcmp' '-fcommon' '-ggdb' '-m64' '-nostdinc' '-iwithprefix' 'include' '-D' '__KLIBC__=2' '-D' '__KLIBC_MINOR__=0' '-D' '_BITSIZE=64' '-I' '/usr/lib/klibc/include/arch/x86_64' '-I' '/usr/lib/klibc/include/bits64' '-I' '/usr/lib/klibc/include' '-O' '-Os' '-fomit-frame-pointer' '-mno-sse' '-falign-functions=1' '-falign-jumps=1' '-falign-loops=1' '-fno-asynchronous-unwind-tables' '-g' '-ffile-prefix-map=/build/reproducible-path/mksh-59c=.' '-Wformat=1' '-Werror=format-security' '-Wall' '-Wextra' '-I' '.' '-I' '../..' '-Wdate-time' '-D' '_FORTIFY_SOURCE=2' '-D' 'MKSH_EARLY_LOCALE_TRACKING' '-D' 'KSH_VERSIONNAME_VENDOR_EXT=" +Debian"' '-D' 'MKSH_BUILDMEAT' '-D' 'MKSH_BINSHPOSIX' '-D' 'MKSH_BINSHREDUCED' '-D' 'MKSH_BUILDSH=1' '-D' 'MKSH_LEGACY_MODE=1' '-D' '_GNU_SOURCE' '-D' 'SETUID_CAN_FAIL_WITH_EAGAIN=1' '-v' '-mtune=generic' '-march=x86-64' '-dumpdir' 'a-'
-|  /usr/lib/gcc/x86_64-linux-gnu/12/cc1 -quiet -nostdinc -v -I /usr/lib/klibc/include/arch/x86_64 -I /usr/lib/klibc/include/bits64 -I /usr/lib/klibc/include -I . -I ../.. -imultiarch x86_64-linux-gnu -D __KLIBC__=2 -D __KLIBC_MINOR__=0 -D _BITSIZE=64 -D __KLIBC__=2 -D __KLIBC_MINOR__=0 -D _BITSIZE=64 -D _FORTIFY_SOURCE=2 -D MKSH_EARLY_LOCALE_TRACKING -D KSH_VERSIONNAME_VENDOR_EXT=" +Debian" -D MKSH_BUILDMEAT -D MKSH_BINSHPOSIX -D MKSH_BINSHREDUCED -D MKSH_BUILDSH=1 -D MKSH_LEGACY_MODE=1 -D _GNU_SOURCE -D SETUID_CAN_FAIL_WITH_EAGAIN=1 -iwithprefix include conftest.c -quiet -dumpdir a- -dumpbase conftest.c -dumpbase-ext .c -m64 -mno-sse -mtune=generic -march=x86-64 -ggdb -g -O -Os -Wformat=1 -Werror=format-security -Wall -Wextra -Wdate-time -version -fno-stack-protector -fwrapv -fno-PIE -fno-builtin-bcmp -fcommon -fomit-frame-pointer -falign-functions=1 -falign-jumps=1 -falign-loops=1 -fno-asynchronous-unwind-tables -ffile-prefix-map=/build/reproducible-path/mksh-59c=. -o /tmp/ccaXCygm.s
+|  /usr/lib/gcc/x86_64-linux-gnu/12/cc1 -quiet -nostdinc -v -I /usr/lib/klibc/include/arch/x86_64 -I /usr/lib/klibc/include/bits64 -I /usr/lib/klibc/include -I . -I ../.. -imultiarch x86_64-linux-gnu -D __KLIBC__=2 -D __KLIBC_MINOR__=0 -D _BITSIZE=64 -D __KLIBC__=2 -D __KLIBC_MINOR__=0 -D _BITSIZE=64 -D _FORTIFY_SOURCE=2 -D MKSH_EARLY_LOCALE_TRACKING -D KSH_VERSIONNAME_VENDOR_EXT=" +Debian" -D MKSH_BUILDMEAT -D MKSH_BINSHPOSIX -D MKSH_BINSHREDUCED -D MKSH_BUILDSH=1 -D MKSH_LEGACY_MODE=1 -D _GNU_SOURCE -D SETUID_CAN_FAIL_WITH_EAGAIN=1 -iwithprefix include conftest.c -quiet -dumpdir a- -dumpbase conftest.c -dumpbase-ext .c -m64 -mno-sse -mtune=generic -march=x86-64 -ggdb -g -O -Os -Wformat=1 -Werror=format-security -Wall -Wextra -Wdate-time -version -fno-stack-protector -fwrapv -fno-PIE -fno-builtin-bcmp -fcommon -fomit-frame-pointer -falign-functions=1 -falign-jumps=1 -falign-loops=1 -fno-asynchronous-unwind-tables -ffile-prefix-map=/build/reproducible-path/mksh-59c=. -o /tmp/ccV7yTTM.s
 | GNU C17 (Debian 12.2.0-14) version 12.2.0 (x86_64-linux-gnu)
 | 	compiled by GNU C version 12.2.0, GMP version 6.2.1, MPFR version 4.1.1-p1, MPC version 1.3.1, isl version isl-0.25-GMP
 | 
@@ -5136,12 +5172,12 @@
 | GGC heuristics: --param ggc-min-expand=100 --param ggc-min-heapsize=131072
 | Compiler executable checksum: cc72d2b9b5048fedc2be9051c917b40b
 | COLLECT_GCC_OPTIONS='-D' '__KLIBC__=2' '-D' '__KLIBC_MINOR__=0' '-D' '_BITSIZE=64' '-fno-stack-protector' '-fwrapv' '-fno-PIE' '-fno-builtin-bcmp' '-fcommon' '-ggdb' '-m64' '-nostdinc' '-iwithprefix' 'include' '-D' '__KLIBC__=2' '-D' '__KLIBC_MINOR__=0' '-D' '_BITSIZE=64' '-I' '/usr/lib/klibc/include/arch/x86_64' '-I' '/usr/lib/klibc/include/bits64' '-I' '/usr/lib/klibc/include' '-O' '-Os' '-fomit-frame-pointer' '-mno-sse' '-falign-functions=1' '-falign-jumps=1' '-falign-loops=1' '-fno-asynchronous-unwind-tables' '-g' '-ffile-prefix-map=/build/reproducible-path/mksh-59c=.' '-Wformat=1' '-Werror=format-security' '-Wall' '-Wextra' '-I' '.' '-I' '../..' '-Wdate-time' '-D' '_FORTIFY_SOURCE=2' '-D' 'MKSH_EARLY_LOCALE_TRACKING' '-D' 'KSH_VERSIONNAME_VENDOR_EXT=" +Debian"' '-D' 'MKSH_BUILDMEAT' '-D' 'MKSH_BINSHPOSIX' '-D' 'MKSH_BINSHREDUCED' '-D' 'MKSH_BUILDSH=1' '-D' 'MKSH_LEGACY_MODE=1' '-D' '_GNU_SOURCE' '-D' 'SETUID_CAN_FAIL_WITH_EAGAIN=1' '-v' '-mtune=generic' '-march=x86-64' '-dumpdir' 'a-'
-|  as -v -I /usr/lib/klibc/include/arch/x86_64 -I /usr/lib/klibc/include/bits64 -I /usr/lib/klibc/include -I . -I ../.. --gdwarf-5 --64 -o /tmp/ccLC6kxd.o /tmp/ccaXCygm.s
+|  as -v -I /usr/lib/klibc/include/arch/x86_64 -I /usr/lib/klibc/include/bits64 -I /usr/lib/klibc/include -I . -I ../.. --gdwarf-5 --64 -o /tmp/ccyNlmjB.o /tmp/ccV7yTTM.s
 | GNU assembler version 2.40 (x86_64-linux-gnu) using BFD version (GNU Binutils for Debian) 2.40
 | COMPILER_PATH=/usr/lib/gcc/x86_64-linux-gnu/12/:/usr/lib/gcc/x86_64-linux-gnu/12/:/usr/lib/gcc/x86_64-linux-gnu/:/usr/lib/gcc/x86_64-linux-gnu/12/:/usr/lib/gcc/x86_64-linux-gnu/
 | LIBRARY_PATH=/usr/lib/gcc/x86_64-linux-gnu/12/:/usr/lib/gcc/x86_64-linux-gnu/12/../../../x86_64-linux-gnu/:/usr/lib/gcc/x86_64-linux-gnu/12/../../../../lib/:/lib/x86_64-linux-gnu/:/lib/../lib/:/usr/lib/x86_64-linux-gnu/:/usr/lib/../lib/:/usr/lib/gcc/x86_64-linux-gnu/12/../../../:/lib/:/usr/lib/
 | COLLECT_GCC_OPTIONS='-D' '__KLIBC__=2' '-D' '__KLIBC_MINOR__=0' '-D' '_BITSIZE=64' '-fno-stack-protector' '-fwrapv' '-fno-PIE' '-fno-builtin-bcmp' '-fcommon' '-ggdb' '-m64' '-nostdinc' '-iwithprefix' 'include' '-D' '__KLIBC__=2' '-D' '__KLIBC_MINOR__=0' '-D' '_BITSIZE=64' '-I' '/usr/lib/klibc/include/arch/x86_64' '-I' '/usr/lib/klibc/include/bits64' '-I' '/usr/lib/klibc/include' '-O' '-Os' '-fomit-frame-pointer' '-mno-sse' '-falign-functions=1' '-falign-jumps=1' '-falign-loops=1' '-fno-asynchronous-unwind-tables' '-g' '-ffile-prefix-map=/build/reproducible-path/mksh-59c=.' '-Wformat=1' '-Werror=format-security' '-Wall' '-Wextra' '-I' '.' '-I' '../..' '-Wdate-time' '-D' '_FORTIFY_SOURCE=2' '-D' 'MKSH_EARLY_LOCALE_TRACKING' '-D' 'KSH_VERSIONNAME_VENDOR_EXT=" +Debian"' '-D' 'MKSH_BUILDMEAT' '-D' 'MKSH_BINSHPOSIX' '-D' 'MKSH_BINSHREDUCED' '-D' 'MKSH_BUILDSH=1' '-D' 'MKSH_LEGACY_MODE=1' '-D' '_GNU_SOURCE' '-D' 'SETUID_CAN_FAIL_WITH_EAGAIN=1' '-v' '-mtune=generic' '-march=x86-64' '-dumpdir' 'a.'
-|  /usr/lib/gcc/x86_64-linux-gnu/12/collect2 -plugin /usr/lib/gcc/x86_64-linux-gnu/12/liblto_plugin.so -plugin-opt=/usr/lib/gcc/x86_64-linux-gnu/12/lto-wrapper -plugin-opt=-fresolution=/tmp/ccWfSm0M.res -plugin-opt=-pass-through=-lgcc -plugin-opt=-pass-through=-lgcc_s -plugin-opt=-pass-through=-lc -plugin-opt=-pass-through=-lgcc -plugin-opt=-pass-through=-lgcc_s --build-id --eh-frame-hdr -m elf_x86_64 --hash-style=gnu --as-needed -dynamic-linker /lib64/ld-linux-x86-64.so.2 -pie /usr/lib/gcc/x86_64-linux-gnu/12/../../../x86_64-linux-gnu/Scrt1.o /usr/lib/gcc/x86_64-linux-gnu/12/../../../x86_64-linux-gnu/crti.o /usr/lib/gcc/x86_64-linux-gnu/12/crtbeginS.o -L/usr/lib/gcc/x86_64-linux-gnu/12 -L/usr/lib/gcc/x86_64-linux-gnu/12/../../../x86_64-linux-gnu -L/usr/lib/gcc/x86_64-linux-gnu/12/../../../../lib -L/lib/x86_64-linux-gnu -L/lib/../lib -L/usr/lib/x86_64-linux-gnu -L/usr/lib/../lib -L/usr/lib/gcc/x86_64-linux-gnu/12/../../.. /tmp/ccLC6kxd.o -lgcc --push-state --as-needed -lgcc_s --pop-state -lc -lgcc --push-state --as-needed -lgcc_s --pop-state /usr/lib/gcc/x86_64-linux-gnu/12/crtendS.o /usr/lib/gcc/x86_64-linux-gnu/12/../../../x86_64-linux-gnu/crtn.o
+|  /usr/lib/gcc/x86_64-linux-gnu/12/collect2 -plugin /usr/lib/gcc/x86_64-linux-gnu/12/liblto_plugin.so -plugin-opt=/usr/lib/gcc/x86_64-linux-gnu/12/lto-wrapper -plugin-opt=-fresolution=/tmp/cczNFKzj.res -plugin-opt=-pass-through=-lgcc -plugin-opt=-pass-through=-lgcc_s -plugin-opt=-pass-through=-lc -plugin-opt=-pass-through=-lgcc -plugin-opt=-pass-through=-lgcc_s --build-id --eh-frame-hdr -m elf_x86_64 --hash-style=gnu --as-needed -dynamic-linker /lib64/ld-linux-x86-64.so.2 -pie /usr/lib/gcc/x86_64-linux-gnu/12/../../../x86_64-linux-gnu/Scrt1.o /usr/lib/gcc/x86_64-linux-gnu/12/../../../x86_64-linux-gnu/crti.o /usr/lib/gcc/x86_64-linux-gnu/12/crtbeginS.o -L/usr/lib/gcc/x86_64-linux-gnu/12 -L/usr/lib/gcc/x86_64-linux-gnu/12/../../../x86_64-linux-gnu -L/usr/lib/gcc/x86_64-linux-gnu/12/../../../../lib -L/lib/x86_64-linux-gnu -L/lib/../lib -L/usr/lib/x86_64-linux-gnu -L/usr/lib/../lib -L/usr/lib/gcc/x86_64-linux-gnu/12/../../.. /tmp/ccyNlmjB.o -lgcc --push-state --as-needed -lgcc_s --pop-state -lc -lgcc --push-state --as-needed -lgcc_s --pop-state /usr/lib/gcc/x86_64-linux-gnu/12/crtendS.o /usr/lib/gcc/x86_64-linux-gnu/12/../../../x86_64-linux-gnu/crtn.o
 | COLLECT_GCC_OPTIONS='-D' '__KLIBC__=2' '-D' '__KLIBC_MINOR__=0' '-D' '_BITSIZE=64' '-fno-stack-protector' '-fwrapv' '-fno-PIE' '-fno-builtin-bcmp' '-fcommon' '-ggdb' '-m64' '-nostdinc' '-iwithprefix' 'include' '-D' '__KLIBC__=2' '-D' '__KLIBC_MINOR__=0' '-D' '_BITSIZE=64' '-I' '/usr/lib/klibc/include/arch/x86_64' '-I' '/usr/lib/klibc/include/bits64' '-I' '/usr/lib/klibc/include' '-O' '-Os' '-fomit-frame-pointer' '-mno-sse' '-falign-functions=1' '-falign-jumps=1' '-falign-loops=1' '-fno-asynchronous-unwind-tables' '-g' '-ffile-prefix-map=/build/reproducible-path/mksh-59c=.' '-Wformat=1' '-Werror=format-security' '-Wall' '-Wextra' '-I' '.' '-I' '../..' '-Wdate-time' '-D' '_FORTIFY_SOURCE=2' '-D' 'MKSH_EARLY_LOCALE_TRACKING' '-D' 'KSH_VERSIONNAME_VENDOR_EXT=" +Debian"' '-D' 'MKSH_BUILDMEAT' '-D' 'MKSH_BINSHPOSIX' '-D' 'MKSH_BINSHREDUCED' '-D' 'MKSH_BUILDSH=1' '-D' 'MKSH_LEGACY_MODE=1' '-D' '_GNU_SOURCE' '-D' 'SETUID_CAN_FAIL_WITH_EAGAIN=1' '-v' '-mtune=generic' '-march=x86-64' '-dumpdir' 'a.'
 $ eval echo "\`$CC $CFLAGS $Cg $CPPFLAGS $LDFLAGS $NOWARN $LIBS -dumpmachine\`" \
 		 "gcc\`$CC $CFLAGS $Cg $CPPFLAGS $LDFLAGS $NOWARN $LIBS -dumpversion\`"
@@ -6425,12 +6461,12 @@
 	chmod a-x usr/share/doc/mksh/NEWS.Debian usr/share/doc/mksh/changelog.Debian usr/share/doc/mksh/check.pl usr/share/doc/mksh/check.t usr/share/man/man1/lksh.1 usr/share/man/man1/mksh.1
 	gzip -9nf usr/share/doc/mksh/NEWS.Debian usr/share/doc/mksh/changelog.Debian usr/share/doc/mksh/check.pl usr/share/doc/mksh/check.t usr/share/man/man1/lksh.1 usr/share/man/man1/mksh.1
 	cd '/build/reproducible-path/mksh-59c'
-	rm -f debian/mksh/usr/share/man/man1/rlksh.1 debian/mksh/usr/share/man/man1/rlksh.1.gz
-	ln -s lksh.1.gz debian/mksh/usr/share/man/man1/rlksh.1.gz
 	rm -f debian/mksh/usr/share/man/man1/rmksh.1 debian/mksh/usr/share/man/man1/rmksh.1.gz
 	ln -s mksh.1.gz debian/mksh/usr/share/man/man1/rmksh.1.gz
 	rm -f debian/mksh/usr/share/man/man1/mksh-static.1 debian/mksh/usr/share/man/man1/mksh-static.1.gz
 	ln -s mksh.1.gz debian/mksh/usr/share/man/man1/mksh-static.1.gz
+	rm -f debian/mksh/usr/share/man/man1/rlksh.1 debian/mksh/usr/share/man/man1/rlksh.1.gz
+	ln -s lksh.1.gz debian/mksh/usr/share/man/man1/rlksh.1.gz
    dh_fixperms -O--buildsystem=none
 	find debian/mksh ! -type l -a -true -a -true -print0 2>/dev/null | xargs -0r chmod go=rX,u+rw,a-s
 	find debian/mksh/usr/share/doc -type f -a -true -a ! -regex 'debian/mksh/usr/share/doc/[^/]*/examples/.*' -print0 2>/dev/null | xargs -0r chmod 0644
@@ -6446,6 +6482,11 @@
 	objcopy --compress-debug-sections debian/mksh/usr/lib/debug/.dwz/x86_64-linux-gnu/mksh.debug
 	chmod 0644 -- debian/mksh/usr/lib/debug/.dwz/x86_64-linux-gnu/mksh.debug
    dh_strip -a -O--buildsystem=none
+	install -m0755 -d debian/.debhelper/mksh/dbgsym-root/usr/lib/debug/.build-id/d5
+	objcopy --only-keep-debug --compress-debug-sections debian/mksh/usr/lib/klibc/bin/mksh debian/.debhelper/mksh/dbgsym-root/usr/lib/debug/.build-id/d5/1f903ac0f45efdcecb74b3bbc8ebd60bcf72b5.debug
+	chmod 0644 -- debian/.debhelper/mksh/dbgsym-root/usr/lib/debug/.build-id/d5/1f903ac0f45efdcecb74b3bbc8ebd60bcf72b5.debug
+	strip --remove-section=.comment --remove-section=.note debian/mksh/usr/lib/klibc/bin/mksh
+	objcopy --add-gnu-debuglink debian/.debhelper/mksh/dbgsym-root/usr/lib/debug/.build-id/d5/1f903ac0f45efdcecb74b3bbc8ebd60bcf72b5.debug debian/mksh/usr/lib/klibc/bin/mksh
 dh_strip: warning: Could not find the BuildID in debian/mksh/usr/lib/x86_64-linux-musl/bin/mksh
 	strip --remove-section=.comment --remove-section=.note debian/mksh/usr/lib/x86_64-linux-musl/bin/mksh
 	install -m0755 -d debian/.debhelper/mksh/dbgsym-root/usr/lib/debug/.build-id/51
@@ -6453,11 +6494,6 @@
 	chmod 0644 -- debian/.debhelper/mksh/dbgsym-root/usr/lib/debug/.build-id/51/b46ecd695ab3fe7ff8fda8f5d6fe9e072f57d0.debug
 	strip --remove-section=.comment --remove-section=.note debian/mksh/usr/lib/diet/bin/mksh
 	objcopy --add-gnu-debuglink debian/.debhelper/mksh/dbgsym-root/usr/lib/debug/.build-id/51/b46ecd695ab3fe7ff8fda8f5d6fe9e072f57d0.debug debian/mksh/usr/lib/diet/bin/mksh
-	install -m0755 -d debian/.debhelper/mksh/dbgsym-root/usr/lib/debug/.build-id/d5
-	objcopy --only-keep-debug --compress-debug-sections debian/mksh/usr/lib/klibc/bin/mksh debian/.debhelper/mksh/dbgsym-root/usr/lib/debug/.build-id/d5/1f903ac0f45efdcecb74b3bbc8ebd60bcf72b5.debug
-	chmod 0644 -- debian/.debhelper/mksh/dbgsym-root/usr/lib/debug/.build-id/d5/1f903ac0f45efdcecb74b3bbc8ebd60bcf72b5.debug
-	strip --remove-section=.comment --remove-section=.note debian/mksh/usr/lib/klibc/bin/mksh
-	objcopy --add-gnu-debuglink debian/.debhelper/mksh/dbgsym-root/usr/lib/debug/.build-id/d5/1f903ac0f45efdcecb74b3bbc8ebd60bcf72b5.debug debian/mksh/usr/lib/klibc/bin/mksh
 	install -m0755 -d debian/.debhelper/mksh/dbgsym-root/usr/lib/debug/.build-id/84
 	objcopy --only-keep-debug --compress-debug-sections debian/mksh/bin/lksh debian/.debhelper/mksh/dbgsym-root/usr/lib/debug/.build-id/84/aba6baf61fb2924c8df91bb5da46ed0855ad4d.debug
 	chmod 0644 -- debian/.debhelper/mksh/dbgsym-root/usr/lib/debug/.build-id/84/aba6baf61fb2924c8df91bb5da46ed0855ad4d.debug
@@ -6511,10 +6547,10 @@
 	cd debian/.debhelper/mksh/dbgsym-root >/dev/null && xargs -r0 md5sum | perl -pe 'if (s@^\\@@) { s/\\\\/\\/g; }' > DEBIAN/md5sums
 	chmod 0644 -- debian/.debhelper/mksh/dbgsym-root/DEBIAN/md5sums
    dh_builddeb -O--buildsystem=none
-	dpkg-deb --root-owner-group --build debian/mksh ..
 	dpkg-deb --root-owner-group --build debian/.debhelper/mksh/dbgsym-root ..
-dpkg-deb: building package 'mksh' in '../mksh_59c-28+deb12u1_amd64.deb'.
+	dpkg-deb --root-owner-group --build debian/mksh ..
 dpkg-deb: building package 'mksh-dbgsym' in '../mksh-dbgsym_59c-28+deb12u1_amd64.deb'.
+dpkg-deb: building package 'mksh' in '../mksh_59c-28+deb12u1_amd64.deb'.
    debian/rules execute_after_dh_builddeb-arch
 make[1]: Entering directory '/build/reproducible-path/mksh-59c'
 #-
@@ -6620,12 +6656,14 @@
 dpkg-buildpackage: info: binary-only upload (no source included)
 dpkg-genchanges: info: not including original source code in upload
 I: copying local configuration
+I: user script /srv/workspace/pbuilder/2295609/tmp/hooks/B01_cleanup starting
+I: user script /srv/workspace/pbuilder/2295609/tmp/hooks/B01_cleanup finished
 I: unmounting dev/ptmx filesystem
 I: unmounting dev/pts filesystem
 I: unmounting dev/shm filesystem
 I: unmounting proc filesystem
 I: unmounting sys filesystem
 I: cleaning the build env 
-I: removing directory /srv/workspace/pbuilder/2392442 and its subdirectories
-I: Current time: Wed Jul  3 09:13:16 -12 2024
-I: pbuilder-time-stamp: 1720041196
+I: removing directory /srv/workspace/pbuilder/2295609 and its subdirectories
+I: Current time: Wed Aug  6 17:45:56 +14 2025
+I: pbuilder-time-stamp: 1754451956